{
	"$id": "http://mosip.io/id_object/1.0/id_object.json",
	"$schema": "http://json-schema.org/draft-07/schema#",
	"title": "MOSIP ID schema",
	"description": "Sample ID schema",
	"type": "object",
	"additionalProperties": false,
	"properties": {
		"identity": {
			"title": "identity",
			"description": "This schema holds all the attributes of an Identity",
			"type": "object",
			"additionalProperties": false,
			"properties": {
				"IDSchemaVersion": {
					"type": "number"
				},
				"UIN": {
					"type": "number"
				},
				"fullName": {
					"$ref": "#/definitions/simpleType"
				},
				"dateOfBirth": {
					"$ref": "#/definitions/dateOfBirthType"
				},
				"age": {
					"type": "number"
				},
				"gender": {
					"$ref": "#/definitions/simpleType"
				},
				"addressLine1": {
					"$ref": "#/definitions/simpleType"
				},
				"addressLine2": {
					"$ref": "#/definitions/simpleType"
				},
				"addressLine3": {
					"$ref": "#/definitions/simpleType"
				},
				"region": {
					"$ref": "#/definitions/simpleType"
				},
				"province": {
					"$ref": "#/definitions/simpleType"
				},
				"city": {
					"$ref": "#/definitions/simpleType"
				},
				"postalCode": {
					"$ref": "#/definitions/postalCodeType"
				},
				"phone": {
					"$ref": "#/definitions/phoneType"
				},
				"email": {
					"$ref": "#/definitions/emailType"
				},
				"residenceStatus": {
					"$ref": "#/definitions/simpleType"
				},
				"CNIENumber": {
					"$ref": "#/definitions/CNIENumberType"
				},
				"localAdministrativeAuthority": {
					"$ref": "#/definitions/simpleType"
				},
				"parentOrGuardianName": {
					"$ref": "#/definitions/simpleType"
				},
				"parentOrGuardianRIDOrUIN": {
					"type": "number"
				},
				"proofOfAddress": {
					"$ref": "#/definitions/documentType"
				},                               
				"proofOfIdentity": {
					"$ref": "#/definitions/documentType"
				},
				"proofOfRelationship": {
					"$ref": "#/definitions/documentType"
				},
				"proofOfDateOfBirth": {
					"$ref": "#/definitions/documentType"
				},
				"individualBiometrics": {
					"$ref": "#/definitions/biometricsType"
				},
				"parentOrGuardianBiometrics": {
					"$ref": "#/definitions/biometricsType"
				}
			}
		}
	},
	"definitions": {
		"simpleType": {
			"type": "array",
			"additionalItems": false,
			"uniqueItems": true,
			"items": {
				"type": "object",
				"required": [
					"language",
					"value"
				],
				"additionalProperties": false,
				"properties": {
					"language": {
						"type": "string",
						"pattern": "^[(?i)a-z]{3}$"
					},
					"value": {
						"type": "string"
					}
				}
			}
		},
		"dateOfBirthType": {
			"type": "string",
			"pattern": "^\\d{4}/([0]\\d|1[0-2])/([0-2]\\d|3[01])$"
		},
		"phoneType": {		
			"type": "string",
			"pattern": "^([6-9]{1})([0-9]{9})$"
		},
		"postalCodeType": {		
			"type": "string",
			"pattern": "^[(?i)A-Z0-9]{6}$"
		},
		"emailType": {
			"type": "string",
			"pattern": "^[\\w-\\+]+(\\.[\\w]+)*@[\\w-]+(\\.[\\w]+)*(\\.[a-z]{2,})$"
		},
		"CNIENumberType": {
			"type": "string",
			"pattern": "^([0-9]{10,30})$"
		},
		"documentType": {
			"type": "object",
			"properties": {
				"format": {
					"type": "string"
				},
				"type": {
					"type": "string"
				},
				"fileReference": {
					"type": "string"
				}
			}
		},
		"biometricsType": {
			"type": "object",
			"properties": {
				"format": {
					"type": "string"
				},
				"version": {
					"type": "number"
				},
				"fileReference": {
					"type": "string"
				}
			}
		}
	}
}
