{
  "tenantId": "pg.cityb",
  "moduleName": "rainmaker-pgr",
  "ServiceDefs": [
    {
      "serviceCode": "MEDICINENOTAVAILABLE",
      "name": "Medicine Not Available",
      "keywords": "medicine, availability, stock",
      "department": "Mosquitos",
      "slaHours": 336,
      "menuPath": "Health",
      "active": true,
      "order": 1
    }
  ]
}