<?xml version="1.0" encoding="UTF-8" standalone="no"?>
<svg
   viewBox="0 0 2371.8359 413.12615"
   version="1.1"
   id="svg13789"
   sodipodi:docname="logo.svg"
   xml:space="preserve"
   width="2371.8359"
   height="413.12616"
   inkscape:version="1.2.1 (9c6d41e410, 2022-07-14)"
   inkscape:export-filename="logo.png"
   inkscape:export-xdpi="96"
   inkscape:export-ydpi="96"
   xmlns:inkscape="http://www.inkscape.org/namespaces/inkscape"
   xmlns:sodipodi="http://sodipodi.sourceforge.net/DTD/sodipodi-0.dtd"
   xmlns="http://www.w3.org/2000/svg"
   xmlns:svg="http://www.w3.org/2000/svg"><defs
     id="defs13793"><rect
       x="151.87215"
       y="54.842724"
       width="95.733765"
       height="27.97599"
       id="rect3523-7" /><rect
       x="151.87215"
       y="54.842724"
       width="95.733765"
       height="27.97599"
       id="rect3523" /><rect
       x="151.87215"
       y="54.842724"
       width="95.733765"
       height="27.97599"
       id="rect8035" /><rect
       x="151.87215"
       y="54.842724"
       width="95.733765"
       height="27.97599"
       id="rect3523-7-7" /><rect
       x="151.87215"
       y="54.842724"
       width="95.733765"
       height="27.97599"
       id="rect8035-8" /><rect
       x="151.87215"
       y="54.842724"
       width="140.59602"
       height="27.320986"
       id="rect3523-3" /><rect
       x="151.87215"
       y="54.842724"
       width="95.733765"
       height="27.97599"
       id="rect3523-1" /><rect
       x="151.87215"
       y="54.842724"
       width="95.733765"
       height="27.97599"
       id="rect3523-1-6" /><rect
       x="151.87215"
       y="54.842724"
       width="95.733765"
       height="27.97599"
       id="rect3523-1-4" /><rect
       x="151.87215"
       y="54.842724"
       width="95.733765"
       height="27.97599"
       id="rect3523-1-6-7" /><rect
       x="151.87215"
       y="54.842724"
       width="250.45595"
       height="25.610176"
       id="rect3523-3-2" /></defs><sodipodi:namedview
     id="namedview13791"
     pagecolor="#ffffff"
     bordercolor="#000000"
     borderopacity="0.25"
     inkscape:showpageshadow="2"
     inkscape:pageopacity="0.0"
     inkscape:pagecheckerboard="0"
     inkscape:deskcolor="#d1d1d1"
     showgrid="false"
     inkscape:zoom="0.32593203"
     inkscape:cx="1233.386"
     inkscape:cy="225.50714"
     inkscape:current-layer="svg13789" /><rect
     style="fill:none;fill-opacity:1;stroke:none;stroke-width:1.06194"
     id="rect22604"
     width="2371.8359"
     height="413.12616"
     x="0"
     y="0" /><!--! Font Awesome Pro 6.2.1 by @fontawesome - https://fontawesome.com License - https://fontawesome.com/license (Commercial License) Copyright 2022 Fonticons, Inc.--><path
     d="m 1571.0141,229.40966 c 12.2909,0 23.1358,-10.12191 23.1358,-23.20808 0.723,-6.50694 -2.169,-12.29088 -7.953,-17.35183 l -38.174,-33.61918 V 67.748422 c 0,-12.796976 -10.3388,-23.135776 -23.1358,-23.135776 h -23.1357 c -12.797,0 -23.1358,10.3388 -23.1358,23.135776 V 94.28226 l -76.9988,-67.744439 c -4.3379,-3.614965 -10.1219,-5.060951 -15.1828,-5.060951 -5.061,0 -10.8449,0.722993 -15.9059,5.783944 L 1185.0804,188.84975 c -5.0609,5.06095 -7.2299,10.84489 -7.2299,17.35183 0,13.01387 10.1219,23.20808 23.1358,23.20808 h 23.1358 v 50.39261 c -0.072,0.65069 -0.072,1.30138 -0.072,2.02438 v 80.90291 c 0,15.97815 12.9415,28.91972 28.9197,28.91972 88.2001,-0.19808 177.9706,0 266.1337,0 15.9781,0 28.9197,-12.94157 28.9197,-28.91972 v -11.71248 c 0.2169,-1.87978 0.3615,-3.83187 0.3615,-5.85625 l -0.5061,-115.82347 h 23.1358 z"
     id="path13787"
     inkscape:label="path13787"
     sodipodi:nodetypes="ccccssssccsccssccssccsccccc"
     style="fill:#02e6cf;fill-opacity:1;stroke-width:0.722993" /><text
     xml:space="preserve"
     style="font-style:normal;font-variant:normal;font-weight:normal;font-stretch:normal;font-size:240px;font-family:'Arial Rounded MT Bold';-inkscape-font-specification:'Arial Rounded MT Bold, ';fill:#02998a;fill-opacity:1"
     x="0.31937218"
     y="336.97992"
     id="text14625"><tspan
       sodipodi:role="line"
       id="tspan14623"
       x="0.31937218"
       y="336.97992"
       style="font-style:normal;font-variant:normal;font-weight:normal;font-stretch:normal;font-size:240px;font-family:'Arial Rounded MT Bold';-inkscape-font-specification:'Arial Rounded MT Bold, '">COWORK</tspan></text><text
     xml:space="preserve"
     style="font-style:normal;font-variant:normal;font-weight:normal;font-stretch:normal;font-size:226.667px;font-family:'Arial Rounded MT Bold';-inkscape-font-specification:'Arial Rounded MT Bold, ';fill:#ffffff;fill-opacity:1"
     x="1273.2118"
     y="309.68509"
     id="text14625-0"><tspan
       sodipodi:role="line"
       id="tspan14623-3"
       x="1273.2118"
       y="309.68509"
       style="font-style:normal;font-variant:normal;font-weight:normal;font-stretch:normal;font-size:226.667px;font-family:'Arial Rounded MT Bold';-inkscape-font-specification:'Arial Rounded MT Bold, ';fill:#ffffff;fill-opacity:1">@</tspan></text><text
     xml:space="preserve"
     style="font-style:normal;font-variant:normal;font-weight:normal;font-stretch:normal;font-size:240px;font-family:'Arial Rounded MT Bold';-inkscape-font-specification:'Arial Rounded MT Bold, ';fill:#02998a;fill-opacity:1"
     x="1636.048"
     y="328.09189"
     id="text14625-1"><tspan
       sodipodi:role="line"
       id="tspan14623-2"
       x="1636.048"
       y="328.09189"
       style="font-style:normal;font-variant:normal;font-weight:normal;font-stretch:normal;font-size:240px;font-family:'Arial Rounded MT Bold';-inkscape-font-specification:'Arial Rounded MT Bold, '">HOME</tspan></text></svg>
