<?xml version="1.0" encoding="utf-8"?>
<!-- Generator: Adobe Illustrator 23.0.3, SVG Export Plug-In . SVG Version: 6.00 Build 0)  -->
<svg version="1.1" id="Capa_1" xmlns="http://www.w3.org/2000/svg" xmlns:xlink="http://www.w3.org/1999/xlink" x="0px" y="0px"
	 viewBox="0 0 512 512" style="enable-background:new 0 0 512 512;" xml:space="preserve">
<style type="text/css">
	.st0{fill:#FECA38;}
</style>
<g>
	<circle class="st0" cx="256.5" cy="255.5" r="255.5"/>
</g>
<g id="Page-1">
	<g transform="translate(-1)">
		<path id="Shape" d="M150.1,311.7c7.7,33.2,21.9,64.4,42,91.9c7,9.9,116.8,9.9,123.7,0c20-27.5,34.3-58.7,42-91.9
			c15.1-11.2,18.9-27.6,15.1-46c-3.5-13.9-9.3-27-17.2-39c0-4-1-8-2.9-11.5c-6.4-15.3-27.3-31.8-43.5-39.8c5.2-13,3.6-27.8-4.3-39.4
			c-7.7-10.2-20.9-14.6-33.2-11c7.6-19.7,20.9-22,38.9-11.2c2.5,1.4,5.6,0.6,7.1-1.9c1.5-2.4,0.7-5.6-1.7-7.1
			c-25.4-15.2-44.5-7.3-53.7,15.7c-7.7-9.3-20.1-13.2-31.7-10c-22.2,6.2-37.5,34.8-23.8,63.3c-23.6,9.9-52.1,28-58.5,52.7
			c-0.6,2.6-0.8,5.3-0.5,8C132.3,261.9,124.7,292.8,150.1,311.7L150.1,311.7z M308.2,396.2c-18.8,5.8-89.7,5.8-108.4,0
			c-16.8-23.6-29.4-49.9-37.3-77.8c18.6,7,43.4,6.2,57.9-9c0.5-0.5,0.9-1,1.2-1.6c6.3,12,18.7,19.5,32.3,19.5
			c13.5,0,26-7.5,32.3-19.4c13.8,16.4,39.5,18.1,59.3,10.6C337.6,346.3,325,372.6,308.2,396.2z M222.9,126.6
			c14-12.4,29.7-5.6,33.7,4.7c1.2,2.8,3.5,5,6.4,6c2.9,1,6.1,0.7,8.7-0.9c8.6-4.3,19.1-1.8,24.8,5.9c2.4,3.3,4,7.2,4.7,11.3
			c3.2,16.8-6.8,32.7-24,39.6c-11.2,0.7-22.4,0.8-33.6,0.3C212,182.3,202.3,145.2,222.9,126.6L222.9,126.6z M158.4,229
			c5.5-21.3,33.5-37.9,53.8-46.2c2.3,3.2,5,6.1,7.9,8.7c-1.2-0.2-1.8-0.3-1.9-0.3c-2.9-0.5-5.5,1.5-6,4.3c-0.5,2.9,1.5,5.5,4.3,6
			c26.8,3.6,53.9,3.7,80.7,0.2c2.4-0.3,4.3-2.2,4.5-4.6c0.3-2.4-1.1-4.6-3.4-5.5c2.2-2.1,4.2-4.5,6-7c15.6,7.6,35.8,22.9,41,39.7
			c-13-3.5-20.5-7.8-27.6-3.7c-9.9,5.9-4.4,18.9-4,23.7c0.3,3.3-0.6,6.5-2.7,9.1c-0.3,0.2-0.7,0.6-2.1,0.1
			c-7.5-2.4-10.9-29.6-30.7-34.7c-8.4-2.5-17.4,1.2-21.6,8.9c-4.3,8.9,0.5,16.8-1.4,22.8c-0.6,2.1-2.4,3.7-4.5,4.1
			c-1.7,0.2-3.4-0.8-4.1-2.4c-0.7-2.4,1.3-6.5,1.8-11.1c1.1-10.4-5.6-20-15.7-22.7c-8.5-1.8-17.2,1.7-21.9,9
			c-8.8,13.7,4.1,29.8-0.7,38.1c-1.5,2.7-4.6,4-7.6,3.4c-3-0.6-5.3-3.1-5.6-6.1c-0.9-6.9,7.7-16.5,3.7-26.9
			c-4-10.4-18.6-14.8-29.9-4.5c-3.1,2.9-6.3,6.8-8.6,7.1C159.8,239.1,156.8,235.5,158.4,229z M153.3,246.1c2.9,2.5,6.7,3.6,10.4,3
			c4.6-1.2,8.8-3.8,11.8-7.6c2.4-3.3,6.2-5.3,10.3-5.2c2.2,0.3,4,1.6,4.9,3.6c2.1,5.6-5.5,14.4-4.3,24.5c0.9,7.5,6.6,13.5,14,15
			c7.4,1.5,14.9-1.9,18.7-8.4c7.8-13.4-5.2-28.8,0.5-37.7c2.4-3.5,6.6-5.3,10.7-4.5c4.9,1.4,8.2,6.1,7.7,11.3
			c-1.7,4.9-2.2,10.1-1.5,15.2c2.1,6.5,8.5,10.6,15.4,9.8c6.3-0.9,11.5-5.3,13.3-11.4c2.6-8.3-1.5-16.6,0.8-21.4
			c2.1-3.1,6-4.4,9.5-3.3c9.9,2.6,14.3,15.6,19.4,24.5c6.7,11.8,16.5,13,22.5,8.3c4.9-4.7,7.3-11.4,6.7-18.1
			c-0.2-1.8-0.5-3.5-0.9-5.2c-2.8-13.3-0.5-9.2,19.5-3.9c1.8,0.5,3.7,0.5,5.5,0.1c6.6,10.2,11.4,21.4,14.4,33.1
			c3.7,17.8-1.6,32.1-18.1,39.7c-15.9,7.2-39.1,7.1-50.4-6.4c-2.2-2.6-5.6-4-9-3.6s-6.4,2.3-8.1,5.3c-4.3,8.8-13.3,14.3-23.2,14
			c-9.8,0.3-18.9-5.2-23.2-14c-1.6-3-4.7-5-8.1-5.4c-3.4-0.3-6.8,1-9,3.6c-11.2,13.4-34.4,13.6-50.4,6.4
			C138.2,296.1,140.9,270.6,153.3,246.1L153.3,246.1z"/>
		<path d="M201.4,336.1c-0.6-1.8-2.1-3.1-3.9-3.5s-3.7,0.3-5,1.7c-1.2,1.4-1.6,3.4-1.1,5.1c0.4,1.3,10.8,32.3,21.6,48.4
			c1,1.6,2.8,2.4,4.7,2.3c1.9-0.1,3.5-1.2,4.4-2.9s0.7-3.7-0.3-5.2C211.7,367,201.5,336.4,201.4,336.1z"/>
		<path d="M238.3,337.8c-2.9,0-5.2,2.3-5.2,5.2v36.6c0,2.9,2.3,5.2,5.2,5.2s5.2-2.3,5.2-5.2V343
			C243.5,340.1,241.2,337.8,238.3,337.8z"/>
		<path d="M313.2,332.8c-1.3-0.4-2.8-0.3-4,0.3c-1.2,0.6-2.2,1.7-2.6,3c-0.1,0.3-10.4,30.9-20.3,45.9c-1,1.6-1.2,3.5-0.3,5.2
			s2.5,2.8,4.4,2.9c1.9,0.1,3.7-0.8,4.7-2.3c10.7-16.1,21.1-47.1,21.6-48.4c0.4-1.3,0.3-2.8-0.3-4S314.5,333.2,313.2,332.8
			L313.2,332.8z"/>
		<path d="M269.7,337.8c-2.9,0-5.2,2.3-5.2,5.2v36.6c0,2.9,2.3,5.2,5.2,5.2c2.9,0,5.2-2.3,5.2-5.2V343
			C274.9,340.1,272.6,337.8,269.7,337.8z"/>
		<path d="M224.4,148.5c2.7,1,5.7-0.4,6.7-3.1c0.6-1.8,1.5-3.5,2.9-4.9c0.8-0.8,1.8-1.3,2.9-1.3c1.9,0.3,3.8-0.4,5-1.9
			c1.2-1.5,1.5-3.5,0.8-5.2c-0.7-1.8-2.3-3-4.2-3.3c-4.3-0.5-8.7,1-11.8,4.1c-2.5,2.5-4.3,5.5-5.4,8.8
			C220.4,144.4,221.7,147.4,224.4,148.5z"/>
	</g>
</g>
</svg>
