<?xml version="1.0" encoding="utf-8"?>
<!-- Generator: Adobe Illustrator 23.0.3, SVG Export Plug-In . SVG Version: 6.00 Build 0)  -->
<svg version="1.1" id="Capa_1" xmlns="http://www.w3.org/2000/svg" xmlns:xlink="http://www.w3.org/1999/xlink" x="0px" y="0px"
	 viewBox="0 0 512.3 512.3" style="enable-background:new 0 0 512.3 512.3;" xml:space="preserve">
<style type="text/css">
	.st0{fill:#FECA38;}
	.st1{fill:#CCD6DD;}
</style>
<path class="st0" d="M256.5,505.5c-66.8,0-129.6-26-176.8-73.2S6.5,322.3,6.5,255.5s26-129.6,73.2-176.8
	c47.2-47.2,110-73.2,176.8-73.2s129.6,26,176.8,73.2s73.2,110,73.2,176.8s-26,129.6-73.2,176.8C386.1,479.5,323.3,505.5,256.5,505.5
	z"/>
<g>
	<path class="st1" d="M256.5,6c33.7,0,66.4,6.6,97.1,19.6c29.7,12.6,56.4,30.6,79.3,53.5c22.9,22.9,40.9,49.6,53.5,79.3
		c13,30.8,19.6,63.4,19.6,97.1s-6.6,66.4-19.6,97.1c-12.6,29.7-30.6,56.4-53.5,79.3c-22.9,22.9-49.6,40.9-79.3,53.5
		c-30.8,13-63.4,19.6-97.1,19.6s-66.4-6.6-97.1-19.6c-29.7-12.6-56.4-30.6-79.3-53.5c-22.9-22.9-40.9-49.6-53.5-79.3
		C13.6,321.9,7,289.2,7,255.5s6.6-66.4,19.6-97.1c12.6-29.7,30.6-56.4,53.5-79.3c22.9-22.9,49.6-40.9,79.3-53.5
		C190.1,12.6,222.8,6,256.5,6 M256.5,5C118.2,5,6,117.2,6,255.5S118.2,506,256.5,506S507,393.8,507,255.5S394.8,5,256.5,5L256.5,5z"
		/>
</g>
<g>
	<path d="M375.8,137h-30.4c-11.8,0-21.3,9.6-21.3,21.3v140c0,11.8,9.6,21.3,21.3,21.3h30.4c11.8,0,21.3-9.6,21.3-21.3v-140
		C397.1,146.6,387.6,137,375.8,137z"/>
	<path d="M241.5,408c12.2,0,18.3-6.1,18.3-36.5c0-28.9,28-52.2,46-64.2V156.4c-19.5-9-58.5-22.4-119.1-22.4h-19.5
		c-23.7,0-44,17-48,40.4l-13.6,79.2c-5.1,29.8,17.8,57,48,57H211c0,0-9.1,18.3-9.1,48.7C201.9,395.8,229.3,408,241.5,408L241.5,408z
		"/>
</g>
</svg>
