<?xml version="1.0" encoding="utf-8"?>
<!-- Generator: Adobe Illustrator 23.0.3, SVG Export Plug-In . SVG Version: 6.00 Build 0)  -->
<svg version="1.1" id="Capa_1" xmlns="http://www.w3.org/2000/svg" xmlns:xlink="http://www.w3.org/1999/xlink" x="0px" y="0px"
	 viewBox="0 0 512 512" style="enable-background:new 0 0 512 512;" xml:space="preserve">
<style type="text/css">
	.st0{fill:#FECA38;}
</style>
<g>
	<circle class="st0" cx="256.5" cy="255.5" r="255.5"/>
</g>
<g>
	<path d="M381.5,256H377c0-24-18.9-43.8-42.8-44.9c-1.9-5.4-4.9-10.4-8.9-14.5l45.3-31.3c2-1.4,2.6-4.2,1.1-6.3
		c-0.5-0.7-1.1-1.2-1.8-1.5l-67.5-31.5c-2.3-1.1-4.9-0.1-6,2.2c-0.4,0.8-0.5,1.6-0.4,2.5l6.7,54c-20.9-3.6-40.9,9.6-46,30.1
		c-3.3-1.7-6.8-2.9-10.5-3.4c-2-19-17-34-36-36l13.6-57.7c0.3-1.5-0.1-3-1.1-4.1c-1-1.1-2.6-1.6-4-1.3l-76.5,13.5
		c-2.4,0.4-4.1,2.8-3.6,5.2c0.2,0.9,0.5,1.6,1.1,2.3l44.7,48.2c-10.5,6.6-17.4,17.6-18.7,29.9c-23.1,2.2-40.7,21.6-40.7,44.8h-4.5
		c-2.5,0-4.5,2-4.5,4.5v27c0,2.5,2,4.5,4.5,4.5h13.8c2.7,39.2,39.4,64.1,49.2,70.1v15.4c0,2.5,2,4.5,4.5,4.5h126
		c2.5,0,4.5-2,4.5-4.5v-15.4c9.9-6,46.6-30.8,49.2-70.1h13.8c2.5,0,4.5-2,4.5-4.5v-27C386,258,384,256,381.5,256z M306,137.5
		l53,24.7L318,190.6c-1.9-1.2-3.8-2.3-5.8-3.1L306,137.5z M151.9,133l61.6-10.9L201,175.3c-2.7,0.3-5.4,1-8.1,1.9L151.9,133z
		 M170,220c2.5,0,4.5-2,4.5-4.5c0-17.4,14.1-31.5,31.5-31.5s31.5,14.1,31.5,31.5c0,2.5,2,4.5,4.5,4.5c5.6,0,11,2.1,15.1,5.8
		c1.8,1.7,4.7,1.5,6.4-0.3c0.7-0.8,1.1-1.7,1.2-2.8c0.9-17.3,15.8-30.6,33.1-29.7c13.7,0.7,25.4,10.3,28.8,23.6
		c0.5,2,2.4,3.4,4.5,3.4l1.1-0.1c19.9,0,36,16.1,36,36H134C134,236.1,150.1,220,170,220L170,220z M147.7,310h206.6
		c-1.3,3.1-2.8,6.1-4.5,9H152.2C150.5,316.1,149,313.1,147.7,310z M312.8,355h-21.3v9h18v9h-117v-9H251v-9h-61.8
		c-11.8-7.2-22.2-16.3-30.8-27h185.2C335,338.7,324.5,347.8,312.8,355z M357.3,301H144.7c-0.8-3-1.3-6-1.5-9h215.6
		C358.5,295,358,298,357.3,301z M377,283H125v-18h252V283z"/>
	<path d="M174.5,238c-2.5,0-4.5-2-4.5-4.5h-9c0,7.5,6,13.5,13.5,13.5c7.5,0,13.5-6,13.5-13.5l0,0h-9C179,236,177,238,174.5,238z"/>
	<path d="M305,220c-2.5,0-4.5-2-4.5-4.5h-9c0,7.5,6,13.5,13.5,13.5s13.5-6,13.5-13.5h-9C309.5,218,307.5,220,305,220z"/>
	<path d="M210.5,197.5c-7.5,0-13.5,6-13.5,13.5h9c0-2.5,2-4.5,4.5-4.5s4.5,2,4.5,4.5h9C224,203.5,218,197.5,210.5,197.5z"/>
	<path d="M273.5,233.5c-7.5,0-13.5,6-13.5,13.5h9c0-2.5,2-4.5,4.5-4.5s4.5,2,4.5,4.5h9C287,239.5,281,233.5,273.5,233.5z"/>
	<path d="M210.5,224.5h9v9h-9V224.5z"/>
	<path d="M327.5,233.5h9v9h-9V233.5z"/>
	<path d="M174.5,139h9v9h-9V139z"/>
	<path d="M188,152.5h9v9h-9V152.5z"/>
	<path d="M327.5,161.5h9v9h-9V161.5z"/>
	<path d="M318.5,152.5h9v9h-9V152.5z"/>
</g>
</svg>
