<?xml version="1.0" encoding="utf-8"?>
<!-- Generator: Adobe Illustrator 23.0.3, SVG Export Plug-In . SVG Version: 6.00 Build 0)  -->
<svg version="1.1" id="Capa_1" xmlns="http://www.w3.org/2000/svg" xmlns:xlink="http://www.w3.org/1999/xlink" x="0px" y="0px"
	 viewBox="0 0 512 512" style="enable-background:new 0 0 512 512;" xml:space="preserve">
<style type="text/css">
	.st0{fill:#FECA38;}
</style>
<g>
	<circle class="st0" cx="256.5" cy="255.5" r="255.5"/>
</g>
<g>
	<path d="M385.5,312.4c9-12.4,13.4-27.3,12.8-42.2c-0.1-2.4-2.1-4.2-4.4-4.1c-2.4,0.1-4.2,2.1-4.1,4.4c0.1,3.2,0,6.4-0.4,9.7
		c-8.1-9.9-21.5-13.6-34.2-13.5c-0.8-3.3-2.3-6.4-4.4-9.2c4.2-4.9,15.8-14.9,34.8-7.1c0.6,1.4,1.1,2.9,1.6,4.3
		c0.7,2.3,3.1,3.5,5.4,2.8c2.3-0.7,3.5-3.1,2.8-5.4c-2.8-8.8-7.5-17.1-13.8-24.2c-15.5-17.5-44.6-6.5-44.6,17
		c0,6.2,2.3,12.2,6.4,16.9c2.6,2.9,4.1,6.8,4.1,10.8c0,17.1-23.2,22.8-31,7.1c-2.1-4.5-5.6-8-9.8-10.1c4.9-8.3,12.1-27.5-0.4-56.4
		c-2.5-5.7-10.5-5.6-12.5,0.3l-5.2,15.3c-1.8-3.9-4.5-8.7-8.2-14.6c-3-4.7-10.2-3.9-11.9,1.5c-6.4,19.3-7.5,36.2,2.7,56.2
		c-4.9,4.7-6.9,11.7-5.1,18.3c0.2,0.7,0.4,1.3,0.6,2l-31.6-9.1c-1.9-14.2-11.1-26.6-24.6-32.7c-6.3-2.9-7.7-7-9.3-11.4
		c-1.8-5.1-4-11.5-13.3-13.1c-16.1-2.7-16.7,11.5-28,14.5c-11.2,2.9-19.4-9.5-31.7,1.3c-11.1,9.7,0.7,19.3-2,28.3
		c-2.8,9-16.4,9.3-14.5,23.5c1.8,12.9,12.4,12.6,17.9,17.4h-4.7c-10.5,0-19,8.5-19,19c0,10.5,8.5,19,19,19h14.2l42.1,38.8
		c3.7,3.4,8.5,5.3,13.5,5.3h114.6c5.1,0,9.9-1.9,13.6-5.4l41.5-38.7h14c10.5,0,19-8.5,19-19C397.1,322.1,392.3,315.3,385.5,312.4
		L385.5,312.4z M346.1,250c-3.3-11,5-21.9,16.4-21.9c8.2,0,12.8,5.1,17.2,11.7C366.6,237.2,354.8,241.3,346.1,250z M355.7,275.3
		c13.1,0.1,26.1,4.6,30.7,17c-2.4,6.8-6,13.1-10.7,18.6h-31.7c-3.2-6-4.1-11.7-4.2-14.9C348.8,292.6,354.8,284.5,355.7,275.3
		L355.7,275.3z M315.9,292.6c4.4,3.3,9.7,5.2,15.4,5.1c0.3,3.4,1.1,8.1,3.2,13.3h-30.9C307.4,299.5,313.2,294.4,315.9,292.6z
		 M308.5,283.5c0.4,0.9,1,1.9,1.6,2.8c-4.4,3.4-11.4,10.6-15.4,24.6h-8.5c-8.5-10-12.3-22-12.3-25.4c0-5.7,4.7-10.3,10.6-10.1
		l12.5,0.5C301.8,276,306.3,279,308.5,283.5z M275.1,222.4c8,13.2,9,19.3,9,19.9c0,4.6,6.8,5.8,8.3,1.1l7.5-22.2
		c9.6,26.1,1,41.6-2.2,46.1c-15.2-1-17.2-0.4-19.5,0.4C268.6,248.1,272.1,232.3,275.1,222.4L275.1,222.4z M119.9,292.4
		c-0.5-3.7,0.8-4.9,4.6-7.8c3.4-2.6,7.6-5.7,9.5-12.1c1.9-6.3,0.2-11.4-1.2-15.6c-1.7-5.2-1.9-6.5,0.6-8.7c3.7-3.3,6-2.7,11.3-0.9
		c4.4,1.5,9.9,3.3,17,1.5c7.2-1.9,11-6.1,14.1-9.5c3.4-3.8,5.2-5.7,10.3-4.8c4.1,0.7,4.9,2.5,6.7,7.4c1.7,4.8,4.1,12.1,13.8,16.4
		c9.6,4.4,16.4,12.6,18.9,22.3c-11-3.2-20.7,1.6-25.5,9.7l-8.3,13.8c-2.4-2.1-4.8-4.4-7.1-6.7l1.5-1.4c4.9-4.3,6.3-11.3,3.6-17.1
		l-3.1-6.6c-1-2.1-3.6-3.1-5.7-2c-2.1,1-3.1,3.6-2,5.7l3.1,6.6c1.1,2.4,0.5,5.3-1.5,7l-1.9,1.7c-13.3-14-24.4-28.5-24.6-28.7
		c-1.4-1.9-4.1-2.2-6-0.8c-1.9,1.4-2.2,4.1-0.8,6c0.4,0.6,5.6,7.2,13,15.8l-2,1.7c-2,1.7-4.9,2-7.1,0.5l-6.1-4
		c-2-1.3-4.6-0.7-5.9,1.3c-1.3,2-0.7,4.6,1.3,5.9c6.2,4,8.7,6.3,14,6.3c6.1,0,9.3-3.3,11.6-5.3c6.3,7,13.6,14.6,20.7,20.9H140
		C132.7,297.3,121.2,301.7,119.9,292.4L119.9,292.4z M316.8,381.4c-2.1,2-4.8,3-7.7,3H194.4c-2.8,0-5.6-1.1-7.7-3L151.5,349h200
		L316.8,381.4z M378.1,340.4H124.6c-5.8,0-10.4-4.7-10.4-10.4c0-5.8,4.7-10.4,10.4-10.4h101.5c2.4,0,4.3-1.9,4.3-4.3
		s-1.9-4.3-4.3-4.3h-28.5l9.9-16.3c3.1-5.2,9.3-7.7,15.1-6c9.3,2.7,0.8,0.2,47.8,13.8c1.4,3,3.1,5.8,4.9,8.5h-32.1
		c-2.4,0-4.3,1.9-4.3,4.3s1.9,4.3,4.3,4.3h134.8c5.8,0,10.4,4.7,10.4,10.4C388.5,335.7,383.9,340.4,378.1,340.4L378.1,340.4z"/>
	<path d="M171.9,189h158.8c2.4,0,4.3-1.9,4.3-4.3c0-46.2-37.6-83.7-83.7-83.7s-83.7,37.6-83.7,83.7C167.7,187.1,169.6,189,171.9,189
		z M196.4,180.4c0.9-12,5.7-22.9,13.1-31.5l31.5,31.5H196.4z M247.1,174.4l-31.5-31.5c8.6-7.4,19.5-12.1,31.5-13.1L247.1,174.4
		L247.1,174.4z M261.7,180.4l31.5-31.5c7.5,8.8,12.2,19.8,13.1,31.5H261.7z M251.4,109.6c40,0,72.8,31.4,75,70.8h-11.5
		c-1.4-20.6-13-39.6-30.9-50.4c-2-1.2-4.7-0.6-5.9,1.5s-0.6,4.7,1.5,5.9c2.7,1.6,5.2,3.4,7.6,5.5l-31.5,31.5v-44.6
		c3.1,0.2,6.3,0.7,9.3,1.5c2.3,0.6,4.6-0.8,5.2-3.1c0.6-2.3-0.8-4.6-3.1-5.2c-38.8-9.9-76.6,18.2-79.2,57.4h-11.5
		C178.6,141,211.4,109.6,251.4,109.6L251.4,109.6z"/>
	<path d="M216.8,200.7c-2.3,0.4-3.9,2.6-3.5,5l1.9,11.1c0.4,2.1,2.2,3.6,4.2,3.6c2.7,0,4.7-2.4,4.2-5l-1.9-11.1
		C221.4,201.9,219.2,200.3,216.8,200.7L216.8,200.7z"/>
	<path d="M250.5,218.1c1.4,0,2.7-0.7,3.6-1.9l6.3-9.3c1.3-2,0.8-4.6-1.2-6c-2-1.3-4.6-0.8-6,1.2l-6.3,9.3
		C245,214.3,247.1,218.1,250.5,218.1L250.5,218.1z"/>
	<path d="M243.9,238c-2.3-0.7-4.7,0.6-5.3,2.9l-3.2,10.8c-0.8,2.7,1.2,5.5,4.1,5.5c1.8,0,3.6-1.2,4.1-3.1l3.2-10.8
		C247.4,241.1,246.1,238.7,243.9,238z"/>
</g>
</svg>
