<?xml version="1.0" encoding="utf-8"?>
<!-- Generator: Adobe Illustrator 23.0.3, SVG Export Plug-In . SVG Version: 6.00 Build 0)  -->
<svg version="1.1" id="Capa_1" xmlns="http://www.w3.org/2000/svg" xmlns:xlink="http://www.w3.org/1999/xlink" x="0px" y="0px"
	 viewBox="0 0 512 512" style="enable-background:new 0 0 512 512;" xml:space="preserve">
<style type="text/css">
	.st0{fill:#FECA38;}
</style>
<g>
	<circle class="st0" cx="256.5" cy="255.5" r="255.5"/>
</g>
<g>
	<g>
		<g>
			<path d="M329.6,240.2c-1.8-1.8-4.7-1.7-6.5,0.1c-1.8,1.8-1.8,4.7,0,6.5l6.8,6.6c1.2,1.2,2.9,1.6,4.5,1.2s2.9-1.7,3.3-3.3
				c0.4-1.6-0.1-3.3-1.3-4.5l0,0L329.6,240.2z"/>
			<path d="M295.8,273.3c-1.8-1.8-4.7-1.7-6.5,0.1c-1.8,1.8-1.8,4.7,0,6.5l6.8,6.6c1.2,1.2,2.9,1.6,4.5,1.2c1.6-0.4,2.9-1.7,3.3-3.3
				c0.4-1.6-0.1-3.3-1.3-4.5L295.8,273.3z"/>
			<path d="M299.2,243.5c-1.8-1.8-4.7-1.7-6.5,0.1c-1.8,1.8-1.8,4.7,0,6.5l6.8,6.6c1.2,1.2,2.9,1.6,4.5,1.2s2.9-1.7,3.3-3.3
				c0.4-1.6-0.1-3.3-1.3-4.5L299.2,243.5z"/>
			<path d="M268.7,299.8c-1.8-1.8-4.7-1.7-6.5,0.1c-1.8,1.8-1.8,4.7,0,6.5l6.8,6.6c1.2,1.2,2.9,1.6,4.5,1.2c1.6-0.4,2.9-1.7,3.3-3.3
				c0.4-1.6-0.1-3.3-1.3-4.5L268.7,299.8z"/>
			<path d="M234.8,333c-1.2-1.2-2.9-1.6-4.5-1.2s-2.8,1.7-3.3,3.3c-0.4,1.6,0.1,3.3,1.3,4.5l6.8,6.6c1.2,1.2,2.9,1.6,4.5,1.2
				c1.6-0.4,2.8-1.7,3.3-3.3s-0.1-3.3-1.3-4.5L234.8,333z"/>
			<path d="M238.2,303.1c-1.8-1.8-4.7-1.7-6.5,0.1s-1.8,4.7,0,6.5l6.8,6.6c1.2,1.2,2.9,1.6,4.5,1.2s2.9-1.7,3.3-3.3
				c0.4-1.6-0.1-3.3-1.3-4.5L238.2,303.1z"/>
			<path d="M384.7,201.2c-2.4-2.3-5.2-4.1-8.4-5.1c2.7-4.4,4.2-9.4,4.2-14.6c0-6.9-2.7-13.6-7.7-18.4c-4.3-4.2-9.8-6.8-15.8-7.3
				c-0.8-6.1-3.6-11.7-8-16c-7.8-7.4-18.9-9.9-29.1-6.8c-1.3-2.4-2.9-4.7-4.9-6.6c-11.2-10.3-28.6-9.8-39.3,1L258.8,144l0,0
				L117.2,282.6c-1.9,1.9-3.3,4.2-3.9,6.8c0,0.2,0,0.3-0.1,0.5c0,0,0,0.1,0,0.1c-0.6,2.8-0.3,5.8,1,8.4c3.9,7.8,14.5,23,43.1,51
				c28.6,28,44.1,38.4,52.1,42.1c1.8,0.9,3.8,1.3,5.8,1.3c1.7,0,3.3-0.3,4.9-0.9c2-0.7,3.8-1.8,5.3-3.3l143.2-140.1l15.4-15.1
				c4.6-4.4,7.2-10.5,7.3-16.9C391.1,210.8,388.8,205.3,384.7,201.2z M278.1,138.2l25.1,41.1c1.8,3,3.5,6.1,5,9.3
				c0.5,1.2,1,2.3,1.4,3.5c-11.7-2.1-23.6-2.3-35.3-0.4c-23.7,4-45.7,15.1-62.9,32c-26.1,24.6-38.2,60.6-32.4,96
				c-4.9-2-9.6-4.4-14.1-7.1L124,288.9L278.1,138.2z M319,190.7c-0.7-2-1.6-4-2.5-6c-1.6-3.6-3.5-7-5.5-10.3l-7.6-12.5
				c6.2-2.3,13.2-0.9,18,3.7c3.1,3.1,4.9,7.2,4.9,11.6s-1.8,8.5-4.9,11.6v0C320.7,189.5,319.9,190.2,319,190.7z M163.7,342.9
				c-13.7-12.7-26.2-26.8-37.3-41.9l33.8,19.5c6.3,3.8,12.9,7,19.9,9.5c0.5,0.2,1,0.3,1.5,0.3l0.1,0c2.1,7,5.1,13.7,8.9,20L209,381
				C201.4,376.4,187.4,366.1,163.7,342.9z M360.4,243.5L360.4,243.5L219.9,381l-21.4-35.6c-4.1-6.8-7.1-14.1-9.1-21.8
				c-8.3-32.2,2.6-68,28.6-93.4c15.8-15.5,36-25.8,57.8-29.4c12.2-2,24.7-1.6,36.8,1.2c8.2,1.9,16.1,5,23.4,9.1l36.2,20.9
				L360.4,243.5z M334.9,183.1c3.2,0.4,6.2,1.8,8.6,4.1c5.1,4.9,5.7,12.9,1.2,18.4l-4.2-2.4c-4.5-2.6-9.1-4.7-14-6.5
				c0.5-0.4,1-0.8,1.4-1.2l0,0C331.4,192,333.8,187.8,334.9,183.1z M378.8,225.2l-26-15c6.5-9.3,5.3-21.9-2.9-29.7
				c-3.9-3.9-9.1-6.2-14.6-6.7c-0.7-5.6-3.4-10.9-7.4-14.8c-7.8-7.6-19.5-9.7-29.4-5.1l-13.5-22c7.1-5.2,17-4.7,23.5,1.2
				c2,2,3.5,4.5,4.3,7.2c0.4,1.3,1.3,2.4,2.6,3c1.2,0.6,2.7,0.5,3.9,0c7.7-3.9,16.9-2.6,23.2,3.3c3.7,3.6,5.7,8.6,5.5,13.8
				c0,1.3,0.5,2.6,1.4,3.5s2.2,1.4,3.5,1.3c5-0.4,9.8,1.4,13.4,4.8c3.2,3.1,4.9,7.4,4.9,11.8c-0.1,5.2-2.2,10.1-5.9,13.7
				c-0.2,0.3-0.5,0.5-0.8,0.7c-1.7,1.2-2.4,3.5-1.6,5.4s2.7,3.2,4.8,3c3.9-0.5,7.7,0.8,10.5,3.5c2.3,2.3,3.7,5.5,3.6,8.8
				C381.8,219.7,380.7,222.7,378.8,225.2z"/>
		</g>
	</g>
</g>
</svg>
