<?xml version="1.0" encoding="utf-8"?>
<!-- Generator: Adobe Illustrator 23.0.3, SVG Export Plug-In . SVG Version: 6.00 Build 0)  -->
<svg version="1.1" id="Capa_1" xmlns="http://www.w3.org/2000/svg" xmlns:xlink="http://www.w3.org/1999/xlink" x="0px" y="0px"
	 viewBox="0 0 512 512" style="enable-background:new 0 0 512 512;" xml:space="preserve">
<style type="text/css">
	.st0{fill:#D9E1E7;}
</style>
<g>
	<circle class="st0" cx="256.5" cy="255.5" r="255.5"/>
</g>
<g>
	<g>
		<g>
			<path d="M209.6,340L209.6,340c-23.2-7.9-43.4-22.8-57.9-42.6c-1.1-1.5-2.9-2.3-4.7-2.1s-3.4,1.3-4.2,3c-0.8,1.7-0.5,3.6,0.5,5.1
				c15.7,21.5,37.7,37.7,62.9,46.3c2.7,0.9,5.6-0.5,6.5-3.2C213.7,343.8,212.3,340.9,209.6,340z"/>
			<path d="M136.5,267.9c-0.9-2.7-3.8-4.1-6.5-3.2c-2.7,0.9-4.1,3.8-3.2,6.5c1.2,3.6,2.6,7.2,4.2,10.7c1.2,2.6,4.2,3.7,6.8,2.6
				c2.6-1.2,3.7-4.2,2.6-6.8C138.9,274.5,137.7,271.2,136.5,267.9z"/>
			<path d="M272,159.2c0,8.1,3.3,15.9,9,21.6c2,2,5.2,2,7.2,0c2-2,2-5.2,0-7.2c-3.9-3.8-6-8.9-6-14.3s2.2-10.6,6-14.3
				c12.4-12.4,6.6-31.5-5.1-43.2c-2-2-5.2-2-7.2,0c-2,2-2,5.2,0,7.2c8.2,8.2,12.8,21,5.1,28.7C275.2,143.3,272,151,272,159.2z"/>
			<path d="M215.5,184.8c0,8.1,3.3,15.9,9,21.6c2,2,5.2,2,7.2,0c2-2,2-5.2,0-7.2c-3.9-3.8-6-8.9-6-14.3c0-5.4,2.2-10.6,6-14.3
				c12.4-12.4,6.6-31.5-5.1-43.2c-2-2-5.2-2-7.2,0c-2,2-2,5.2,0,7.2c8.2,8.2,12.8,21,5.1,28.7C218.8,168.9,215.5,176.7,215.5,184.8z
				"/>
			<path d="M161.7,154c0,8.1,3.3,15.9,9,21.6c1.3,1.3,3.2,1.8,5,1.4s3.2-1.9,3.6-3.6s0-3.7-1.4-5c-3.9-3.8-6-8.9-6-14.3
				c0-5.4,2.2-10.6,6-14.3c12.4-12.4,6.6-31.5-5.1-43.2c-2-2-5.2-2-7.2,0c-2,2-2,5.2,0,7.2c8.2,8.2,12.8,21,5.1,28.7
				C165,138.1,161.7,145.9,161.7,154z"/>
			<path d="M342.1,221.9c1-21.9,3.4-51.4,9.2-65.9c7.1-17.7,28.6-30.6,37.5-35.3c6.4-3.4,9-11.3,5.9-17.9
				c-3.1-6.6-10.9-9.5-17.6-6.7c-20.2,8.2-37.5,22-50.1,39.8c-13.1,19.7-18.2,57.2-20.2,83.7c-18.4-0.9-37.7-1.3-57.7-1.3
				c-34.1-0.2-68.2,1.3-102.2,4.5c-43.1,4.6-46.7,10.4-46.7,16c0,0.1,0,0.2,0,0.4l0,0l0,0.2c0,0.2,0,0.4,0,0.6
				c0.1,1.2,0.3,3.6,0.4,5.2c3.3,37.7,21.6,72.6,50.9,96.7v30.4c0,20.2,49.1,30.8,97.5,30.8s97.5-10.6,97.5-30.8v-27.6
				c31.1-24.4,49.8-61.2,51.2-100.7c0-0.4,0-2.7,0.1-4.1c0-0.4,0-0.7,0-1.1C397.9,234.2,397.8,226.8,342.1,221.9z M383.8,238.7
				c-13.9,3.6-28.1,5.8-42.4,6.6c0-3,0.1-7.6,0.3-13.2C355.9,232.9,370,235.1,383.8,238.7z M316.6,225.1L316.6,225.1L316.6,225.1
				c1.6-25.5,6.2-64.7,18.8-83.6c11.5-16.1,27.3-28.6,45.6-36c1.7-0.7,3.6,0,4.4,1.6c0.8,1.6,0.2,3.6-1.4,4.4
				c-12.3,6.5-34.1,20.4-42.2,40.6c-9.4,23.6-10.5,80.6-10.6,94c-4.9,0.4-10.1,0.7-15.4,1C315.8,243.8,316,235.7,316.6,225.1z
				 M249,228.5c19.7,0,38.9,0.5,57.1,1.3c-0.5,8.7-0.6,15.2-0.6,17.9c-18.4,0.8-37.3,1.3-56.5,1.3c-72.2,0-120.6-5.5-135.2-10.3
				C128.4,233.9,176.8,228.5,249,228.5z M336.3,372.2c0,7-30.8,20.5-87.3,20.5s-87.3-13.6-87.3-20.5v-22.5
				c25.6,18,56,27.6,87.3,27.6c30.9,0.3,61.3-8.5,87.3-25.3V372.2z M338.7,337.6c-0.4,0.2-0.7,0.5-1,0.8c-25.6,19-56.8,29-88.6,28.7
				c-70.3,0-129.9-51.7-137.7-118.5c11.6,3.2,23.5,5.3,35.5,6.2c34,3.2,68.1,4.7,102.2,4.5c21,0,41.9-0.5,62-1.5
				c9.1-0.5,17.8-1,25.8-1.7c17-0.8,33.9-3.3,50.4-7.6C384.5,283.7,366.9,316.2,338.7,337.6z"/>
		</g>
	</g>
</g>
</svg>
