<svg width="15" height="18" viewBox="0 0 15 18" fill="none" xmlns="http://www.w3.org/2000/svg">
<path d="M7.49955 0.867153C10.089 0.867153 12.1904 2.89386 12.1904 5.39458C12.1904 6.36649 11.7601 7.84168 10.8501 8.86699L7.49955 12.6327L4.15037 8.8681C3.23922 7.8428 2.80896 6.36761 2.80896 5.39458C2.80896 2.89386 4.91013 0.867153 7.49955 0.867153ZM7.49955 0C4.42326 0 1.91322 2.42387 1.91322 5.39435C1.91322 6.59702 2.38076 8.20601 3.46862 9.43057V9.43191L5.03046 11.187H2.34717C2.15343 11.1879 1.98133 11.3087 1.9215 11.4863L0.0221202 17.1624C-0.071756 17.4416 0.144988 17.7273 0.448935 17.7273H14.5502C14.8555 17.7273 15.0708 17.4416 14.9784 17.1624L13.0776 11.4863C13.0178 11.3078 12.8457 11.187 12.651 11.187H10.9463C10.3174 11.1568 10.3174 12.0845 10.9463 12.053H12.3252L13.9335 16.8601H1.06695L2.67389 12.053H5.80057L7.00301 13.4042H6.21427C5.97153 13.3998 5.77089 13.5887 5.77089 13.8244C5.77089 14.0601 5.97153 14.2506 6.21427 14.2459H8.78206C9.02619 14.2506 9.22682 14.0601 9.22682 13.8244C9.22682 13.5887 9.02596 13.4 8.78206 13.4042H7.997L11.5302 9.43191V9.43057C12.6195 8.20601 13.087 6.59702 13.087 5.39435C13.0873 2.42387 10.5758 0 7.49955 0Z" fill="#757070"/>
</svg>
