<svg width="20" height="18" viewBox="0 0 20 18" fill="none" xmlns="http://www.w3.org/2000/svg">
<path d="M10 16.5625C10 16.5625 1.40625 11.75 1.40625 5.90626C1.40642 4.8734 1.76431 3.87249 2.41906 3.07368C3.07381 2.27488 3.98501 1.7275 4.99774 1.5246C6.01047 1.3217 7.06221 1.47581 7.97416 1.96072C8.8861 2.44564 9.60195 3.23143 10 4.1845L9.99999 4.18451C10.398 3.23144 11.1139 2.44564 12.0258 1.96073C12.9378 1.47581 13.9895 1.3217 15.0023 1.5246C16.015 1.7275 16.9262 2.27488 17.5809 3.07368C18.2357 3.87249 18.5936 4.8734 18.5938 5.90626C18.5938 11.75 10 16.5625 10 16.5625Z" stroke="#757070" stroke-width="2" stroke-linecap="round" stroke-linejoin="round"/>
</svg>
