<?xml version="1.0" encoding="utf-8"?>
<!-- Generator: Adobe Illustrator 23.0.3, SVG Export Plug-In . SVG Version: 6.00 Build 0)  -->
<svg version="1.1" id="Capa_1" xmlns="http://www.w3.org/2000/svg" xmlns:xlink="http://www.w3.org/1999/xlink" x="0px" y="0px"
	 viewBox="0 0 512 512" style="enable-background:new 0 0 512 512;" xml:space="preserve">
<style type="text/css">
	.st0{fill:#FECA38;}
</style>
<g>
	<circle class="st0" cx="256.5" cy="255.5" r="255.5"/>
</g>
<g>
	<g>
		<g>
			<path d="M252.7,314.1c-3.3,0-6,2.7-6,6s2.7,6,6,6s6-2.7,6-6S256,314.1,252.7,314.1z"/>
		</g>
	</g>
	<g>
		<g>
			<path d="M232.3,308.9c-13.4-7.4-21.7-21.6-21.7-36.8c0-3.3-2.7-6-6-6s-6,2.7-6,6c0,19.6,10.7,37.8,27.9,47.4
				c0.9,0.5,1.9,0.8,2.9,0.8c2.1,0,4.2-1.1,5.3-3.1C236.3,314.1,235.2,310.5,232.3,308.9z"/>
		</g>
	</g>
	<g>
		<g>
			<path d="M349.3,106h-60.2c-2.9,0-5.5,2.1-5.9,5l-9.1,55.1h-3.2c-1.2-15.3-7.8-29.6-18.7-40.6c-12.4-12.5-29-19.4-46.8-19.5
				c0,0-0.1,0-0.1,0c0,0,0,0,0,0c0,0,0,0,0,0c-0.1,0-0.2,0-0.3,0c-17.7,0-34.4,7.1-47,19.9c-12.2,12.4-19,28.8-19.2,46.2
				c0,0,0,0,0,0c0,0,0,0,0,0.1c0,0,0,0,0,0c0,0.2,0,0.4,0,0.6c0,17.7,6.9,34.3,19.4,46.8c0,0,0,0,0,0c6.2,6.2,13.6,11.1,21.7,14.4
				c-0.9,3.3-1.7,6.5-2.4,9.7c-1.9,8.9-2.8,17.8-2.9,27.2c0,0.4,0,0.8,0,1.2c0,20.9,8.1,40.5,22.9,55.3
				c10.4,10.4,23.3,17.5,37.3,20.8V402h-42.1c-3.3,0-6,2.7-6,6s2.7,6,6,6h120.3c3.3,0,6-2.7,6-6s-2.7-6-6-6h-42.1v-53.8
				c34.4-8.2,60.2-39.2,60.2-76.1v-0.5c0-8.1-0.8-17.3-2.2-25.9c0-0.2,0-0.5,0-0.7c0-0.9-0.2-1.8-0.6-2.6c-1.1-6.1-2.4-11.7-4-16.6
				l-17.6-55.4c-0.8-2.5-3.1-4.2-5.7-4.2h-14.6l8-48.1h55.1c3.3,0,6-2.7,6-6C355.3,108.7,352.6,106,349.3,106z M258.8,166.2h-38.5
				l27.4-27.6C253.9,146.5,257.7,156,258.8,166.2z M211.2,118.4c10.3,1.2,20,5.2,28,11.6l-28,28.2V118.4z M209.1,178.2h63L262,238.9
				h-71.1c0.5-2,1.1-4,1.8-6.1c0,0,0-0.1,0-0.1L209.1,178.2z M199.2,118.3v40.2l-28.3-28.3C179,123.6,188.8,119.4,199.2,118.3z
				 M162.5,138.9l27.3,27.3h-38.6C152.4,156.2,156.3,146.8,162.5,138.9z M151,178.2h40.2c-0.4,0.2-0.8,0.5-1.1,0.9l-27.5,27.5
				C156,198.4,152,188.6,151,178.2z M171.1,215.1l20.5-20.5l-8.3,27.8C178.9,220.5,174.8,218,171.1,215.1z M258.7,402h-12v-51.7h12
				V402z M318.9,271.6v0.4h0c0,36.5-29.7,66.2-66.2,66.2c-17.7,0-34.3-6.9-46.8-19.4c-12.5-12.5-19.4-29.1-19.4-46.8
				c0-0.3,0-0.6,0-1c0-6.9,0.6-13.5,1.7-20H267c0,0,0,0,0,0c0,0,0,0,0,0h50.3C318.3,258,318.9,265.1,318.9,271.6z M296.4,178.2
				l16.3,51.2c0.9,2.9,1.8,6.1,2.5,9.6h-41.1l10.1-60.8H296.4z"/>
		</g>
	</g>
</g>
</svg>
