<?xml version="1.0" encoding="UTF-8" standalone="no"?>
<svg
   xmlns:dc="http://purl.org/dc/elements/1.1/"
   xmlns:cc="http://creativecommons.org/ns#"
   xmlns:rdf="http://www.w3.org/1999/02/22-rdf-syntax-ns#"
   xmlns:svg="http://www.w3.org/2000/svg"
   xmlns="http://www.w3.org/2000/svg"
   xmlns:xlink="http://www.w3.org/1999/xlink"
   xmlns:sodipodi="http://sodipodi.sourceforge.net/DTD/sodipodi-0.dtd"
   xmlns:inkscape="http://www.inkscape.org/namespaces/inkscape"
   width="1920"
   height="1080"
   viewBox="0 0 507.99999 285.75001"
   version="1.1"
   id="svg8"
   inkscape:version="1.0.2 (e86c870879, 2021-01-15)"
   sodipodi:docname="TeArch-Linux-Other.svg">
  <defs
     id="defs2">
    <linearGradient
       inkscape:collect="always"
       id="linearGradient4578">
      <stop
         style="stop-color:#000000;stop-opacity:1;"
         offset="0"
         id="stop4574" />
      <stop
         style="stop-color:#007bff;stop-opacity:1"
         offset="1"
         id="stop4576" />
    </linearGradient>
    <linearGradient
       inkscape:collect="always"
       xlink:href="#linearGradient4578"
       id="linearGradient4580"
       x1="269.7818"
       y1="12.47212"
       x2="269.2215"
       y2="296.31235"
       gradientUnits="userSpaceOnUse"
       gradientTransform="matrix(1.0057143,0,0,1.0102042,-1.451432,-1.5726999)" />
  </defs>
  <sodipodi:namedview
     id="base"
     pagecolor="#ffffff"
     bordercolor="#666666"
     borderopacity="1.0"
     inkscape:pageopacity="0.0"
     inkscape:pageshadow="2"
     inkscape:zoom="0.35"
     inkscape:cx="1090.9336"
     inkscape:cy="324.04933"
     inkscape:document-units="mm"
     inkscape:current-layer="layer1"
     showgrid="false"
     units="px"
     showguides="true"
     inkscape:guide-bbox="true"
     inkscape:window-width="1920"
     inkscape:window-height="1016"
     inkscape:window-x="0"
     inkscape:window-y="27"
     inkscape:window-maximized="1"
     inkscape:document-rotation="0" />
  <metadata
     id="metadata5">
    <rdf:RDF>
      <cc:Work
         rdf:about="">
        <dc:format>image/svg+xml</dc:format>
        <dc:type
           rdf:resource="http://purl.org/dc/dcmitype/StillImage" />
        <dc:title />
      </cc:Work>
    </rdf:RDF>
  </metadata>
  <g
     inkscape:label="Layer 1"
     inkscape:groupmode="layer"
     id="layer1"
     transform="translate(0,-11.249983)">
    <rect
       ry="0"
       y="11.249983"
       x="0"
       height="285.75"
       width="508"
       id="rect4603"
       style="opacity:1;fill:#000001;fill-opacity:1;stroke:none;stroke-width:2.90933633;stroke-linecap:round;stroke-linejoin:round;stroke-miterlimit:4;stroke-dasharray:none;stroke-opacity:1" />
    <rect
       style="opacity:1;fill:url(#linearGradient4580);fill-opacity:1;stroke:none;stroke-width:2.90933633;stroke-linecap:round;stroke-linejoin:round;stroke-miterlimit:4;stroke-dasharray:none;stroke-opacity:1"
       id="rect4572"
       width="508"
       height="285.75"
       x="0"
       y="11.249983"
       ry="8.3154764" />
    <g
       id="g4538"
       style="stroke-width:1.00002;stroke-miterlimit:4;stroke-dasharray:none"
       transform="matrix(1.4129652,0,0,1.4129652,7.2470492,-5.1694676)">
      <path
         sodipodi:nodetypes="ccsscsc"
         inkscape:connector-curvature="0"
         id="path4529"
         d="m 174.81399,65.300576 v 0 c 0,0 -17.76488,0.377978 -25.13542,4.724704 -7.37054,4.346726 6.40526,26.066846 1.32292,34.9628 -7.9825,13.97227 -4.15774,24.94643 -4.15774,24.94643 0,0 -7.4071,-0.65727 -6.99256,8.12648 0.45435,9.62732 20.41072,22.3006 35.15179,22.11162"
         style="fill:none;fill-opacity:0.0651341;stroke:#ffffff;stroke-width:1.00002;stroke-linecap:butt;stroke-linejoin:round;stroke-miterlimit:4;stroke-dasharray:none;stroke-opacity:1" />
      <path
         sodipodi:nodetypes="csc"
         inkscape:connector-curvature="0"
         id="path4531"
         d="m 147.78869,72.671114 c 0,0 -0.27433,5.67075 26.27946,5.48518 27.65778,-0.193286 27.22386,-6.241134 27.22386,-6.241134"
         style="fill:none;stroke:#ffffff;stroke-width:1.00002;stroke-linecap:butt;stroke-linejoin:miter;stroke-miterlimit:4;stroke-dasharray:none;stroke-opacity:1" />
      <path
         sodipodi:nodetypes="csc"
         inkscape:connector-curvature="0"
         id="path4533"
         d="m 151.89107,96.09614 c 0,0 0.0263,-7.259626 22.1133,-7.220603 22.77343,0.04024 21.80465,7.530544 23.54029,7.220607"
         style="fill:none;stroke:#fffffb;stroke-width:1.00002;stroke-linecap:butt;stroke-linejoin:round;stroke-miterlimit:4;stroke-dasharray:none;stroke-opacity:1" />
    </g>
    <g
       id="g4554"
       transform="matrix(-1.4129652,0,0,1.4129652,500.75295,-5.1694676)"
       style="stroke-width:1.00002;stroke-miterlimit:4;stroke-dasharray:none">
      <path
         sodipodi:nodetypes="ccsscsc"
         inkscape:connector-curvature="0"
         id="path4548"
         d="m 174.81399,65.300576 v 0 c 0,0 -17.76488,0.377978 -25.13542,4.724704 -7.37054,4.346726 6.40526,26.066846 1.32292,34.9628 -7.9825,13.97227 -4.15774,24.94643 -4.15774,24.94643 0,0 -7.4071,-0.65727 -6.99256,8.12648 0.45435,9.62732 20.41072,22.3006 35.15179,22.11162"
         style="fill:none;fill-opacity:0.0651341;stroke:#fffff9;stroke-width:1.00002;stroke-linecap:butt;stroke-linejoin:round;stroke-miterlimit:4;stroke-dasharray:none;stroke-opacity:1" />
    </g>
    <path
       style="fill:none;stroke:#fffaff;stroke-width:1.41299;stroke-linecap:butt;stroke-linejoin:round;stroke-miterlimit:4;stroke-dasharray:none;stroke-opacity:1"
       d="m 217.68835,186.85712 12.3678,9.25226 c 0,0 7.63389,-2.1114 11.51809,-1.88822 4.2466,0.244 12.27339,3.49319 12.27339,3.49319 0,0 6.60805,-3.79041 10.29075,-4.24848 4.13388,-0.51419 12.3678,1.7938 12.3678,1.7938 0,0 13.59512,-9.15782 14.44481,-9.25223 0.8497,-0.0944 5.21107,-0.92049 6.89199,0.66088 0.88179,0.82957 1.30085,2.62508 0.56647,3.58758 -1.21004,1.58591 -5.94787,0.66088 -5.94787,0.66088 l -14.91689,10.10194 c 0,0 -7.91235,-2.99232 -11.99015,-2.6435 -4.06428,0.34767 -11.32927,4.62612 -11.32927,4.62612 0,0 -9.40453,-3.71035 -14.35043,-3.77642 -3.71714,-0.0497 -10.85721,2.54909 -10.85721,2.54909 l -13.68954,-9.91312 c 0,0 -4.12046,1.04112 -5.28699,-0.28323 -0.85513,-0.97082 -0.61224,-2.93711 0.28323,-3.87085 1.71031,-1.78339 7.36402,-0.84969 7.36402,-0.84969 z"
       id="path4558"
       inkscape:connector-curvature="0"
       sodipodi:nodetypes="ccacaccaaccacaccaac" />
    <g
       id="g855-7"
       transform="matrix(1.1731202,0,0,1.1731202,111.06663,20.832003)"
       style="fill:none;stroke:#ffffff;stroke-width:1.20448;stroke-miterlimit:4;stroke-dasharray:none;stroke-opacity:1">
      <path
         style="fill:none;fill-opacity:1;stroke:#ffffff;stroke-width:1.20448;stroke-linecap:round;stroke-linejoin:round;stroke-miterlimit:4;stroke-dasharray:none;stroke-opacity:1;paint-order:stroke fill markers"
         d="m 101.01888,132.01973 c 0,0 10.8242,-26.42181 18.68607,-38.226477 0.41595,-0.624553 0.77179,-1.258556 1.40625,-1.28521 0.69003,-0.02899 1.20262,0.640726 1.64125,1.264553 8.29609,11.798954 19.74537,38.503044 19.74537,38.503044 0,0 0.63704,1.28 0.35528,1.83606 -0.22077,0.4357 -1.32472,0.62635 -1.32472,0.62635 0,0 -3.4229,-0.85875 -5.15576,-1.18581 -1.90522,-0.35959 -5.75382,-0.85211 -5.75382,-0.85211 0,0 2.35553,-3.60783 0.50949,-8.62494 -3.2145,-8.73626 -15.37236,-10.90237 -14.58191,-9.85429 2.12785,2.82138 -0.60692,8.67315 -2.12136,10.85786 -2.35223,3.39329 -2.0627,7.52293 -2.0627,7.52293 0,0 -3.54241,0.22055 -5.27241,0.58665 -1.43158,0.30295 -4.18554,1.32358 -4.18554,1.32358 0,0 -1.60126,0.0216 -2.00524,-0.54055 -0.38035,-0.52928 0.11975,-1.95164 0.11975,-1.95164 z"
         id="path849-5"
         sodipodi:nodetypes="ccaccacacssscacac" />
      <path
         style="fill:none;fill-opacity:1;stroke:#ffffff;stroke-width:1.20448;stroke-linecap:round;stroke-linejoin:round;stroke-miterlimit:4;stroke-dasharray:none;stroke-opacity:1;paint-order:stroke fill markers"
         d="m 122.67423,132.08173 c 0,0 0.81948,-3.60173 0.66711,-5.41348 -0.17606,-2.09337 -1.80473,-6.03836 -1.80473,-6.03836 0,0 2.53905,2.74946 3.17265,5.47043 0.63923,2.74517 -0.36461,6.13399 -0.36461,6.13399 z"
         id="path851-3"
         sodipodi:nodetypes="cacscc" />
    </g>
  </g>
</svg>
