<?xml version="1.0" encoding="UTF-8"?>
<Project>
   <description></description>
   <name>Project1</name>
   <tag></tag>
   <UUID>e1601199-8883-4793-b109-30d7357f8901</UUID>
   <pageLoadTimeout>30</pageLoadTimeout>
</Project>
