{
  "type"      : "ManageIQ::Providers::Redfish::PhysicalInfraManager",
  "name"      : "lenovo",
  "hostname"  : "redfish",
  "ipaddress" : "redfish",
  "port"      : "8000",
  "security_protocol": "non-ssl",
  "credentials" : {
    "userid"    : "admin",
    "password"  : "passadmin"
  }
}
