(footprint "WCAP-ATG8_8X11.5(DXL)"
	(version 20240108)
	(generator "pcbnew")
	(generator_version "8.0")
	(layer "F.Cu")
	(descr "<B>WCAP-ATG8</B><BR> Aluminium Electrolytic Capacitors,8X11.5X3.5X0.5(DiameterXLengthX PitchXØPin)")
	(property "Reference" "REF**"
		(at -0.34 -5.488 0)
		(layer "F.SilkS")
		(uuid "dbbe5864-8407-4639-a987-c1a8ccdea7d6")
		(effects
			(font
				(size 0.8 0.8)
				(thickness 0.15)
			)
		)
	)
	(property "Value" "WCAP-ATG8_8X11.5_DXL_"
		(at -0.04 5.142 0)
		(layer "F.Fab")
		(uuid "51389723-4cd1-4293-98bd-6819356936b3")
		(effects
			(font
				(size 0.8 0.8)
				(thickness 0.15)
			)
		)
	)
	(property "Footprint" ""
		(at 0 0 0)
		(layer "F.Fab")
		(hide yes)
		(uuid "f0815cec-10c8-44b8-b7c0-7be332eec7fe")
		(effects
			(font
				(size 1.27 1.27)
				(thickness 0.15)
			)
		)
	)
	(property "Datasheet" ""
		(at 0 0 0)
		(layer "F.Fab")
		(hide yes)
		(uuid "f2f11154-ac8f-4e54-a95a-bc041d65a45e")
		(effects
			(font
				(size 1.27 1.27)
				(thickness 0.15)
			)
		)
	)
	(property "Description" ""
		(at 0 0 0)
		(layer "F.Fab")
		(hide yes)
		(uuid "630ecad6-8351-4785-bcbc-bb3021e47109")
		(effects
			(font
				(size 1.27 1.27)
				(thickness 0.15)
			)
		)
	)
	(attr through_hole)
	(fp_circle
		(center 0 0)
		(end 4.1 0)
		(stroke
			(width 0.2)
			(type solid)
		)
		(fill none)
		(layer "F.SilkS")
		(uuid "01fe7353-3ded-4355-88f8-8a085799f946")
	)
	(fp_poly
		(pts
			(xy 0 4.3) (xy -0.225 4.294) (xy -0.449 4.276) (xy -0.673 4.247) (xy -0.894 4.206) (xy -1.113 4.153)
			(xy -1.329 4.09) (xy -1.541 4.014) (xy -1.749 3.928) (xy -1.952 3.831) (xy -2.15 3.724) (xy -2.342 3.606)
			(xy -2.527 3.479) (xy -2.706 3.342) (xy -2.877 3.196) (xy -3.041 3.041) (xy -3.196 2.877) (xy -3.342 2.706)
			(xy -3.479 2.527) (xy -3.606 2.342) (xy -3.724 2.15) (xy -3.831 1.952) (xy -3.928 1.749) (xy -4.014 1.541)
			(xy -4.09 1.329) (xy -4.153 1.113) (xy -4.206 0.894) (xy -4.247 0.673) (xy -4.276 0.449) (xy -4.294 0.225)
			(xy -4.3 0) (xy -4.294 -0.225) (xy -4.276 -0.449) (xy -4.247 -0.673) (xy -4.206 -0.894) (xy -4.153 -1.113)
			(xy -4.09 -1.329) (xy -4.014 -1.541) (xy -3.928 -1.749) (xy -3.831 -1.952) (xy -3.724 -2.15) (xy -3.606 -2.342)
			(xy -3.479 -2.527) (xy -3.342 -2.706) (xy -3.196 -2.877) (xy -3.041 -3.041) (xy -2.877 -3.196) (xy -2.706 -3.342)
			(xy -2.527 -3.479) (xy -2.342 -3.606) (xy -2.15 -3.724) (xy -1.952 -3.831) (xy -1.749 -3.928) (xy -1.541 -4.014)
			(xy -1.329 -4.09) (xy -1.113 -4.153) (xy -0.894 -4.206) (xy -0.673 -4.247) (xy -0.449 -4.276) (xy -0.225 -4.294)
			(xy 0 -4.3) (xy 0.225 -4.294) (xy 0.449 -4.276) (xy 0.673 -4.247) (xy 0.894 -4.206) (xy 1.113 -4.153)
			(xy 1.329 -4.09) (xy 1.541 -4.014) (xy 1.749 -3.928) (xy 1.952 -3.831) (xy 2.15 -3.724) (xy 2.342 -3.606)
			(xy 2.527 -3.479) (xy 2.706 -3.342) (xy 2.877 -3.196) (xy 3.041 -3.041) (xy 3.196 -2.877) (xy 3.342 -2.706)
			(xy 3.479 -2.527) (xy 3.606 -2.342) (xy 3.724 -2.15) (xy 3.831 -1.952) (xy 3.928 -1.749) (xy 4.014 -1.541)
			(xy 4.09 -1.329) (xy 4.153 -1.113) (xy 4.206 -0.894) (xy 4.247 -0.673) (xy 4.276 -0.449) (xy 4.294 -0.225)
			(xy 4.3 0) (xy 4.294 0.225) (xy 4.276 0.449) (xy 4.247 0.673) (xy 4.206 0.894) (xy 4.153 1.113) (xy 4.09 1.329)
			(xy 4.014 1.541) (xy 3.928 1.749) (xy 3.831 1.952) (xy 3.724 2.15) (xy 3.606 2.342) (xy 3.479 2.527)
			(xy 3.342 2.706) (xy 3.196 2.877) (xy 3.041 3.041) (xy 2.877 3.196) (xy 2.706 3.342) (xy 2.527 3.479)
			(xy 2.342 3.606) (xy 2.15 3.724) (xy 1.952 3.831) (xy 1.749 3.928) (xy 1.541 4.014) (xy 1.329 4.09)
			(xy 1.113 4.153) (xy 0.894 4.206) (xy 0.673 4.247) (xy 0.449 4.276) (xy 0.225 4.294) (xy 0 4.3)
		)
		(stroke
			(width 0.1)
			(type solid)
		)
		(fill none)
		(layer "F.CrtYd")
		(uuid "c7a59076-003f-4fd8-b856-3bf7006bd2b5")
	)
	(fp_circle
		(center 0 0)
		(end 4 0)
		(stroke
			(width 0.1)
			(type solid)
		)
		(fill none)
		(layer "F.Fab")
		(uuid "3df50e93-bf19-4636-bf95-6a916293c780")
	)
	(fp_text user "+"
		(at 5 0.5 0)
		(layer "F.SilkS")
		(uuid "e813582a-085e-4875-9f50-eced901a6a19")
		(effects
			(font
				(size 0.8 0.8)
				(thickness 0.15)
			)
		)
	)
	(fp_text user "+"
		(at 5 0.5 0)
		(layer "Dwgs.User")
		(uuid "25b75505-b31a-4966-8aa9-7816ab39df84")
		(effects
			(font
				(size 0.8 0.8)
				(thickness 0.15)
			)
		)
	)
	(pad "1" thru_hole circle
		(at 1.75 0)
		(size 1.308 1.308)
		(drill 0.8)
		(layers "*.Cu" "*.Mask")
		(remove_unused_layers no)
		(uuid "8bf94a42-ad5b-4f3b-a339-77d7868cc551")
	)
	(pad "2" thru_hole circle
		(at -1.75 0)
		(size 1.308 1.308)
		(drill 0.8)
		(layers "*.Cu" "*.Mask")
		(remove_unused_layers no)
		(uuid "80a883c4-7038-48cf-bf48-a2f60435724f")
	)
	(model "${KIPRJMOD}/kicad-library/3D/components.3dshapes/WE-860010674014.stp"
		(offset
			(xyz 0 0 0)
		)
		(scale
			(xyz 1 1 1)
		)
		(rotate
			(xyz 0 0 0)
		)
	)
)
