(footprint "WE-418117270903"
	(version 20240108)
	(generator "pcbnew")
	(generator_version "8.0")
	(layer "F.Cu")
	(descr "WS-BS 2.54 mm compact THT Dip Switch with raised actuator, 3 Pole")
	(property "Reference" "REF**"
		(at 0 -6.5 0)
		(layer "F.SilkS")
		(uuid "ba646c40-63e4-4783-bbda-bd36225514d1")
		(effects
			(font
				(size 1 1)
				(thickness 0.15)
			)
		)
	)
	(property "Value" "WE-418117270903"
		(at 0 6.5 0)
		(layer "F.Fab")
		(uuid "d2a656f0-072f-4da7-a34a-e17bd3511c0d")
		(effects
			(font
				(size 1 1)
				(thickness 0.15)
			)
		)
	)
	(property "Footprint" ""
		(at 0 0 0)
		(layer "F.Fab")
		(hide yes)
		(uuid "13eacdd2-6de1-4883-8394-3c097d445004")
		(effects
			(font
				(size 1.27 1.27)
				(thickness 0.15)
			)
		)
	)
	(property "Datasheet" ""
		(at 0 0 0)
		(layer "F.Fab")
		(hide yes)
		(uuid "71b2bbf3-fd52-4dec-838b-514acb5cfeba")
		(effects
			(font
				(size 1.27 1.27)
				(thickness 0.15)
			)
		)
	)
	(property "Description" ""
		(at 0 0 0)
		(layer "F.Fab")
		(hide yes)
		(uuid "eda3bd53-3ef4-47f5-9c66-a7bec748f605")
		(effects
			(font
				(size 1.27 1.27)
				(thickness 0.15)
			)
		)
	)
	(attr through_hole)
	(fp_line
		(start -4.31 -4.8)
		(end 4.31 -4.8)
		(stroke
			(width 0.127)
			(type solid)
		)
		(layer "F.SilkS")
		(uuid "f79b80d8-add6-45f3-a96b-c993041918be")
	)
	(fp_line
		(start -4.31 4.8)
		(end -4.31 -4.8)
		(stroke
			(width 0.127)
			(type solid)
		)
		(layer "F.SilkS")
		(uuid "ec18d5f7-a2db-44cc-9099-de04201949cc")
	)
	(fp_line
		(start 4.31 -4.8)
		(end 4.31 4.8)
		(stroke
			(width 0.127)
			(type solid)
		)
		(layer "F.SilkS")
		(uuid "acd0962b-4285-473b-b146-59da18d4d7ca")
	)
	(fp_line
		(start 4.31 4.8)
		(end -4.31 4.8)
		(stroke
			(width 0.127)
			(type solid)
		)
		(layer "F.SilkS")
		(uuid "482e8f5b-0115-40dc-8424-a7c8a0bf6ae6")
	)
	(fp_circle
		(center -3.5 4.4)
		(end -3.45 4.4)
		(stroke
			(width 0.2)
			(type solid)
		)
		(fill none)
		(layer "F.SilkS")
		(uuid "2d879048-a03d-4471-8da2-91e824050b4b")
	)
	(fp_poly
		(pts
			(xy -4.56 -5.05) (xy 4.56 -5.05) (xy 4.56 5.05) (xy -4.56 5.05)
		)
		(stroke
			(width 0.127)
			(type solid)
		)
		(fill none)
		(layer "F.CrtYd")
		(uuid "ae33cd84-2a0a-4440-8e1e-b6b69649845a")
	)
	(pad "1A" thru_hole circle
		(at -2.54 3.81)
		(size 1.308 1.308)
		(drill 0.8)
		(layers "*.Cu" "*.Mask")
		(remove_unused_layers no)
		(uuid "0da3bd2d-fa59-42c2-8481-e16710852e60")
	)
	(pad "1B" thru_hole circle
		(at -2.54 -3.81)
		(size 1.308 1.308)
		(drill 0.8)
		(layers "*.Cu" "*.Mask")
		(remove_unused_layers no)
		(uuid "54961cf3-38a3-4451-8994-5e8e84108298")
	)
	(pad "2A" thru_hole circle
		(at 0 3.81)
		(size 1.308 1.308)
		(drill 0.8)
		(layers "*.Cu" "*.Mask")
		(remove_unused_layers no)
		(uuid "0c23e7ac-ec29-45f8-8fe7-7f17b2e539dc")
	)
	(pad "2B" thru_hole circle
		(at 0 -3.81)
		(size 1.308 1.308)
		(drill 0.8)
		(layers "*.Cu" "*.Mask")
		(remove_unused_layers no)
		(uuid "947c1748-76d7-4ec2-b2c0-55f933cc372a")
	)
	(pad "3A" thru_hole circle
		(at 2.54 3.81)
		(size 1.308 1.308)
		(drill 0.8)
		(layers "*.Cu" "*.Mask")
		(remove_unused_layers no)
		(uuid "228f37e6-54ce-4990-9359-4a645915e78d")
	)
	(pad "3B" thru_hole circle
		(at 2.54 -3.81)
		(size 1.308 1.308)
		(drill 0.8)
		(layers "*.Cu" "*.Mask")
		(remove_unused_layers no)
		(uuid "af883dff-4ec3-4813-95a1-326a37fd873a")
	)
	(model "${KIPRJMOD}/kicad-library/3D/switches.3dshapes/WE-418117270903.stp"
		(offset
			(xyz 0 0 0.5)
		)
		(scale
			(xyz 1 1 1)
		)
		(rotate
			(xyz 0 0 0)
		)
	)
)
