(footprint "WE-885012207079"
	(version 20240108)
	(generator "pcbnew")
	(generator_version "8.0")
	(layer "F.Cu")
	(descr "Capacitor SMD 0805 (2012 Metric), square (rectangular) end terminal, IPC_7351 nominal with elongated pad for handsoldering. (Body size source: IPC-SM-782 page 76, https://www.pcb-3d.com/wordpress/wp-content/uploads/ipc-sm-782a_amendment_1_and_2.pdf, https://docs.google.com/spreadsheets/d/1BsfQQcO9C6DZCsRaXUlFlo91Tg2WpOkGARC1WS5S8t0/edit?usp=sharing), generated with kicad-footprint-generator")
	(tags "capacitor handsolder")
	(property "Reference" "REF**"
		(at 0 -1.68 0)
		(layer "F.SilkS")
		(uuid "79648a8a-db92-4d15-88fe-c63b15560e19")
		(effects
			(font
				(size 1 1)
				(thickness 0.15)
			)
		)
	)
	(property "Value" "WE-885012207079"
		(at 0 1.68 0)
		(layer "F.Fab")
		(uuid "2faa6533-bd7f-4045-b3e8-f0563d8bdcb0")
		(effects
			(font
				(size 1 1)
				(thickness 0.15)
			)
		)
	)
	(property "Footprint" ""
		(at 0 0 0)
		(layer "F.Fab")
		(hide yes)
		(uuid "704003c9-b286-42cd-b975-788cdda02e31")
		(effects
			(font
				(size 1.27 1.27)
				(thickness 0.15)
			)
		)
	)
	(property "Datasheet" ""
		(at 0 0 0)
		(layer "F.Fab")
		(hide yes)
		(uuid "2a37eb2a-546e-4217-860a-b7b3000269f9")
		(effects
			(font
				(size 1.27 1.27)
				(thickness 0.15)
			)
		)
	)
	(property "Description" ""
		(at 0 0 0)
		(layer "F.Fab")
		(hide yes)
		(uuid "d13724ad-8470-4f9a-b54b-79ca220f4a02")
		(effects
			(font
				(size 1.27 1.27)
				(thickness 0.15)
			)
		)
	)
	(attr smd)
	(fp_line
		(start -0.261252 -0.735)
		(end 0.261252 -0.735)
		(stroke
			(width 0.12)
			(type solid)
		)
		(layer "F.SilkS")
		(uuid "a3617ca4-f5db-44c3-9130-94b385c7e338")
	)
	(fp_line
		(start -0.261252 0.735)
		(end 0.261252 0.735)
		(stroke
			(width 0.12)
			(type solid)
		)
		(layer "F.SilkS")
		(uuid "cb3d87f1-61a6-4f8a-bd8b-6cf6e1fafe83")
	)
	(fp_line
		(start -1.88 -0.98)
		(end 1.88 -0.98)
		(stroke
			(width 0.05)
			(type solid)
		)
		(layer "F.CrtYd")
		(uuid "f6be3644-2a54-4fbf-bf15-5b6eed6d8a56")
	)
	(fp_line
		(start -1.88 0.98)
		(end -1.88 -0.98)
		(stroke
			(width 0.05)
			(type solid)
		)
		(layer "F.CrtYd")
		(uuid "c529675f-a8ed-44d1-80ae-ea250a6903d7")
	)
	(fp_line
		(start 1.88 -0.98)
		(end 1.88 0.98)
		(stroke
			(width 0.05)
			(type solid)
		)
		(layer "F.CrtYd")
		(uuid "54dff31b-cb37-4ff9-b6c6-2a622ddda3ef")
	)
	(fp_line
		(start 1.88 0.98)
		(end -1.88 0.98)
		(stroke
			(width 0.05)
			(type solid)
		)
		(layer "F.CrtYd")
		(uuid "48d7958a-7eb3-477d-82cc-d56aca09968e")
	)
	(fp_line
		(start -1 -0.625)
		(end 1 -0.625)
		(stroke
			(width 0.1)
			(type solid)
		)
		(layer "F.Fab")
		(uuid "462dcbaa-110b-4c22-b113-3e85baeea0e0")
	)
	(fp_line
		(start -1 0.625)
		(end -1 -0.625)
		(stroke
			(width 0.1)
			(type solid)
		)
		(layer "F.Fab")
		(uuid "c27546ee-1d07-4d96-bdd5-078fe9468528")
	)
	(fp_line
		(start 1 -0.625)
		(end 1 0.625)
		(stroke
			(width 0.1)
			(type solid)
		)
		(layer "F.Fab")
		(uuid "7c9750b1-41ff-4bba-a611-82cfc4e49440")
	)
	(fp_line
		(start 1 0.625)
		(end -1 0.625)
		(stroke
			(width 0.1)
			(type solid)
		)
		(layer "F.Fab")
		(uuid "bfbad6ed-9bbd-4a1a-bdfe-ee50245a621a")
	)
	(fp_text user "${REFERENCE}"
		(at 0 0 0)
		(layer "F.Fab")
		(uuid "2aa51584-7f2e-4a4a-b57d-bfb466824e30")
		(effects
			(font
				(size 0.5 0.5)
				(thickness 0.08)
			)
		)
	)
	(pad "1" smd roundrect
		(at -1.0375 0)
		(size 1.175 1.45)
		(layers "F.Cu" "F.Paste" "F.Mask")
		(roundrect_rratio 0.212766)
		(uuid "5c952ec8-c980-4a94-a972-30f730128869")
	)
	(pad "2" smd roundrect
		(at 1.0375 0)
		(size 1.175 1.45)
		(layers "F.Cu" "F.Paste" "F.Mask")
		(roundrect_rratio 0.212766)
		(uuid "26b8f07a-78fd-4334-a627-c22ac9be221b")
	)
	(model "${KICAD6_3DMODEL_DIR}/Capacitor_SMD.3dshapes/C_0805_2012Metric.wrl"
		(hide yes)
		(offset
			(xyz 0 0 0)
		)
		(scale
			(xyz 1 1 1)
		)
		(rotate
			(xyz 0 0 0)
		)
	)
	(model "${KIPRJMOD}/kicad-library/3D/components.3dshapes/WE-885012207079.stp"
		(offset
			(xyz 0 0 0)
		)
		(scale
			(xyz 1 1 1)
		)
		(rotate
			(xyz 0 0 0)
		)
	)
)
