(footprint "WE-860010674014"
	(version 20240108)
	(generator "pcbnew")
	(generator_version "8.0")
	(layer "F.Cu")
	(descr "CP, Radial series, Radial, pin pitch=3.50mm, , diameter=8mm, Electrolytic Capacitor")
	(tags "CP Radial series Radial pin pitch 3.50mm  diameter 8mm Electrolytic Capacitor")
	(property "Reference" "REF**"
		(at 1.75 -5.25 0)
		(layer "F.SilkS")
		(uuid "dfe7c6f4-3d35-4c8d-92d0-7da79e80ded9")
		(effects
			(font
				(size 1 1)
				(thickness 0.15)
			)
		)
	)
	(property "Value" "WE-860010674014"
		(at 1.75 5.25 0)
		(layer "F.Fab")
		(uuid "46f3fdce-2486-4415-91d2-94e33bdeb753")
		(effects
			(font
				(size 1 1)
				(thickness 0.15)
			)
		)
	)
	(property "Footprint" ""
		(at 0 0 0)
		(layer "F.Fab")
		(hide yes)
		(uuid "0cb79c3a-4ed5-422c-871b-d95a4d53f61a")
		(effects
			(font
				(size 1.27 1.27)
				(thickness 0.15)
			)
		)
	)
	(property "Datasheet" ""
		(at 0 0 0)
		(layer "F.Fab")
		(hide yes)
		(uuid "c91b5b37-ab2f-44e8-9553-a963e1563243")
		(effects
			(font
				(size 1.27 1.27)
				(thickness 0.15)
			)
		)
	)
	(property "Description" ""
		(at 0 0 0)
		(layer "F.Fab")
		(hide yes)
		(uuid "82c43877-e66e-49db-acd8-4db025df3a5d")
		(effects
			(font
				(size 1.27 1.27)
				(thickness 0.15)
			)
		)
	)
	(attr through_hole)
	(fp_line
		(start -2.659698 -2.315)
		(end -1.859698 -2.315)
		(stroke
			(width 0.12)
			(type solid)
		)
		(layer "F.SilkS")
		(uuid "b14faded-ebee-4ef4-8f83-876f8677fcd2")
	)
	(fp_line
		(start -2.259698 -2.715)
		(end -2.259698 -1.915)
		(stroke
			(width 0.12)
			(type solid)
		)
		(layer "F.SilkS")
		(uuid "4b9cbc51-7b5a-4691-b115-0e3235035551")
	)
	(fp_line
		(start 1.75 -4.08)
		(end 1.75 4.08)
		(stroke
			(width 0.12)
			(type solid)
		)
		(layer "F.SilkS")
		(uuid "c9422892-8c74-41ba-90b7-6652551be845")
	)
	(fp_line
		(start 1.79 -4.08)
		(end 1.79 4.08)
		(stroke
			(width 0.12)
			(type solid)
		)
		(layer "F.SilkS")
		(uuid "39cf2866-859e-493c-9a3f-64258b3437ef")
	)
	(fp_line
		(start 1.83 -4.08)
		(end 1.83 4.08)
		(stroke
			(width 0.12)
			(type solid)
		)
		(layer "F.SilkS")
		(uuid "daf7d28e-463f-45f5-80e4-fa30b470fa7f")
	)
	(fp_line
		(start 1.87 -4.079)
		(end 1.87 4.079)
		(stroke
			(width 0.12)
			(type solid)
		)
		(layer "F.SilkS")
		(uuid "98d55840-2995-44a5-b9bd-8497c2c27f97")
	)
	(fp_line
		(start 1.91 -4.077)
		(end 1.91 4.077)
		(stroke
			(width 0.12)
			(type solid)
		)
		(layer "F.SilkS")
		(uuid "18581a74-b9f6-442d-840f-56189507e533")
	)
	(fp_line
		(start 1.95 -4.076)
		(end 1.95 4.076)
		(stroke
			(width 0.12)
			(type solid)
		)
		(layer "F.SilkS")
		(uuid "08422949-8dd2-463f-8588-9c8da2780c0a")
	)
	(fp_line
		(start 1.99 -4.074)
		(end 1.99 4.074)
		(stroke
			(width 0.12)
			(type solid)
		)
		(layer "F.SilkS")
		(uuid "9d113369-1709-4364-b058-68435d877825")
	)
	(fp_line
		(start 2.03 -4.071)
		(end 2.03 4.071)
		(stroke
			(width 0.12)
			(type solid)
		)
		(layer "F.SilkS")
		(uuid "4f672252-13fa-41de-a667-57e9648837c3")
	)
	(fp_line
		(start 2.07 -4.068)
		(end 2.07 4.068)
		(stroke
			(width 0.12)
			(type solid)
		)
		(layer "F.SilkS")
		(uuid "ecb6b833-b830-43bf-9688-d2b42bb3dcd5")
	)
	(fp_line
		(start 2.11 -4.065)
		(end 2.11 4.065)
		(stroke
			(width 0.12)
			(type solid)
		)
		(layer "F.SilkS")
		(uuid "442ccde1-051f-4142-a8ff-0d3909d93615")
	)
	(fp_line
		(start 2.15 -4.061)
		(end 2.15 4.061)
		(stroke
			(width 0.12)
			(type solid)
		)
		(layer "F.SilkS")
		(uuid "0a30a1fe-0281-4815-b336-5ebe19335264")
	)
	(fp_line
		(start 2.19 -4.057)
		(end 2.19 4.057)
		(stroke
			(width 0.12)
			(type solid)
		)
		(layer "F.SilkS")
		(uuid "f32b4782-13e8-4ffa-9d9d-d35e413da094")
	)
	(fp_line
		(start 2.23 -4.052)
		(end 2.23 4.052)
		(stroke
			(width 0.12)
			(type solid)
		)
		(layer "F.SilkS")
		(uuid "ce8b2240-57c7-428d-878e-36f329462efc")
	)
	(fp_line
		(start 2.27 -4.048)
		(end 2.27 4.048)
		(stroke
			(width 0.12)
			(type solid)
		)
		(layer "F.SilkS")
		(uuid "6d28a96f-6314-48df-bc17-c4fc474039d4")
	)
	(fp_line
		(start 2.31 -4.042)
		(end 2.31 4.042)
		(stroke
			(width 0.12)
			(type solid)
		)
		(layer "F.SilkS")
		(uuid "03fe511a-1be4-4bb6-adaa-23b00e71c6b8")
	)
	(fp_line
		(start 2.35 -4.037)
		(end 2.35 4.037)
		(stroke
			(width 0.12)
			(type solid)
		)
		(layer "F.SilkS")
		(uuid "e1ae63c3-d751-4a32-af09-7e8881fd3f21")
	)
	(fp_line
		(start 2.39 -4.03)
		(end 2.39 4.03)
		(stroke
			(width 0.12)
			(type solid)
		)
		(layer "F.SilkS")
		(uuid "36ada390-934b-4d84-8c43-a70f04a472b4")
	)
	(fp_line
		(start 2.43 -4.024)
		(end 2.43 4.024)
		(stroke
			(width 0.12)
			(type solid)
		)
		(layer "F.SilkS")
		(uuid "7df83642-c8d5-4268-92e3-19527de820c1")
	)
	(fp_line
		(start 2.471 -4.017)
		(end 2.471 -1.04)
		(stroke
			(width 0.12)
			(type solid)
		)
		(layer "F.SilkS")
		(uuid "d130b2ca-9ed9-4c5f-b4a1-197cd3c0b962")
	)
	(fp_line
		(start 2.471 1.04)
		(end 2.471 4.017)
		(stroke
			(width 0.12)
			(type solid)
		)
		(layer "F.SilkS")
		(uuid "5d2176c4-bd62-4daa-99bd-b5d339b6a601")
	)
	(fp_line
		(start 2.511 -4.01)
		(end 2.511 -1.04)
		(stroke
			(width 0.12)
			(type solid)
		)
		(layer "F.SilkS")
		(uuid "36012730-ecda-43e4-b996-5287098a0730")
	)
	(fp_line
		(start 2.511 1.04)
		(end 2.511 4.01)
		(stroke
			(width 0.12)
			(type solid)
		)
		(layer "F.SilkS")
		(uuid "29d5509b-bb9c-47a0-b3cd-54f769dd7995")
	)
	(fp_line
		(start 2.551 -4.002)
		(end 2.551 -1.04)
		(stroke
			(width 0.12)
			(type solid)
		)
		(layer "F.SilkS")
		(uuid "26a7fb1a-d0ee-4100-96b7-c9a036a9f7b2")
	)
	(fp_line
		(start 2.551 1.04)
		(end 2.551 4.002)
		(stroke
			(width 0.12)
			(type solid)
		)
		(layer "F.SilkS")
		(uuid "4d641b4a-bd2d-44ab-bb14-d6c0441b4155")
	)
	(fp_line
		(start 2.591 -3.994)
		(end 2.591 -1.04)
		(stroke
			(width 0.12)
			(type solid)
		)
		(layer "F.SilkS")
		(uuid "557916f3-707a-42c7-8517-861726e27031")
	)
	(fp_line
		(start 2.591 1.04)
		(end 2.591 3.994)
		(stroke
			(width 0.12)
			(type solid)
		)
		(layer "F.SilkS")
		(uuid "06f4891a-560f-4430-8d2b-7136adc5b2b4")
	)
	(fp_line
		(start 2.631 -3.985)
		(end 2.631 -1.04)
		(stroke
			(width 0.12)
			(type solid)
		)
		(layer "F.SilkS")
		(uuid "bb654ed4-8648-4254-b551-28a1b19aa835")
	)
	(fp_line
		(start 2.631 1.04)
		(end 2.631 3.985)
		(stroke
			(width 0.12)
			(type solid)
		)
		(layer "F.SilkS")
		(uuid "7f227ef1-b97d-42c3-abb8-b5f2c4573cdb")
	)
	(fp_line
		(start 2.671 -3.976)
		(end 2.671 -1.04)
		(stroke
			(width 0.12)
			(type solid)
		)
		(layer "F.SilkS")
		(uuid "49f0ad2a-fe75-487b-b3bf-549a0d0c1cae")
	)
	(fp_line
		(start 2.671 1.04)
		(end 2.671 3.976)
		(stroke
			(width 0.12)
			(type solid)
		)
		(layer "F.SilkS")
		(uuid "cd715349-c6ff-4606-be0e-fbdf7b23b018")
	)
	(fp_line
		(start 2.711 -3.967)
		(end 2.711 -1.04)
		(stroke
			(width 0.12)
			(type solid)
		)
		(layer "F.SilkS")
		(uuid "33f518bb-0d4a-4b78-901a-bf21d1cf68ce")
	)
	(fp_line
		(start 2.711 1.04)
		(end 2.711 3.967)
		(stroke
			(width 0.12)
			(type solid)
		)
		(layer "F.SilkS")
		(uuid "1aa8a757-8d7e-4d0e-b337-7ca7171da4b0")
	)
	(fp_line
		(start 2.751 -3.957)
		(end 2.751 -1.04)
		(stroke
			(width 0.12)
			(type solid)
		)
		(layer "F.SilkS")
		(uuid "4da5d9e6-2799-4b2b-ac44-bb64a8a9b1c6")
	)
	(fp_line
		(start 2.751 1.04)
		(end 2.751 3.957)
		(stroke
			(width 0.12)
			(type solid)
		)
		(layer "F.SilkS")
		(uuid "affbea80-0642-4898-bf58-b8c6eed8df53")
	)
	(fp_line
		(start 2.791 -3.947)
		(end 2.791 -1.04)
		(stroke
			(width 0.12)
			(type solid)
		)
		(layer "F.SilkS")
		(uuid "11d3cdb3-140f-4c71-a9ba-6e466a3f30f5")
	)
	(fp_line
		(start 2.791 1.04)
		(end 2.791 3.947)
		(stroke
			(width 0.12)
			(type solid)
		)
		(layer "F.SilkS")
		(uuid "ba305456-0b39-46bf-8943-00a062ac3af4")
	)
	(fp_line
		(start 2.831 -3.936)
		(end 2.831 -1.04)
		(stroke
			(width 0.12)
			(type solid)
		)
		(layer "F.SilkS")
		(uuid "3aa8b781-9f42-460d-9eec-922bd3250977")
	)
	(fp_line
		(start 2.831 1.04)
		(end 2.831 3.936)
		(stroke
			(width 0.12)
			(type solid)
		)
		(layer "F.SilkS")
		(uuid "a5c8edab-811d-4fd0-be8c-f076a6600c44")
	)
	(fp_line
		(start 2.871 -3.925)
		(end 2.871 -1.04)
		(stroke
			(width 0.12)
			(type solid)
		)
		(layer "F.SilkS")
		(uuid "4c05297b-4f13-44b4-b458-32cd4f76b2af")
	)
	(fp_line
		(start 2.871 1.04)
		(end 2.871 3.925)
		(stroke
			(width 0.12)
			(type solid)
		)
		(layer "F.SilkS")
		(uuid "bf054b69-d150-4edc-9d5f-f4af8fa3663e")
	)
	(fp_line
		(start 2.911 -3.914)
		(end 2.911 -1.04)
		(stroke
			(width 0.12)
			(type solid)
		)
		(layer "F.SilkS")
		(uuid "fc44287f-e6fa-4f2a-b28d-d96251a9a9a6")
	)
	(fp_line
		(start 2.911 1.04)
		(end 2.911 3.914)
		(stroke
			(width 0.12)
			(type solid)
		)
		(layer "F.SilkS")
		(uuid "5560c645-1e79-4392-8d98-325565595760")
	)
	(fp_line
		(start 2.951 -3.902)
		(end 2.951 -1.04)
		(stroke
			(width 0.12)
			(type solid)
		)
		(layer "F.SilkS")
		(uuid "b984c236-f8d8-4c38-9bb2-b6b027527fbf")
	)
	(fp_line
		(start 2.951 1.04)
		(end 2.951 3.902)
		(stroke
			(width 0.12)
			(type solid)
		)
		(layer "F.SilkS")
		(uuid "2cafff4c-46b0-48d6-bda0-ed3f21d4f69a")
	)
	(fp_line
		(start 2.991 -3.889)
		(end 2.991 -1.04)
		(stroke
			(width 0.12)
			(type solid)
		)
		(layer "F.SilkS")
		(uuid "311a3e5e-70a9-4a52-9ce9-b86f4a30856d")
	)
	(fp_line
		(start 2.991 1.04)
		(end 2.991 3.889)
		(stroke
			(width 0.12)
			(type solid)
		)
		(layer "F.SilkS")
		(uuid "5b7034e8-0535-4ba7-9330-49d582e51397")
	)
	(fp_line
		(start 3.031 -3.877)
		(end 3.031 -1.04)
		(stroke
			(width 0.12)
			(type solid)
		)
		(layer "F.SilkS")
		(uuid "a8a6cf4f-8ea2-4302-8350-4f8a0d676df5")
	)
	(fp_line
		(start 3.031 1.04)
		(end 3.031 3.877)
		(stroke
			(width 0.12)
			(type solid)
		)
		(layer "F.SilkS")
		(uuid "0b690877-a678-455c-ba2b-2b276f4d55f0")
	)
	(fp_line
		(start 3.071 -3.863)
		(end 3.071 -1.04)
		(stroke
			(width 0.12)
			(type solid)
		)
		(layer "F.SilkS")
		(uuid "90e6f3e2-6121-42ab-ad2c-e92f19d54e28")
	)
	(fp_line
		(start 3.071 1.04)
		(end 3.071 3.863)
		(stroke
			(width 0.12)
			(type solid)
		)
		(layer "F.SilkS")
		(uuid "3c8eba8a-b89c-47ab-91c7-5b18957889ac")
	)
	(fp_line
		(start 3.111 -3.85)
		(end 3.111 -1.04)
		(stroke
			(width 0.12)
			(type solid)
		)
		(layer "F.SilkS")
		(uuid "0dc643bf-5b59-45f7-91d4-a96ca21d7e59")
	)
	(fp_line
		(start 3.111 1.04)
		(end 3.111 3.85)
		(stroke
			(width 0.12)
			(type solid)
		)
		(layer "F.SilkS")
		(uuid "da9a1c72-5c4e-4921-b983-96b230110d9f")
	)
	(fp_line
		(start 3.151 -3.835)
		(end 3.151 -1.04)
		(stroke
			(width 0.12)
			(type solid)
		)
		(layer "F.SilkS")
		(uuid "51b422fb-f0f2-445e-9003-519de713e2f9")
	)
	(fp_line
		(start 3.151 1.04)
		(end 3.151 3.835)
		(stroke
			(width 0.12)
			(type solid)
		)
		(layer "F.SilkS")
		(uuid "6b1cc03c-fe94-434f-a151-c7121141fa3e")
	)
	(fp_line
		(start 3.191 -3.821)
		(end 3.191 -1.04)
		(stroke
			(width 0.12)
			(type solid)
		)
		(layer "F.SilkS")
		(uuid "a3ed9598-569d-499b-9342-e586f9627a5f")
	)
	(fp_line
		(start 3.191 1.04)
		(end 3.191 3.821)
		(stroke
			(width 0.12)
			(type solid)
		)
		(layer "F.SilkS")
		(uuid "99381a08-3185-4a4d-b2e6-1383b0af01b4")
	)
	(fp_line
		(start 3.231 -3.805)
		(end 3.231 -1.04)
		(stroke
			(width 0.12)
			(type solid)
		)
		(layer "F.SilkS")
		(uuid "cceddd0f-b3a4-48e1-8daf-38698cf596fc")
	)
	(fp_line
		(start 3.231 1.04)
		(end 3.231 3.805)
		(stroke
			(width 0.12)
			(type solid)
		)
		(layer "F.SilkS")
		(uuid "b8676b28-6a76-4401-981d-5abe33814316")
	)
	(fp_line
		(start 3.271 -3.79)
		(end 3.271 -1.04)
		(stroke
			(width 0.12)
			(type solid)
		)
		(layer "F.SilkS")
		(uuid "2aadc164-21d5-4d8b-85e3-7bbcc266c376")
	)
	(fp_line
		(start 3.271 1.04)
		(end 3.271 3.79)
		(stroke
			(width 0.12)
			(type solid)
		)
		(layer "F.SilkS")
		(uuid "72bf249a-50ed-4f71-a8a9-58737fcca107")
	)
	(fp_line
		(start 3.311 -3.774)
		(end 3.311 -1.04)
		(stroke
			(width 0.12)
			(type solid)
		)
		(layer "F.SilkS")
		(uuid "c6951a12-84fd-4a7e-8a88-44736fee4fca")
	)
	(fp_line
		(start 3.311 1.04)
		(end 3.311 3.774)
		(stroke
			(width 0.12)
			(type solid)
		)
		(layer "F.SilkS")
		(uuid "1afd9380-d34e-4762-b7ff-6c161b99ba11")
	)
	(fp_line
		(start 3.351 -3.757)
		(end 3.351 -1.04)
		(stroke
			(width 0.12)
			(type solid)
		)
		(layer "F.SilkS")
		(uuid "efa387ba-1c82-4f17-852d-b54d60d48be2")
	)
	(fp_line
		(start 3.351 1.04)
		(end 3.351 3.757)
		(stroke
			(width 0.12)
			(type solid)
		)
		(layer "F.SilkS")
		(uuid "bfa1aebf-6dbd-41e6-aa42-31c4118f02e3")
	)
	(fp_line
		(start 3.391 -3.74)
		(end 3.391 -1.04)
		(stroke
			(width 0.12)
			(type solid)
		)
		(layer "F.SilkS")
		(uuid "2249bc6d-f38b-4533-b23c-cbf8eaed99f2")
	)
	(fp_line
		(start 3.391 1.04)
		(end 3.391 3.74)
		(stroke
			(width 0.12)
			(type solid)
		)
		(layer "F.SilkS")
		(uuid "5b5c73b6-f8c8-4acc-abe3-72f5abc64eb7")
	)
	(fp_line
		(start 3.431 -3.722)
		(end 3.431 -1.04)
		(stroke
			(width 0.12)
			(type solid)
		)
		(layer "F.SilkS")
		(uuid "aa779297-36f6-402b-8606-f38ffe24ed29")
	)
	(fp_line
		(start 3.431 1.04)
		(end 3.431 3.722)
		(stroke
			(width 0.12)
			(type solid)
		)
		(layer "F.SilkS")
		(uuid "4e657a49-d541-421d-8f33-c38e43df9049")
	)
	(fp_line
		(start 3.471 -3.704)
		(end 3.471 -1.04)
		(stroke
			(width 0.12)
			(type solid)
		)
		(layer "F.SilkS")
		(uuid "a3559b4d-cf71-4468-8b67-4410c87245ea")
	)
	(fp_line
		(start 3.471 1.04)
		(end 3.471 3.704)
		(stroke
			(width 0.12)
			(type solid)
		)
		(layer "F.SilkS")
		(uuid "7074a926-6e9f-4d8d-9d1b-f94da2f933ae")
	)
	(fp_line
		(start 3.511 -3.686)
		(end 3.511 -1.04)
		(stroke
			(width 0.12)
			(type solid)
		)
		(layer "F.SilkS")
		(uuid "21aaf6d2-0a2b-4b58-aab1-ba5f907be839")
	)
	(fp_line
		(start 3.511 1.04)
		(end 3.511 3.686)
		(stroke
			(width 0.12)
			(type solid)
		)
		(layer "F.SilkS")
		(uuid "f18a965b-6b5c-496a-a3ad-798fdab84f1f")
	)
	(fp_line
		(start 3.551 -3.666)
		(end 3.551 -1.04)
		(stroke
			(width 0.12)
			(type solid)
		)
		(layer "F.SilkS")
		(uuid "c34c02cb-3d90-49f4-835e-6745943eb1bf")
	)
	(fp_line
		(start 3.551 1.04)
		(end 3.551 3.666)
		(stroke
			(width 0.12)
			(type solid)
		)
		(layer "F.SilkS")
		(uuid "529dd6d2-a228-4e36-be61-53e72020e1e1")
	)
	(fp_line
		(start 3.591 -3.647)
		(end 3.591 -1.04)
		(stroke
			(width 0.12)
			(type solid)
		)
		(layer "F.SilkS")
		(uuid "e3fff3e6-5f10-4a22-9e4f-6ee9d96989f9")
	)
	(fp_line
		(start 3.591 1.04)
		(end 3.591 3.647)
		(stroke
			(width 0.12)
			(type solid)
		)
		(layer "F.SilkS")
		(uuid "ee323c07-0199-4ecc-ba49-6fb71cc229b7")
	)
	(fp_line
		(start 3.631 -3.627)
		(end 3.631 -1.04)
		(stroke
			(width 0.12)
			(type solid)
		)
		(layer "F.SilkS")
		(uuid "c7792719-e7cb-466f-9e8c-ce4ae96f50b3")
	)
	(fp_line
		(start 3.631 1.04)
		(end 3.631 3.627)
		(stroke
			(width 0.12)
			(type solid)
		)
		(layer "F.SilkS")
		(uuid "9a8c488d-a831-4685-984c-4226c229222d")
	)
	(fp_line
		(start 3.671 -3.606)
		(end 3.671 -1.04)
		(stroke
			(width 0.12)
			(type solid)
		)
		(layer "F.SilkS")
		(uuid "525c88e3-8397-4079-8b06-4b1a941e81ce")
	)
	(fp_line
		(start 3.671 1.04)
		(end 3.671 3.606)
		(stroke
			(width 0.12)
			(type solid)
		)
		(layer "F.SilkS")
		(uuid "57dabdc8-299a-4963-8cbb-a33522855c96")
	)
	(fp_line
		(start 3.711 -3.584)
		(end 3.711 -1.04)
		(stroke
			(width 0.12)
			(type solid)
		)
		(layer "F.SilkS")
		(uuid "beb514f1-aebc-4677-8fde-79b594a7d19f")
	)
	(fp_line
		(start 3.711 1.04)
		(end 3.711 3.584)
		(stroke
			(width 0.12)
			(type solid)
		)
		(layer "F.SilkS")
		(uuid "46c4dded-1b06-471a-9dd8-6512fd86ed6d")
	)
	(fp_line
		(start 3.751 -3.562)
		(end 3.751 -1.04)
		(stroke
			(width 0.12)
			(type solid)
		)
		(layer "F.SilkS")
		(uuid "97343f43-099b-4cdf-bf96-17aaa8c6050b")
	)
	(fp_line
		(start 3.751 1.04)
		(end 3.751 3.562)
		(stroke
			(width 0.12)
			(type solid)
		)
		(layer "F.SilkS")
		(uuid "5d3b88e4-5862-43fa-8841-42ddeeebed3f")
	)
	(fp_line
		(start 3.791 -3.54)
		(end 3.791 -1.04)
		(stroke
			(width 0.12)
			(type solid)
		)
		(layer "F.SilkS")
		(uuid "6c43b337-7729-4f15-aff5-7bff51a15753")
	)
	(fp_line
		(start 3.791 1.04)
		(end 3.791 3.54)
		(stroke
			(width 0.12)
			(type solid)
		)
		(layer "F.SilkS")
		(uuid "1984f1f0-1b9c-4c5b-bb99-36364cbd64cc")
	)
	(fp_line
		(start 3.831 -3.517)
		(end 3.831 -1.04)
		(stroke
			(width 0.12)
			(type solid)
		)
		(layer "F.SilkS")
		(uuid "688cb83b-4d8a-4d28-ad1d-db4730d8a86b")
	)
	(fp_line
		(start 3.831 1.04)
		(end 3.831 3.517)
		(stroke
			(width 0.12)
			(type solid)
		)
		(layer "F.SilkS")
		(uuid "96183376-1195-4958-85b4-d4b5d7390f40")
	)
	(fp_line
		(start 3.871 -3.493)
		(end 3.871 -1.04)
		(stroke
			(width 0.12)
			(type solid)
		)
		(layer "F.SilkS")
		(uuid "abf2d1c1-e6a5-4465-a781-b425e3d96bbe")
	)
	(fp_line
		(start 3.871 1.04)
		(end 3.871 3.493)
		(stroke
			(width 0.12)
			(type solid)
		)
		(layer "F.SilkS")
		(uuid "34093560-60fc-475b-b03e-2321a20f6fa5")
	)
	(fp_line
		(start 3.911 -3.469)
		(end 3.911 -1.04)
		(stroke
			(width 0.12)
			(type solid)
		)
		(layer "F.SilkS")
		(uuid "39e051e3-012a-4fff-a867-6265e04947d5")
	)
	(fp_line
		(start 3.911 1.04)
		(end 3.911 3.469)
		(stroke
			(width 0.12)
			(type solid)
		)
		(layer "F.SilkS")
		(uuid "cca1cf42-c864-4e75-a7da-36f7a1cba816")
	)
	(fp_line
		(start 3.951 -3.444)
		(end 3.951 -1.04)
		(stroke
			(width 0.12)
			(type solid)
		)
		(layer "F.SilkS")
		(uuid "eef01fed-159c-4c5a-95f0-6977b0e91889")
	)
	(fp_line
		(start 3.951 1.04)
		(end 3.951 3.444)
		(stroke
			(width 0.12)
			(type solid)
		)
		(layer "F.SilkS")
		(uuid "c1265aa8-5960-4395-961b-bbb1e274fdee")
	)
	(fp_line
		(start 3.991 -3.418)
		(end 3.991 -1.04)
		(stroke
			(width 0.12)
			(type solid)
		)
		(layer "F.SilkS")
		(uuid "d217caaa-453c-4fe5-bc75-5833a929ce17")
	)
	(fp_line
		(start 3.991 1.04)
		(end 3.991 3.418)
		(stroke
			(width 0.12)
			(type solid)
		)
		(layer "F.SilkS")
		(uuid "4f51f32d-2a50-44f1-8c15-f423cb519236")
	)
	(fp_line
		(start 4.031 -3.392)
		(end 4.031 -1.04)
		(stroke
			(width 0.12)
			(type solid)
		)
		(layer "F.SilkS")
		(uuid "29f8e38b-aa7e-432f-acd4-dc7ba4eb55c8")
	)
	(fp_line
		(start 4.031 1.04)
		(end 4.031 3.392)
		(stroke
			(width 0.12)
			(type solid)
		)
		(layer "F.SilkS")
		(uuid "8e80b110-d196-4b82-9dd9-e2af8daa739c")
	)
	(fp_line
		(start 4.071 -3.365)
		(end 4.071 -1.04)
		(stroke
			(width 0.12)
			(type solid)
		)
		(layer "F.SilkS")
		(uuid "bd0c59e6-0980-4a72-847c-2604620e71b5")
	)
	(fp_line
		(start 4.071 1.04)
		(end 4.071 3.365)
		(stroke
			(width 0.12)
			(type solid)
		)
		(layer "F.SilkS")
		(uuid "5c983737-0823-4b0c-9db3-ea6621ff367e")
	)
	(fp_line
		(start 4.111 -3.338)
		(end 4.111 -1.04)
		(stroke
			(width 0.12)
			(type solid)
		)
		(layer "F.SilkS")
		(uuid "7c791526-8e82-445a-ad41-5067f31dad0b")
	)
	(fp_line
		(start 4.111 1.04)
		(end 4.111 3.338)
		(stroke
			(width 0.12)
			(type solid)
		)
		(layer "F.SilkS")
		(uuid "a4ea7fef-72ab-4321-9f4e-16a9bc3048ef")
	)
	(fp_line
		(start 4.151 -3.309)
		(end 4.151 -1.04)
		(stroke
			(width 0.12)
			(type solid)
		)
		(layer "F.SilkS")
		(uuid "e5483e03-469f-4272-94e7-a1767148b567")
	)
	(fp_line
		(start 4.151 1.04)
		(end 4.151 3.309)
		(stroke
			(width 0.12)
			(type solid)
		)
		(layer "F.SilkS")
		(uuid "fd9c2af5-9bb2-4df2-9007-5d63474997c2")
	)
	(fp_line
		(start 4.191 -3.28)
		(end 4.191 -1.04)
		(stroke
			(width 0.12)
			(type solid)
		)
		(layer "F.SilkS")
		(uuid "905a07fa-0009-4c0f-8986-037864a2db05")
	)
	(fp_line
		(start 4.191 1.04)
		(end 4.191 3.28)
		(stroke
			(width 0.12)
			(type solid)
		)
		(layer "F.SilkS")
		(uuid "aa7e8cf0-a922-4841-a35a-4b2ebbd797b8")
	)
	(fp_line
		(start 4.231 -3.25)
		(end 4.231 -1.04)
		(stroke
			(width 0.12)
			(type solid)
		)
		(layer "F.SilkS")
		(uuid "d7ae80ba-a315-40c9-ab1f-595f19f11e63")
	)
	(fp_line
		(start 4.231 1.04)
		(end 4.231 3.25)
		(stroke
			(width 0.12)
			(type solid)
		)
		(layer "F.SilkS")
		(uuid "bcc4674e-523b-4454-bf4b-a76c47baaad4")
	)
	(fp_line
		(start 4.271 -3.22)
		(end 4.271 -1.04)
		(stroke
			(width 0.12)
			(type solid)
		)
		(layer "F.SilkS")
		(uuid "c559927b-8a78-4638-95d7-0ede73b862fc")
	)
	(fp_line
		(start 4.271 1.04)
		(end 4.271 3.22)
		(stroke
			(width 0.12)
			(type solid)
		)
		(layer "F.SilkS")
		(uuid "43fbf494-e2a3-4f53-8bb5-826056115673")
	)
	(fp_line
		(start 4.311 -3.189)
		(end 4.311 -1.04)
		(stroke
			(width 0.12)
			(type solid)
		)
		(layer "F.SilkS")
		(uuid "c530cc5d-e16d-4b7a-a69c-5e7698b18c66")
	)
	(fp_line
		(start 4.311 1.04)
		(end 4.311 3.189)
		(stroke
			(width 0.12)
			(type solid)
		)
		(layer "F.SilkS")
		(uuid "5460ce65-de45-4cd7-abcd-6b7b5e44a29f")
	)
	(fp_line
		(start 4.351 -3.156)
		(end 4.351 -1.04)
		(stroke
			(width 0.12)
			(type solid)
		)
		(layer "F.SilkS")
		(uuid "d38a8f70-8f9e-4e1e-973f-a49d279bcef1")
	)
	(fp_line
		(start 4.351 1.04)
		(end 4.351 3.156)
		(stroke
			(width 0.12)
			(type solid)
		)
		(layer "F.SilkS")
		(uuid "629e996c-6d83-4df4-a91f-f507e8800af7")
	)
	(fp_line
		(start 4.391 -3.124)
		(end 4.391 -1.04)
		(stroke
			(width 0.12)
			(type solid)
		)
		(layer "F.SilkS")
		(uuid "42ad6a91-abdd-43fd-a92c-ce699017fc4d")
	)
	(fp_line
		(start 4.391 1.04)
		(end 4.391 3.124)
		(stroke
			(width 0.12)
			(type solid)
		)
		(layer "F.SilkS")
		(uuid "6c8120f0-91f1-4836-8ba5-fb7aac8a697c")
	)
	(fp_line
		(start 4.431 -3.09)
		(end 4.431 -1.04)
		(stroke
			(width 0.12)
			(type solid)
		)
		(layer "F.SilkS")
		(uuid "814a54b3-7a08-4e12-ab8b-617d308d0673")
	)
	(fp_line
		(start 4.431 1.04)
		(end 4.431 3.09)
		(stroke
			(width 0.12)
			(type solid)
		)
		(layer "F.SilkS")
		(uuid "9a80477c-a209-4c64-bed7-638548ea1dfe")
	)
	(fp_line
		(start 4.471 -3.055)
		(end 4.471 -1.04)
		(stroke
			(width 0.12)
			(type solid)
		)
		(layer "F.SilkS")
		(uuid "a25f1723-ab61-42de-81e9-f0f0231f78a1")
	)
	(fp_line
		(start 4.471 1.04)
		(end 4.471 3.055)
		(stroke
			(width 0.12)
			(type solid)
		)
		(layer "F.SilkS")
		(uuid "62d7879d-ea12-4449-a091-db7627b4fde6")
	)
	(fp_line
		(start 4.511 -3.019)
		(end 4.511 -1.04)
		(stroke
			(width 0.12)
			(type solid)
		)
		(layer "F.SilkS")
		(uuid "6cf4d18c-0011-4dd3-9c5c-a81a62920369")
	)
	(fp_line
		(start 4.511 1.04)
		(end 4.511 3.019)
		(stroke
			(width 0.12)
			(type solid)
		)
		(layer "F.SilkS")
		(uuid "99ca7518-6570-4c63-af4a-ddc103b433bd")
	)
	(fp_line
		(start 4.551 -2.983)
		(end 4.551 2.983)
		(stroke
			(width 0.12)
			(type solid)
		)
		(layer "F.SilkS")
		(uuid "99505336-e473-4576-9297-e5bfac59c61c")
	)
	(fp_line
		(start 4.591 -2.945)
		(end 4.591 2.945)
		(stroke
			(width 0.12)
			(type solid)
		)
		(layer "F.SilkS")
		(uuid "03d63442-50a7-46cc-b0b0-406837bf8522")
	)
	(fp_line
		(start 4.631 -2.907)
		(end 4.631 2.907)
		(stroke
			(width 0.12)
			(type solid)
		)
		(layer "F.SilkS")
		(uuid "21755d62-d0d9-4798-968b-36ef6375c239")
	)
	(fp_line
		(start 4.671 -2.867)
		(end 4.671 2.867)
		(stroke
			(width 0.12)
			(type solid)
		)
		(layer "F.SilkS")
		(uuid "ba36f96c-8459-4a87-a80f-1474667df637")
	)
	(fp_line
		(start 4.711 -2.826)
		(end 4.711 2.826)
		(stroke
			(width 0.12)
			(type solid)
		)
		(layer "F.SilkS")
		(uuid "40cf7dcc-2322-4cd4-8d8c-a4c003dbb1a5")
	)
	(fp_line
		(start 4.751 -2.784)
		(end 4.751 2.784)
		(stroke
			(width 0.12)
			(type solid)
		)
		(layer "F.SilkS")
		(uuid "a0f40d06-f657-43e5-b47b-ec3b6bc59b5e")
	)
	(fp_line
		(start 4.791 -2.741)
		(end 4.791 2.741)
		(stroke
			(width 0.12)
			(type solid)
		)
		(layer "F.SilkS")
		(uuid "62ee5291-c9b8-4831-899f-29bd533f0ad9")
	)
	(fp_line
		(start 4.831 -2.697)
		(end 4.831 2.697)
		(stroke
			(width 0.12)
			(type solid)
		)
		(layer "F.SilkS")
		(uuid "2375b820-b253-47c6-b863-6b792feea2fe")
	)
	(fp_line
		(start 4.871 -2.651)
		(end 4.871 2.651)
		(stroke
			(width 0.12)
			(type solid)
		)
		(layer "F.SilkS")
		(uuid "58d8705b-786d-4cce-8c59-de2c31d44a96")
	)
	(fp_line
		(start 4.911 -2.604)
		(end 4.911 2.604)
		(stroke
			(width 0.12)
			(type solid)
		)
		(layer "F.SilkS")
		(uuid "e11cdfef-5e49-4caa-aa89-0213d22b6c74")
	)
	(fp_line
		(start 4.951 -2.556)
		(end 4.951 2.556)
		(stroke
			(width 0.12)
			(type solid)
		)
		(layer "F.SilkS")
		(uuid "34eea1f0-edc4-4e6f-a235-977768de1e85")
	)
	(fp_line
		(start 4.991 -2.505)
		(end 4.991 2.505)
		(stroke
			(width 0.12)
			(type solid)
		)
		(layer "F.SilkS")
		(uuid "1752653d-e99e-4ea5-9fc4-faac24c5f3dd")
	)
	(fp_line
		(start 5.031 -2.454)
		(end 5.031 2.454)
		(stroke
			(width 0.12)
			(type solid)
		)
		(layer "F.SilkS")
		(uuid "f9e8ff6e-9740-4dca-b8e3-ffca9aaadb5d")
	)
	(fp_line
		(start 5.071 -2.4)
		(end 5.071 2.4)
		(stroke
			(width 0.12)
			(type solid)
		)
		(layer "F.SilkS")
		(uuid "8e322abb-8b62-4434-bf04-07ad0b136997")
	)
	(fp_line
		(start 5.111 -2.345)
		(end 5.111 2.345)
		(stroke
			(width 0.12)
			(type solid)
		)
		(layer "F.SilkS")
		(uuid "c03709f4-82a8-40ca-a7d8-653ee6349ac5")
	)
	(fp_line
		(start 5.151 -2.287)
		(end 5.151 2.287)
		(stroke
			(width 0.12)
			(type solid)
		)
		(layer "F.SilkS")
		(uuid "0d637777-bd28-47f2-8bc6-b38f01598cc5")
	)
	(fp_line
		(start 5.191 -2.228)
		(end 5.191 2.228)
		(stroke
			(width 0.12)
			(type solid)
		)
		(layer "F.SilkS")
		(uuid "d4257cc1-591e-42cc-a228-794717efa6ee")
	)
	(fp_line
		(start 5.231 -2.166)
		(end 5.231 2.166)
		(stroke
			(width 0.12)
			(type solid)
		)
		(layer "F.SilkS")
		(uuid "4198bb20-e3cc-42d5-be52-21c10601f550")
	)
	(fp_line
		(start 5.271 -2.102)
		(end 5.271 2.102)
		(stroke
			(width 0.12)
			(type solid)
		)
		(layer "F.SilkS")
		(uuid "856bb4db-02b9-477c-9f30-0dcdc93e77e1")
	)
	(fp_line
		(start 5.311 -2.034)
		(end 5.311 2.034)
		(stroke
			(width 0.12)
			(type solid)
		)
		(layer "F.SilkS")
		(uuid "9371006e-03e3-4efe-8802-eba579b4ab2b")
	)
	(fp_line
		(start 5.351 -1.964)
		(end 5.351 1.964)
		(stroke
			(width 0.12)
			(type solid)
		)
		(layer "F.SilkS")
		(uuid "844cb6ca-8c6d-4d32-9dba-e9d64e856601")
	)
	(fp_line
		(start 5.391 -1.89)
		(end 5.391 1.89)
		(stroke
			(width 0.12)
			(type solid)
		)
		(layer "F.SilkS")
		(uuid "bbc68b8b-e336-43db-b9d1-ee5cc0572fd0")
	)
	(fp_line
		(start 5.431 -1.813)
		(end 5.431 1.813)
		(stroke
			(width 0.12)
			(type solid)
		)
		(layer "F.SilkS")
		(uuid "35a39320-b52a-4dfe-a649-e5da56815542")
	)
	(fp_line
		(start 5.471 -1.731)
		(end 5.471 1.731)
		(stroke
			(width 0.12)
			(type solid)
		)
		(layer "F.SilkS")
		(uuid "ec187641-ead2-4a33-be91-b076d359b001")
	)
	(fp_line
		(start 5.511 -1.645)
		(end 5.511 1.645)
		(stroke
			(width 0.12)
			(type solid)
		)
		(layer "F.SilkS")
		(uuid "133d7e3f-2fb5-4a8f-affb-9e0935647e8d")
	)
	(fp_line
		(start 5.551 -1.552)
		(end 5.551 1.552)
		(stroke
			(width 0.12)
			(type solid)
		)
		(layer "F.SilkS")
		(uuid "c83c6e1b-6348-4791-816e-6ea499274b8a")
	)
	(fp_line
		(start 5.591 -1.453)
		(end 5.591 1.453)
		(stroke
			(width 0.12)
			(type solid)
		)
		(layer "F.SilkS")
		(uuid "ed396d19-92f9-4313-89f0-62c71d472834")
	)
	(fp_line
		(start 5.631 -1.346)
		(end 5.631 1.346)
		(stroke
			(width 0.12)
			(type solid)
		)
		(layer "F.SilkS")
		(uuid "da816f57-1a45-4c15-b14a-e85d4b0ea7af")
	)
	(fp_line
		(start 5.671 -1.229)
		(end 5.671 1.229)
		(stroke
			(width 0.12)
			(type solid)
		)
		(layer "F.SilkS")
		(uuid "4470ac26-9f4f-46c0-8c9d-e909f53ff858")
	)
	(fp_line
		(start 5.711 -1.098)
		(end 5.711 1.098)
		(stroke
			(width 0.12)
			(type solid)
		)
		(layer "F.SilkS")
		(uuid "e5ab0f9c-99ea-4d3e-be88-d556132a443a")
	)
	(fp_line
		(start 5.751 -0.948)
		(end 5.751 0.948)
		(stroke
			(width 0.12)
			(type solid)
		)
		(layer "F.SilkS")
		(uuid "f7a51dd7-4bd8-4eb5-b8a2-2428c32159b7")
	)
	(fp_line
		(start 5.791 -0.768)
		(end 5.791 0.768)
		(stroke
			(width 0.12)
			(type solid)
		)
		(layer "F.SilkS")
		(uuid "b77c13f4-6ebc-4339-9692-98d0a7dbf49c")
	)
	(fp_line
		(start 5.831 -0.533)
		(end 5.831 0.533)
		(stroke
			(width 0.12)
			(type solid)
		)
		(layer "F.SilkS")
		(uuid "8cb81655-99c2-44e8-82dd-e6a9dc7a54e1")
	)
	(fp_circle
		(center 1.75 0)
		(end 5.87 0)
		(stroke
			(width 0.12)
			(type solid)
		)
		(fill none)
		(layer "F.SilkS")
		(uuid "d5cbda1c-0035-499b-b592-992a39d21780")
	)
	(fp_circle
		(center 1.75 0)
		(end 6 0)
		(stroke
			(width 0.05)
			(type solid)
		)
		(fill none)
		(layer "F.CrtYd")
		(uuid "7e069623-3948-430e-92a4-a99f08272e60")
	)
	(fp_line
		(start -1.676759 -1.7475)
		(end -0.876759 -1.7475)
		(stroke
			(width 0.1)
			(type solid)
		)
		(layer "F.Fab")
		(uuid "0deaf689-a9b8-44d7-8597-97672a70b331")
	)
	(fp_line
		(start -1.276759 -2.1475)
		(end -1.276759 -1.3475)
		(stroke
			(width 0.1)
			(type solid)
		)
		(layer "F.Fab")
		(uuid "e010dbf8-2557-4475-b757-556d79952a45")
	)
	(fp_circle
		(center 1.75 0)
		(end 5.75 0)
		(stroke
			(width 0.1)
			(type solid)
		)
		(fill none)
		(layer "F.Fab")
		(uuid "3815be5f-52dc-4d9c-b331-e40b6d757093")
	)
	(fp_text user "${REFERENCE}"
		(at 1.75 0 0)
		(layer "F.Fab")
		(uuid "19cde737-6f64-4a4e-bbc6-a70404d9f27e")
		(effects
			(font
				(size 1 1)
				(thickness 0.15)
			)
		)
	)
	(pad "1" thru_hole rect
		(at 0 0)
		(size 1.6 1.6)
		(drill 0.8)
		(layers "*.Cu" "*.Mask")
		(remove_unused_layers no)
		(uuid "71eb0b98-d495-454c-aa36-62aa5b70781f")
	)
	(pad "2" thru_hole circle
		(at 3.5 0)
		(size 1.6 1.6)
		(drill 0.8)
		(layers "*.Cu" "*.Mask")
		(remove_unused_layers no)
		(uuid "c605e50c-0020-44b7-9271-6776795f5350")
	)
	(model "${KICAD6_3DMODEL_DIR}/Capacitor_THT.3dshapes/CP_Radial_D8.0mm_P3.50mm.wrl"
		(hide yes)
		(offset
			(xyz 0 0 0)
		)
		(scale
			(xyz 1 1 1)
		)
		(rotate
			(xyz 0 0 0)
		)
	)
	(model "${KIPRJMOD}/kicad-library/3D/components.3dshapes/WE-860010674014.stp"
		(offset
			(xyz 1.75 0 0.3)
		)
		(scale
			(xyz 1 1 1)
		)
		(rotate
			(xyz 0 0 -180)
		)
	)
)
