(footprint "WCAP-ASLI_12.5X14(DXL)"
	(version 20240108)
	(generator "pcbnew")
	(generator_version "8.0")
	(layer "F.Cu")
	(descr "<B>WCAP-ASLI</B><BR> Aluminium Electrolytic Capacitors,12.5X14X4.5(DiameterXLengthXP)")
	(property "Reference" "REF**"
		(at -1 -8.435 0)
		(layer "F.SilkS")
		(uuid "b23c4a1c-d879-49ea-bab1-657bce122053")
		(effects
			(font
				(size 1 1)
				(thickness 0.15)
			)
		)
	)
	(property "Value" "WCAP-ASLI_12.5X14_DXL_"
		(at -0.7 8.265 0)
		(layer "F.Fab")
		(uuid "25b15601-b938-4e90-9262-0a57a21b1ded")
		(effects
			(font
				(size 1 1)
				(thickness 0.15)
			)
		)
	)
	(property "Footprint" ""
		(at 0 0 0)
		(layer "F.Fab")
		(hide yes)
		(uuid "6d3bc828-e453-414f-a55f-791aca372cee")
		(effects
			(font
				(size 1.27 1.27)
				(thickness 0.15)
			)
		)
	)
	(property "Datasheet" ""
		(at 0 0 0)
		(layer "F.Fab")
		(hide yes)
		(uuid "0500deb4-4ee5-438d-8f8f-beb92fa758fb")
		(effects
			(font
				(size 1.27 1.27)
				(thickness 0.15)
			)
		)
	)
	(property "Description" ""
		(at 0 0 0)
		(layer "F.Fab")
		(hide yes)
		(uuid "0de9bebe-1b5d-4cc0-a270-ee0b2b704a1c")
		(effects
			(font
				(size 1.27 1.27)
				(thickness 0.15)
			)
		)
	)
	(attr smd)
	(fp_line
		(start -6.85 -6.85)
		(end -6.85 -1.55)
		(stroke
			(width 0.2)
			(type solid)
		)
		(layer "F.SilkS")
		(uuid "b42108a2-0178-452a-8b47-b1c7f29aacf5")
	)
	(fp_line
		(start -6.85 -6.85)
		(end 4.05 -6.85)
		(stroke
			(width 0.2)
			(type solid)
		)
		(layer "F.SilkS")
		(uuid "12806861-90ca-45a0-a8bf-48cf1ee685ff")
	)
	(fp_line
		(start -6.85 6.85)
		(end -6.85 1.55)
		(stroke
			(width 0.2)
			(type solid)
		)
		(layer "F.SilkS")
		(uuid "0d23cb7f-74fb-4e73-9262-c80f8f4887fd")
	)
	(fp_line
		(start -6.85 6.85)
		(end 4.05 6.85)
		(stroke
			(width 0.2)
			(type solid)
		)
		(layer "F.SilkS")
		(uuid "c44d226b-9e64-4ebb-9b50-26d46ebfa907")
	)
	(fp_line
		(start 4.05 -6.85)
		(end 6.85 -4.05)
		(stroke
			(width 0.2)
			(type solid)
		)
		(layer "F.SilkS")
		(uuid "17fadf67-d5e7-4a93-9c00-033fa5052546")
	)
	(fp_line
		(start 4.05 6.85)
		(end 6.85 4.05)
		(stroke
			(width 0.2)
			(type solid)
		)
		(layer "F.SilkS")
		(uuid "211646f9-da52-4778-b6fe-51d6efa27453")
	)
	(fp_line
		(start 6.85 -4.05)
		(end 6.85 -1.55)
		(stroke
			(width 0.2)
			(type solid)
		)
		(layer "F.SilkS")
		(uuid "def5c045-0b7d-4419-8783-d6000fd6370c")
	)
	(fp_line
		(start 6.85 4.05)
		(end 6.85 1.55)
		(stroke
			(width 0.2)
			(type solid)
		)
		(layer "F.SilkS")
		(uuid "1b8053a3-40b7-4073-a880-8f51819d8633")
	)
	(fp_poly
		(pts
			(xy 4.15 -7.05) (xy -7.05 -7.05) (xy -7.05 -1.45) (xy -8.15 -1.45) (xy -8.15 1.45) (xy -7.05 1.45)
			(xy -7.05 7.05) (xy 4.2 7.05) (xy 7.05 4.1) (xy 7.05 1.45) (xy 8.15 1.45) (xy 8.15 -1.45) (xy 7.05 -1.45)
			(xy 7.05 -4.15)
		)
		(stroke
			(width 0.1)
			(type solid)
		)
		(fill none)
		(layer "F.CrtYd")
		(uuid "cda6c73f-9056-4daf-8492-f0e7c91a20c0")
	)
	(fp_line
		(start -6.75 -6.75)
		(end -6.75 6.75)
		(stroke
			(width 0.1)
			(type solid)
		)
		(layer "F.Fab")
		(uuid "b9055a94-0e2e-4774-87e2-cfe03a0b2de1")
	)
	(fp_line
		(start -6.75 6.75)
		(end 4 6.75)
		(stroke
			(width 0.1)
			(type solid)
		)
		(layer "F.Fab")
		(uuid "d678d2ad-6d9a-4d6a-97ac-c7d7b33ed88d")
	)
	(fp_line
		(start 4 -6.75)
		(end -6.75 -6.75)
		(stroke
			(width 0.1)
			(type solid)
		)
		(layer "F.Fab")
		(uuid "8e15bfea-4ed2-483b-abb8-2caacb9f7785")
	)
	(fp_line
		(start 4 6.75)
		(end 6.75 4)
		(stroke
			(width 0.1)
			(type solid)
		)
		(layer "F.Fab")
		(uuid "2db2315b-02b7-468f-9bb3-053060359854")
	)
	(fp_line
		(start 6.75 -4)
		(end 4 -6.75)
		(stroke
			(width 0.1)
			(type solid)
		)
		(layer "F.Fab")
		(uuid "0193eb1d-105c-4f99-a7d2-0e0dfc406070")
	)
	(fp_line
		(start 6.75 4)
		(end 6.75 -4)
		(stroke
			(width 0.1)
			(type solid)
		)
		(layer "F.Fab")
		(uuid "dd51e9ef-432a-4dcc-b6ab-8e272a82a728")
	)
	(fp_circle
		(center 0 0)
		(end 6.25 0)
		(stroke
			(width 0.1)
			(type solid)
		)
		(fill none)
		(layer "F.Fab")
		(uuid "cdcf3c8a-416f-4890-a593-fc3f9ce64d4a")
	)
	(fp_text user "+"
		(at 7.7 3 0)
		(layer "F.SilkS")
		(uuid "4c3e67f6-c31f-447f-84fa-49402d992e1c")
		(effects
			(font
				(size 1 1)
				(thickness 0.15)
			)
		)
	)
	(fp_text user "+"
		(at 7.7 3 0)
		(layer "Dwgs.User")
		(uuid "5ddc1b4c-b03b-44c3-937e-78ee3e453056")
		(effects
			(font
				(size 1 1)
				(thickness 0.15)
			)
		)
	)
	(pad "1" smd rect
		(at 5.05 0)
		(size 5.8 2.5)
		(layers "F.Cu" "F.Paste" "F.Mask")
		(uuid "2814d067-15c0-40f0-805f-da2b31446308")
	)
	(pad "2" smd rect
		(at -5.05 0)
		(size 5.8 2.5)
		(layers "F.Cu" "F.Paste" "F.Mask")
		(uuid "7fd9cf40-809e-4448-8b56-0c08d1aacab8")
	)
	(model "${KIPRJMOD}/kicad-library/3D/passives.3dshapes/865080662019.stp"
		(offset
			(xyz 0 0 0)
		)
		(scale
			(xyz 1 1 1)
		)
		(rotate
			(xyz 0 0 -90)
		)
	)
)
