(footprint "NeoPixel-1655"
	(version 20240108)
	(generator "pcbnew")
	(generator_version "8.0")
	(layer "F.Cu")
	(descr "NeoPixel 5050 RGB LED with Integrated Driver Chip")
	(tags "led neopixel")
	(property "Reference" "REF**"
		(at -0.325 -3.635 0)
		(layer "F.SilkS")
		(uuid "31529d3d-db96-44fe-a344-40f12c91c04a")
		(effects
			(font
				(size 1 1)
				(thickness 0.15)
			)
		)
	)
	(property "Value" "LED_1655"
		(at 1.58 3.635 0)
		(layer "F.Fab")
		(uuid "1fbd6176-da9e-4ccb-8317-0f2da38b4f96")
		(effects
			(font
				(size 1 1)
				(thickness 0.15)
			)
		)
	)
	(property "Footprint" ""
		(at 0 0 0)
		(layer "F.Fab")
		(hide yes)
		(uuid "92bcf379-6d45-4aae-94e6-da4da7b4fbbb")
		(effects
			(font
				(size 1.27 1.27)
				(thickness 0.15)
			)
		)
	)
	(property "Datasheet" ""
		(at 0 0 0)
		(layer "F.Fab")
		(hide yes)
		(uuid "9a5f53a7-956b-461a-acfe-79f84f53b71c")
		(effects
			(font
				(size 1.27 1.27)
				(thickness 0.15)
			)
		)
	)
	(property "Description" ""
		(at 0 0 0)
		(layer "F.Fab")
		(hide yes)
		(uuid "3276dccf-aaa9-4522-9f9c-952f31a2e3fc")
		(effects
			(font
				(size 1.27 1.27)
				(thickness 0.15)
			)
		)
	)
	(attr smd)
	(fp_line
		(start -2.5 0.7865)
		(end -2.5 -0.7865)
		(stroke
			(width 0.127)
			(type solid)
		)
		(layer "F.SilkS")
		(uuid "af791b35-b754-431d-a4f9-00f0201216b5")
	)
	(fp_line
		(start -2.5 2.5)
		(end 2.5 2.5)
		(stroke
			(width 0.127)
			(type solid)
		)
		(layer "F.SilkS")
		(uuid "6d5cff7d-9077-44f6-81b9-63bac17035a6")
	)
	(fp_line
		(start 2.5 -2.5)
		(end -2.5 -2.5)
		(stroke
			(width 0.127)
			(type solid)
		)
		(layer "F.SilkS")
		(uuid "c5ae96ab-e1e1-4289-bc5c-0d104f82a65d")
	)
	(fp_line
		(start 2.5 0.7865)
		(end 2.5 -0.7865)
		(stroke
			(width 0.127)
			(type solid)
		)
		(layer "F.SilkS")
		(uuid "dffe70e1-4009-41e3-9077-8eb097eeb310")
	)
	(fp_circle
		(center -3.75 -1.6)
		(end -3.65 -1.6)
		(stroke
			(width 0.2)
			(type solid)
		)
		(fill none)
		(layer "F.SilkS")
		(uuid "af2862a1-7bb9-412c-91b1-df0bfcff7c1a")
	)
	(fp_line
		(start -3.45 -2.75)
		(end 3.45 -2.75)
		(stroke
			(width 0.05)
			(type solid)
		)
		(layer "F.CrtYd")
		(uuid "d31dfce5-68fd-4f2e-ae3e-6896ffe98a78")
	)
	(fp_line
		(start -3.45 2.75)
		(end -3.45 -2.75)
		(stroke
			(width 0.05)
			(type solid)
		)
		(layer "F.CrtYd")
		(uuid "de2fe712-5676-4c15-ba44-73e91cfdd247")
	)
	(fp_line
		(start 3.45 -2.75)
		(end 3.45 2.75)
		(stroke
			(width 0.05)
			(type solid)
		)
		(layer "F.CrtYd")
		(uuid "2eed4993-1b56-49b6-a9f7-c76d0f3ca7c3")
	)
	(fp_line
		(start 3.45 2.75)
		(end -3.45 2.75)
		(stroke
			(width 0.05)
			(type solid)
		)
		(layer "F.CrtYd")
		(uuid "32179558-6a64-4e8a-bc03-2a779ff8d8e2")
	)
	(fp_line
		(start -2.5 -2.5)
		(end -2.5 2.5)
		(stroke
			(width 0.127)
			(type solid)
		)
		(layer "F.Fab")
		(uuid "f786f012-5085-4547-8d07-2187745463a7")
	)
	(fp_line
		(start -2.5 2.5)
		(end 2.5 2.5)
		(stroke
			(width 0.127)
			(type solid)
		)
		(layer "F.Fab")
		(uuid "1d791337-cfa0-4584-846f-72d3640ad10e")
	)
	(fp_line
		(start 2.5 -2.5)
		(end -2.5 -2.5)
		(stroke
			(width 0.127)
			(type solid)
		)
		(layer "F.Fab")
		(uuid "75f27612-3430-41ef-a4f4-07ccc95cd220")
	)
	(fp_line
		(start 2.5 2.5)
		(end 2.5 -2.5)
		(stroke
			(width 0.127)
			(type solid)
		)
		(layer "F.Fab")
		(uuid "c3bc3149-2eb6-44da-abe8-2704970fe6ad")
	)
	(fp_circle
		(center -3.75 -1.6)
		(end -3.65 -1.6)
		(stroke
			(width 0.2)
			(type solid)
		)
		(fill none)
		(layer "F.Fab")
		(uuid "98a070f2-5263-4aba-a078-1d7adb96f959")
	)
	(pad "1" smd rect
		(at -2.45 -1.6 90)
		(size 1 1.5)
		(layers "F.Cu" "F.Paste" "F.Mask")
		(solder_mask_margin 0.102)
		(uuid "47847069-9e58-47ca-bcc0-da4f487fa490")
	)
	(pad "2" smd rect
		(at -2.45 1.6 90)
		(size 1 1.5)
		(layers "F.Cu" "F.Paste" "F.Mask")
		(solder_mask_margin 0.102)
		(uuid "796c5053-f083-468a-af26-81a87e66e207")
	)
	(pad "3" smd rect
		(at 2.45 1.6 90)
		(size 1 1.5)
		(layers "F.Cu" "F.Paste" "F.Mask")
		(solder_mask_margin 0.102)
		(uuid "f283b427-c841-40eb-8622-7cb9cb8490bb")
	)
	(pad "4" smd rect
		(at 2.45 -1.6 90)
		(size 1 1.5)
		(layers "F.Cu" "F.Paste" "F.Mask")
		(solder_mask_margin 0.102)
		(uuid "288e413f-a254-4b31-804c-c7832371f779")
	)
	(model "${KIPRJMOD}/kicad-library/3D/components.3dshapes/NeoPixel5050.step"
		(offset
			(xyz 0 0 0)
		)
		(scale
			(xyz 1 1 1)
		)
		(rotate
			(xyz -90 0 -180)
		)
	)
)
