(footprint "XBEE-20-THT"
	(version 20240108)
	(generator "pcbnew")
	(generator_version "8.0")
	(layer "F.Cu")
	(descr "https://www.digi.com/pdf/ds_xbeemultipointmodules.pdf")
	(tags "XBEE Zigbee")
	(property "Reference" "REF**"
		(at 0 -18.49 0)
		(layer "F.SilkS")
		(uuid "819438cd-eb04-49f4-9ba8-859316429688")
		(effects
			(font
				(size 1 1)
				(thickness 0.15)
			)
		)
	)
	(property "Value" "XBEE-20-THT"
		(at 0 12.45 0)
		(layer "F.Fab")
		(uuid "abc425ae-34db-440c-baf2-199506429483")
		(effects
			(font
				(size 1 1)
				(thickness 0.15)
			)
		)
	)
	(property "Footprint" ""
		(at 0 0 0)
		(layer "F.Fab")
		(hide yes)
		(uuid "71d12684-32c8-4b3b-a8ee-23991ae0b6b3")
		(effects
			(font
				(size 1.27 1.27)
				(thickness 0.15)
			)
		)
	)
	(property "Datasheet" ""
		(at 0 0 0)
		(layer "F.Fab")
		(hide yes)
		(uuid "33f77c0f-fe6c-4fcc-94e9-7c030f7f37db")
		(effects
			(font
				(size 1.27 1.27)
				(thickness 0.15)
			)
		)
	)
	(property "Description" ""
		(at 0 0 0)
		(layer "F.Fab")
		(hide yes)
		(uuid "8f7c173a-c783-49b2-adec-7b2a4b1d9a68")
		(effects
			(font
				(size 1.27 1.27)
				(thickness 0.15)
			)
		)
	)
	(attr through_hole)
	(fp_line
		(start -12.4 -9.5)
		(end -12.4 -9)
		(stroke
			(width 0.1)
			(type solid)
		)
		(layer "F.SilkS")
		(uuid "5078aa3f-bd19-4b74-8c57-3c644abf89a1")
	)
	(fp_line
		(start -12.4 -9.5)
		(end -12 -9.9)
		(stroke
			(width 0.1)
			(type solid)
		)
		(layer "F.SilkS")
		(uuid "ce39d830-29f6-4127-9a84-898a2f1c9f8f")
	)
	(fp_line
		(start -12.4 0)
		(end -12.4 3.8)
		(stroke
			(width 0.1)
			(type solid)
		)
		(layer "F.SilkS")
		(uuid "1095e07d-8c1c-40df-abaa-9cd930a13e62")
	)
	(fp_line
		(start -12.35 10.7)
		(end -12.35 10.2)
		(stroke
			(width 0.1)
			(type solid)
		)
		(layer "F.SilkS")
		(uuid "3084e334-bf87-4108-a171-28c9d8e0dd00")
	)
	(fp_line
		(start -12.35 10.7)
		(end -11.85 10.7)
		(stroke
			(width 0.1)
			(type solid)
		)
		(layer "F.SilkS")
		(uuid "5ed62179-26c3-42a3-8d9b-157922d52f41")
	)
	(fp_line
		(start -12 -9.9)
		(end -5.2 -16.7)
		(stroke
			(width 0.1)
			(type default)
		)
		(layer "F.SilkS")
		(uuid "411cddbc-03a1-4334-bdd9-21c8b9dccdb2")
	)
	(fp_line
		(start -11.85 10.7)
		(end 11.85 10.7)
		(stroke
			(width 0.1)
			(type default)
		)
		(layer "F.SilkS")
		(uuid "dc8ce549-5126-4a1b-b0f9-c05f66a71bbb")
	)
	(fp_line
		(start -4.8 -17.1)
		(end -5.2 -16.7)
		(stroke
			(width 0.1)
			(type solid)
		)
		(layer "F.SilkS")
		(uuid "b238098e-37bc-47a4-b804-b46d0c410db0")
	)
	(fp_line
		(start -4.8 -17.1)
		(end -4.3 -17.1)
		(stroke
			(width 0.1)
			(type solid)
		)
		(layer "F.SilkS")
		(uuid "d901abd5-91b2-41ed-b520-c8d0d63a98b1")
	)
	(fp_line
		(start 4.8 -17.1)
		(end 4.3 -17.1)
		(stroke
			(width 0.1)
			(type solid)
		)
		(layer "F.SilkS")
		(uuid "3caf07f9-b9aa-409e-bf4f-7189142649fb")
	)
	(fp_line
		(start 4.8 -17.1)
		(end 5.2 -16.7)
		(stroke
			(width 0.1)
			(type solid)
		)
		(layer "F.SilkS")
		(uuid "37702ca0-905a-4f36-91f6-fb362c6ef752")
	)
	(fp_line
		(start 5.2 -16.7)
		(end 12 -9.9)
		(stroke
			(width 0.1)
			(type default)
		)
		(layer "F.SilkS")
		(uuid "fd5b6d10-28c8-4f54-bda9-1ec9a8ef7612")
	)
	(fp_line
		(start 12.35 10.7)
		(end 11.85 10.7)
		(stroke
			(width 0.1)
			(type solid)
		)
		(layer "F.SilkS")
		(uuid "52cc67f3-d7ae-455e-ac78-1ebcc3abace0")
	)
	(fp_line
		(start 12.35 10.7)
		(end 12.35 10.2)
		(stroke
			(width 0.1)
			(type solid)
		)
		(layer "F.SilkS")
		(uuid "486fdbb7-972d-4ee3-b1ee-c420f58d1e47")
	)
	(fp_line
		(start 12.4 -9.5)
		(end 12 -9.9)
		(stroke
			(width 0.1)
			(type solid)
		)
		(layer "F.SilkS")
		(uuid "3fac1ffd-dad4-476c-b799-25824aef20cf")
	)
	(fp_line
		(start 12.4 -9.5)
		(end 12.4 -9)
		(stroke
			(width 0.1)
			(type solid)
		)
		(layer "F.SilkS")
		(uuid "8289d44a-3294-48d7-9aaf-7acd858828dc")
	)
	(fp_line
		(start 12.4 0)
		(end 12.4 3.8)
		(stroke
			(width 0.1)
			(type solid)
		)
		(layer "F.SilkS")
		(uuid "6b3f8bcc-3de8-4f39-8ed0-7c34895de042")
	)
	(fp_line
		(start -12.5 -17.25)
		(end -12.5 10.85)
		(stroke
			(width 0.05)
			(type solid)
		)
		(layer "F.CrtYd")
		(uuid "c3ae173e-fd64-439b-98c6-e5ca41528bd9")
	)
	(fp_line
		(start -12.5 -17.25)
		(end 12.5 -17.25)
		(stroke
			(width 0.05)
			(type solid)
		)
		(layer "F.CrtYd")
		(uuid "365ed274-ece5-479d-b394-a22ea72d34fa")
	)
	(fp_line
		(start -12.5 10.85)
		(end 12.5 10.85)
		(stroke
			(width 0.05)
			(type solid)
		)
		(layer "F.CrtYd")
		(uuid "88afed53-0ec6-40ea-9b0f-1706cb8cd6a8")
	)
	(fp_line
		(start 12.5 -17.25)
		(end 12.5 10.85)
		(stroke
			(width 0.05)
			(type solid)
		)
		(layer "F.CrtYd")
		(uuid "9cedd501-5f1f-4872-8443-b4cd2ed87a12")
	)
	(fp_line
		(start -12.25 -9.5)
		(end -12.25 10.6)
		(stroke
			(width 0.1)
			(type solid)
		)
		(layer "F.Fab")
		(uuid "65840528-ae86-4ed9-af78-7b21e0f683c8")
	)
	(fp_line
		(start -12.25 -9.5)
		(end -4.75 -17)
		(stroke
			(width 0.1)
			(type solid)
		)
		(layer "F.Fab")
		(uuid "59105f9e-ada0-43e1-b3fb-c68ff75361e5")
	)
	(fp_line
		(start -12.25 10.6)
		(end 12.25 10.6)
		(stroke
			(width 0.1)
			(type solid)
		)
		(layer "F.Fab")
		(uuid "125b7ac6-58f8-4648-989a-7cb26078849e")
	)
	(fp_line
		(start -4.75 -17)
		(end 4.75 -17)
		(stroke
			(width 0.1)
			(type solid)
		)
		(layer "F.Fab")
		(uuid "52989783-c2ed-45d3-950f-2c6b6662bce9")
	)
	(fp_line
		(start 4.75 -17)
		(end 12.25 -9.5)
		(stroke
			(width 0.1)
			(type solid)
		)
		(layer "F.Fab")
		(uuid "dfa64e3a-853f-45da-b6d7-93e2561a9b32")
	)
	(fp_line
		(start 12.25 -9.5)
		(end 12.25 10.6)
		(stroke
			(width 0.1)
			(type solid)
		)
		(layer "F.Fab")
		(uuid "c1af82fd-462e-47ca-b7fb-c897785e1a3e")
	)
	(fp_text user "${REFERENCE}"
		(at 0 0 0)
		(layer "F.Fab")
		(uuid "4f46b8e8-9e73-4b6a-8e59-fbe50391f07b")
		(effects
			(font
				(size 1 1)
				(thickness 0.15)
			)
		)
	)
	(pad "1" thru_hole circle
		(at -11 -9)
		(size 1.7 1.7)
		(drill 0.7)
		(layers "*.Cu" "*.Mask")
		(remove_unused_layers no)
		(uuid "d4839c2b-a8ac-4cb1-92a9-e61030bbd675")
	)
	(pad "2" thru_hole circle
		(at -11 -7)
		(size 1.7 1.7)
		(drill 0.7)
		(layers "*.Cu" "*.Mask")
		(remove_unused_layers no)
		(uuid "79401260-2f1e-4ed0-ada7-f2b90f89f5c6")
	)
	(pad "3" thru_hole circle
		(at -11 -5)
		(size 1.7 1.7)
		(drill 0.7)
		(layers "*.Cu" "*.Mask")
		(remove_unused_layers no)
		(uuid "b64b9c63-ae51-42f0-ac58-38094e4e141c")
	)
	(pad "4" thru_hole circle
		(at -11 -3)
		(size 1.7 1.7)
		(drill 0.7)
		(layers "*.Cu" "*.Mask")
		(remove_unused_layers no)
		(uuid "3d8e7201-6ce5-4a8e-862f-faa744c79c67")
	)
	(pad "5" thru_hole circle
		(at -11 -1)
		(size 1.7 1.7)
		(drill 0.7)
		(layers "*.Cu" "*.Mask")
		(remove_unused_layers no)
		(uuid "ee38aec0-5beb-4800-bc27-4f11cb44b86c")
	)
	(pad "6" thru_hole circle
		(at -11 1)
		(size 1.7 1.7)
		(drill 0.7)
		(layers "*.Cu" "*.Mask")
		(remove_unused_layers no)
		(uuid "c579da56-4f9a-4f3d-b913-557f4d7be3b4")
	)
	(pad "7" thru_hole circle
		(at -11 3)
		(size 1.7 1.7)
		(drill 0.7)
		(layers "*.Cu" "*.Mask")
		(remove_unused_layers no)
		(uuid "84b0d34f-561e-4159-b869-09ac10a3659e")
	)
	(pad "8" thru_hole circle
		(at -11 5)
		(size 1.7 1.7)
		(drill 0.7)
		(layers "*.Cu" "*.Mask")
		(remove_unused_layers no)
		(uuid "bebef2ce-b901-44fd-84a6-49ad9d2cf651")
	)
	(pad "9" thru_hole circle
		(at -11 7)
		(size 1.7 1.7)
		(drill 0.7)
		(layers "*.Cu" "*.Mask")
		(remove_unused_layers no)
		(uuid "48e043ee-81ab-4e61-a81b-90a3d592bda8")
	)
	(pad "10" thru_hole circle
		(at -11 9)
		(size 1.7 1.7)
		(drill 0.7)
		(layers "*.Cu" "*.Mask")
		(remove_unused_layers no)
		(uuid "5c5eaa92-cce1-4c12-a008-9dfd9b3268d6")
	)
	(pad "11" thru_hole circle
		(at 11 9)
		(size 1.7 1.7)
		(drill 0.7)
		(layers "*.Cu" "*.Mask")
		(remove_unused_layers no)
		(uuid "3519f70d-de14-4eb0-8f8b-c6152c800a0d")
	)
	(pad "12" thru_hole circle
		(at 11 7)
		(size 1.7 1.7)
		(drill 0.7)
		(layers "*.Cu" "*.Mask")
		(remove_unused_layers no)
		(uuid "8d8514f6-773c-4177-bb5d-ca673d543360")
	)
	(pad "13" thru_hole circle
		(at 11 5)
		(size 1.7 1.7)
		(drill 0.7)
		(layers "*.Cu" "*.Mask")
		(remove_unused_layers no)
		(uuid "f6806eaf-5433-4e72-bf48-f267edd377d9")
	)
	(pad "14" thru_hole circle
		(at 11 3)
		(size 1.7 1.7)
		(drill 0.7)
		(layers "*.Cu" "*.Mask")
		(remove_unused_layers no)
		(uuid "17c5b7fe-662b-4974-9d1a-80d6ebd1ea5f")
	)
	(pad "15" thru_hole circle
		(at 11 1)
		(size 1.7 1.7)
		(drill 0.7)
		(layers "*.Cu" "*.Mask")
		(remove_unused_layers no)
		(uuid "d359f93e-704c-4d39-a437-9e6ae37eeb8f")
	)
	(pad "16" thru_hole circle
		(at 11 -1)
		(size 1.7 1.7)
		(drill 0.7)
		(layers "*.Cu" "*.Mask")
		(remove_unused_layers no)
		(uuid "3fd0b65e-9dcc-4cde-917a-b3cacc42de47")
	)
	(pad "17" thru_hole circle
		(at 11 -3)
		(size 1.7 1.7)
		(drill 0.7)
		(layers "*.Cu" "*.Mask")
		(remove_unused_layers no)
		(uuid "0e463808-51a8-4fe7-a3dd-e5cba2e81679")
	)
	(pad "18" thru_hole circle
		(at 11 -5)
		(size 1.7 1.7)
		(drill 0.7)
		(layers "*.Cu" "*.Mask")
		(remove_unused_layers no)
		(uuid "2be5b708-76d3-4fa2-bd24-ba040ea870cf")
	)
	(pad "19" thru_hole circle
		(at 11 -7)
		(size 1.7 1.7)
		(drill 0.7)
		(layers "*.Cu" "*.Mask")
		(remove_unused_layers no)
		(uuid "06238c72-f351-48ec-8a71-67d629a9b0b4")
	)
	(pad "20" thru_hole circle
		(at 11 -9)
		(size 1.7 1.7)
		(drill 0.7)
		(layers "*.Cu" "*.Mask")
		(remove_unused_layers no)
		(uuid "518bc6cb-8998-45f3-9ca5-d6ef52682784")
	)
	(model ":KICAD7_3DMODEL_DIR:Connector_PinSocket_2.00mm.3dshapes/PinSocket_1x10_P2.00mm_Vertical.step"
		(offset
			(xyz -10.9982 9 0)
		)
		(scale
			(xyz 1 1 1)
		)
		(rotate
			(xyz 0 0 0)
		)
	)
	(model ":KICAD7_3DMODEL_DIR:Connector_PinSocket_2.00mm.3dshapes/PinSocket_1x10_P2.00mm_Vertical.step"
		(offset
			(xyz 10.9982 9 0)
		)
		(scale
			(xyz 1 1 1)
		)
		(rotate
			(xyz 0 0 0)
		)
	)
	(model "${KIPRJMOD}/kicad-library/3D/components.3dshapes/XB24CZ7WIT-004.IGS"
		(offset
			(xyz 0 -11 10)
		)
		(scale
			(xyz 1 1 1)
		)
		(rotate
			(xyz 0 -180 0)
		)
	)
)
