(footprint "CONV_RP10-1205SE"
	(version 20240108)
	(generator "pcbnew")
	(generator_version "8.0")
	(layer "F.Cu")
	(property "Reference" "REF**"
		(at -22.225 -14.605 0)
		(layer "F.SilkS")
		(uuid "20bd73ab-a8ea-40f2-8a28-7afb66b99c5e")
		(effects
			(font
				(size 1 1)
				(thickness 0.15)
			)
		)
	)
	(property "Value" "CONV_RP10-1205SE"
		(at -15.24 14.605 0)
		(layer "F.Fab")
		(uuid "6fe10665-03e9-4e8c-83f5-765f4ada06dc")
		(effects
			(font
				(size 1 1)
				(thickness 0.15)
			)
		)
	)
	(property "Footprint" ""
		(at 0 0 0)
		(layer "F.Fab")
		(hide yes)
		(uuid "2134ca36-0e7a-4387-9337-ae3c4ed90268")
		(effects
			(font
				(size 1.27 1.27)
				(thickness 0.15)
			)
		)
	)
	(property "Datasheet" ""
		(at 0 0 0)
		(layer "F.Fab")
		(hide yes)
		(uuid "9b17e2d4-94df-4db8-bf12-23957d4f7125")
		(effects
			(font
				(size 1.27 1.27)
				(thickness 0.15)
			)
		)
	)
	(property "Description" ""
		(at 0 0 0)
		(layer "F.Fab")
		(hide yes)
		(uuid "fe1f9ed2-29ea-4d4e-96d4-dbfdc4badc28")
		(effects
			(font
				(size 1.27 1.27)
				(thickness 0.15)
			)
		)
	)
	(attr through_hole)
	(fp_line
		(start -25.4 -12.7)
		(end 25.4 -12.7)
		(stroke
			(width 0.127)
			(type solid)
		)
		(layer "F.SilkS")
		(uuid "3ac14167-ce7e-4593-9801-445588bf06d0")
	)
	(fp_line
		(start -25.4 12.7)
		(end -25.4 -12.7)
		(stroke
			(width 0.127)
			(type solid)
		)
		(layer "F.SilkS")
		(uuid "d683ccc9-c047-49ae-a473-aa3cb686e2b9")
	)
	(fp_line
		(start 25.4 -12.7)
		(end 25.4 12.7)
		(stroke
			(width 0.127)
			(type solid)
		)
		(layer "F.SilkS")
		(uuid "7727700b-800c-4bf2-8840-24504d5edf49")
	)
	(fp_line
		(start 25.4 12.7)
		(end -25.4 12.7)
		(stroke
			(width 0.127)
			(type solid)
		)
		(layer "F.SilkS")
		(uuid "ea21f376-febc-4ae8-923c-bc30cd92a4a2")
	)
	(fp_circle
		(center -26.3 2.5)
		(end -26.158581 2.5)
		(stroke
			(width 0.3)
			(type solid)
		)
		(fill none)
		(layer "F.SilkS")
		(uuid "9752bc45-18a5-4227-b519-3ce6e91b086d")
	)
	(fp_line
		(start -25.65 -12.95)
		(end 25.65 -12.95)
		(stroke
			(width 0.05)
			(type solid)
		)
		(layer "F.CrtYd")
		(uuid "aa7fdbb6-d5e1-488f-bb2a-c4184d681d8a")
	)
	(fp_line
		(start -25.65 12.95)
		(end -25.65 -12.95)
		(stroke
			(width 0.05)
			(type solid)
		)
		(layer "F.CrtYd")
		(uuid "fa599787-ea9d-471e-ac96-ee420393b566")
	)
	(fp_line
		(start 25.65 -12.95)
		(end 25.65 12.95)
		(stroke
			(width 0.05)
			(type solid)
		)
		(layer "F.CrtYd")
		(uuid "4135dc48-d9c8-49f1-983c-58e4baad21b1")
	)
	(fp_line
		(start 25.65 12.95)
		(end -25.65 12.95)
		(stroke
			(width 0.05)
			(type solid)
		)
		(layer "F.CrtYd")
		(uuid "062636bf-a042-4f35-ac2b-1817591451f7")
	)
	(fp_line
		(start -25.4 -12.7)
		(end 25.4 -12.7)
		(stroke
			(width 0.127)
			(type solid)
		)
		(layer "F.Fab")
		(uuid "2c358e83-e2d3-4b2f-8a82-9dd80df998a1")
	)
	(fp_line
		(start -25.4 12.7)
		(end -25.4 -12.7)
		(stroke
			(width 0.127)
			(type solid)
		)
		(layer "F.Fab")
		(uuid "533a0035-4bce-43a7-b010-e826fa32b1b2")
	)
	(fp_line
		(start 25.4 -12.7)
		(end 25.4 12.7)
		(stroke
			(width 0.127)
			(type solid)
		)
		(layer "F.Fab")
		(uuid "ea58423e-793a-4deb-b4bd-557c3d0981ec")
	)
	(fp_line
		(start 25.4 12.7)
		(end -25.4 12.7)
		(stroke
			(width 0.127)
			(type solid)
		)
		(layer "F.Fab")
		(uuid "e2dbba60-a603-4df9-bd12-f5a7d7b22433")
	)
	(fp_circle
		(center -26.3 2.5)
		(end -26.158581 2.5)
		(stroke
			(width 0.3)
			(type solid)
		)
		(fill none)
		(layer "F.Fab")
		(uuid "53be39ef-6556-4368-b714-505b87315cc5")
	)
	(pad "1" thru_hole rect
		(at -10.2 2.54)
		(size 2.175 2.175)
		(drill 1.45)
		(layers "*.Cu" "*.Mask")
		(remove_unused_layers no)
		(uuid "f730dcd8-27c2-48c8-9cb6-67feb2a4ce99")
	)
	(pad "2" thru_hole circle
		(at -10.2 -2.54)
		(size 2.175 2.175)
		(drill 1.45)
		(layers "*.Cu" "*.Mask")
		(remove_unused_layers no)
		(uuid "2dbda6ea-28fd-4491-9e08-06e7c845d3a6")
	)
	(pad "3" thru_hole circle
		(at 10.12 10.16)
		(size 2.175 2.175)
		(drill 1.45)
		(layers "*.Cu" "*.Mask")
		(remove_unused_layers no)
		(uuid "f6f55e77-3e4e-4e78-805e-9f1afc0745e0")
	)
	(pad "5" thru_hole circle
		(at 10.12 -10.16)
		(size 2.175 2.175)
		(drill 1.45)
		(layers "*.Cu" "*.Mask")
		(remove_unused_layers no)
		(uuid "9cda099f-37de-464f-9246-913521d9ee5c")
	)
	(pad "6" thru_hole circle
		(at -10.2 -10.16)
		(size 2.175 2.175)
		(drill 1.45)
		(layers "*.Cu" "*.Mask")
		(remove_unused_layers no)
		(uuid "b217ee2b-a935-4403-b531-bc647d54126e")
	)
	(model "${KIPRJMOD}/kicad-library/3D/converters.3dshapes/RP10-1205SE0.step"
		(offset
			(xyz 0 0 2)
		)
		(scale
			(xyz 1 1 1)
		)
		(rotate
			(xyz -90 0 -90)
		)
	)
)
