(footprint "TCR_LogotypeLarge"
	(version 20240108)
	(generator "pcbnew")
	(generator_version "8.0")
	(layer "F.Cu")
	(property "Reference" "G***"
		(at 0 0 0)
		(layer "F.SilkS")
		(hide yes)
		(uuid "aedad97b-d5a3-4080-81f7-0248fa3ed000")
		(effects
			(font
				(size 1.524 1.524)
				(thickness 0.3)
			)
		)
	)
	(property "Value" "LOGO"
		(at 0.75 0 0)
		(layer "F.SilkS")
		(hide yes)
		(uuid "f6afa8f4-c6e2-4ef7-84cf-42a6cf2e8bbe")
		(effects
			(font
				(size 1.524 1.524)
				(thickness 0.3)
			)
		)
	)
	(property "Footprint" ""
		(at 0 0 0)
		(layer "F.Fab")
		(hide yes)
		(uuid "35a64c7f-bb2f-44b2-8039-1357f04766eb")
		(effects
			(font
				(size 1.27 1.27)
				(thickness 0.15)
			)
		)
	)
	(property "Datasheet" ""
		(at 0 0 0)
		(layer "F.Fab")
		(hide yes)
		(uuid "4282218d-0433-4a92-ae59-8074348c9610")
		(effects
			(font
				(size 1.27 1.27)
				(thickness 0.15)
			)
		)
	)
	(property "Description" ""
		(at 0 0 0)
		(layer "F.Fab")
		(hide yes)
		(uuid "4096f444-d667-440d-a2eb-c5f866653071")
		(effects
			(font
				(size 1.27 1.27)
				(thickness 0.15)
			)
		)
	)
	(attr board_only exclude_from_pos_files exclude_from_bom)
	(fp_poly
		(pts
			(xy -0.26962 -0.311906) (xy -0.257523 -0.305671) (xy -0.255119 -0.304074) (xy -0.233073 -0.283904)
			(xy -0.219469 -0.2602) (xy -0.214357 -0.234651) (xy -0.217786 -0.208946) (xy -0.229804 -0.184773)
			(xy -0.250461 -0.163823) (xy -0.251043 -0.163389) (xy -0.270861 -0.154199) (xy -0.294953 -0.151019)
			(xy -0.319522 -0.153949) (xy -0.3375 -0.161062) (xy -0.356107 -0.1768) (xy -0.370589 -0.198634) (xy -0.378816 -0.222861)
			(xy -0.379918 -0.23481) (xy -0.375946 -0.255113) (xy -0.365663 -0.276601) (xy -0.351269 -0.295201)
			(xy -0.343818 -0.301707) (xy -0.32618 -0.309769) (xy -0.301318 -0.313869) (xy -0.282757 -0.314329)
		)
		(stroke
			(width 0)
			(type solid)
		)
		(fill solid)
		(layer "F.SilkS")
		(uuid "8f4525f1-d342-4c01-82c1-69acee1e45bb")
	)
	(fp_poly
		(pts
			(xy 0.0075 -2.497178) (xy 0.072243 -2.496751) (xy 0.129152 -2.495606) (xy 0.180376 -2.493569) (xy 0.228068 -2.490466)
			(xy 0.274376 -2.486121) (xy 0.321453 -2.48036) (xy 0.371448 -2.473007) (xy 0.426513 -2.463887) (xy 0.435054 -2.462407)
			(xy 0.580087 -2.43228) (xy 0.724587 -2.392705) (xy 0.86754 -2.344138) (xy 1.007931 -2.287036) (xy 1.144744 -2.221856)
			(xy 1.276964 -2.149055) (xy 1.403577 -2.06909) (xy 1.523568 -1.982418) (xy 1.553243 -1.959091) (xy 1.674403 -1.855929)
			(xy 1.788141 -1.746345) (xy 1.894251 -1.630686) (xy 1.992526 -1.509302) (xy 2.082759 -1.38254) (xy 2.164746 -1.250748)
			(xy 2.238278 -1.114277) (xy 2.303151 -0.973473) (xy 2.359157 -0.828685) (xy 2.406091 -0.680262) (xy 2.443746 -0.528552)
			(xy 2.464572 -0.42) (xy 2.473648 -0.364172) (xy 2.480962 -0.313798) (xy 2.486685 -0.26669) (xy 2.490989 -0.220658)
			(xy 2.494044 -0.173513) (xy 2.496023 -0.123063) (xy 2.497096 -0.067121) (xy 2.497434 -0.003495) (xy 2.497435 0)
			(xy 2.497129 0.064076) (xy 2.496098 0.120358) (xy 2.49417 0.171035) (xy 2.491174 0.218296) (xy 2.486938 0.264332)
			(xy 2.481291 0.311332) (xy 2.474063 0.361486) (xy 2.46508 0.416983) (xy 2.464572 0.42) (xy 2.433679 0.573172)
			(xy 2.393373 0.723408) (xy 2.343912 0.870313) (xy 2.285554 1.013492) (xy 2.218557 1.152554) (xy 2.143178 1.287102)
			(xy 2.059677 1.416745) (xy 1.968311 1.541087) (xy 1.869337 1.659734) (xy 1.763015 1.772294) (xy 1.649601 1.878372)
			(xy 1.529355 1.977574) (xy 1.402534 2.069506) (xy 1.369618 2.091447) (xy 1.234962 2.173738) (xy 1.095932 2.247062)
			(xy 0.95271 2.311354) (xy 0.805475 2.366551) (xy 0.654408 2.412588) (xy 0.499688 2.449402) (xy 0.341497 2.476927)
			(xy 0.255 2.487873) (xy 0.233962 2.489701) (xy 0.205482 2.491459) (xy 0.171129 2.493109) (xy 0.13247 2.494616)
			(xy 0.091074 2.495944) (xy 0.048507 2.497058) (xy 0.006338 2.49792) (xy -0.033865 2.498495) (xy -0.070534 2.498747)
			(xy -0.102102 2.498639) (xy -0.127 2.498137) (xy -0.14366 2.497203) (xy -0.145 2.497064) (xy -0.156787 2.495876)
			(xy -0.175883 2.494096) (xy -0.199635 2.491967) (xy -0.225 2.489764) (xy -0.376862 2.471808) (xy -0.527275 2.444171)
			(xy -0.67572 2.407128) (xy -0.821681 2.360953) (xy -0.964637 2.305922) (xy -1.10407 2.24231) (xy -1.239461 2.170393)
			(xy -1.370292 2.090444) (xy -1.496044 2.00274) (xy -1.616198 1.907556) (xy -1.730236 1.805167) (xy -1.837638 1.695847)
			(xy -1.936092 1.582087) (xy -2.031707 1.456535) (xy -2.119064 1.325851) (xy -2.197941 1.190526) (xy -2.268114 1.051047)
			(xy -2.329363 0.907904) (xy -2.381463 0.761586) (xy -2.424194 0.61258) (xy -2.457332 0.461377) (xy -2.464646 0.42)
			(xy -2.473705 0.363935) (xy -2.481002 0.313456) (xy -2.486709 0.26636) (xy -2.491 0.220442) (xy -2.494046 0.173498)
			(xy -2.496019 0.123325) (xy -2.497091 0.06772) (xy -2.497435 0.004478) (xy -2.497436 0) (xy -2.497428 -0.0025)
			(xy -1.87112 -0.0025) (xy -1.868838 0.101903) (xy -1.861639 0.20054) (xy -1.849093 0.296579) (xy -1.830772 0.39319)
			(xy -1.806247 0.493541) (xy -1.801762 0.51) (xy -1.79583 0.530646) (xy -1.79052 0.54762) (xy -1.786574 0.558622)
			(xy -1.785157 0.561417) (xy -1.780566 0.559402) (xy -1.769589 0.551617) (xy -1.75332 0.53893) (xy -1.732852 0.522208)
			(xy -1.709279 0.502317) (xy -1.694583 0.489642) (xy -1.666063 0.464854) (xy -1.636739 0.43937) (xy -1.608586 0.414904)
			(xy -1.583576 0.393171) (xy -1.563681 0.375887) (xy -1.56 0.37269) (xy -1.535215 0.351605) (xy -1.506643 0.327987)
			(xy -1.478505 0.305295) (xy -1.4625 0.292724) (xy -1.42537 0.263193) (xy -1.396147 0.238124) (xy -1.374148 0.216863)
			(xy -1.35869 0.198755) (xy -1.35 0.184998) (xy -1.345162 0.172109) (xy -1.339684 0.152114) (xy -1.33426 0.127818)
			(xy -1.329861 0.103735) (xy -1.316249 0.024972) (xy -1.30205 -0.045753) (xy -1.28666 -0.110403) (xy -1.269475 -0.170939)
			(xy -1.249891 -0.229325) (xy -1.227304 -0.287522) (xy -1.201111 -0.347493) (xy -1.172531 -0.4075)
			(xy -1.114373 -0.516502) (xy -1.047101 -0.625627) (xy -0.970583 -0.735047) (xy -0.884683 -0.844933)
			(xy -0.789267 -0.955455) (xy -0.684202 -1.066785) (xy -0.569352 -1.179093) (xy -0.5575 -1.190218)
			(xy -0.502599 -1.241261) (xy -0.447214 -1.292155) (xy -0.392159 -1.342186) (xy -0.338247 -1.390638)
			(xy -0.28629 -1.436796) (xy -0.237102 -1.479943) (xy -0.191494 -1.519365) (xy -0.150281 -1.554346)
			(xy -0.114274 -1.58417) (xy -0.084288 -1.608122) (xy -0.0725 -1.617151) (xy -0.046296 -1.636289)
			(xy -0.01776 -1.656152) (xy 0.011895 -1.675998) (xy 0.041457 -1.695081) (xy 0.069715 -1.71266) (xy 0.095456 -1.72799)
			(xy 0.117468 -1.740328) (xy 0.134539 -1.748929) (xy 0.145458 -1.753051) (xy 0.14876 -1.752907) (xy 0.149969 -1.746227)
			(xy 0.149761 -1.731013) (xy 0.148279 -1.708609) (xy 0.145667 -1.680359) (xy 0.14207 -1.647607) (xy 0.13763 -1.611697)
			(xy 0.132492 -1.573971) (xy 0.126799 -1.535775) (xy 0.12301 -1.512183) (xy 0.113383 -1.449234) (xy 0.105846 -1.389775)
			(xy 0.100511 -1.335117) (xy 0.097493 -1.28657) (xy 0.096902 -1.245445) (xy 0.097997 -1.221746) (xy 0.101294 -1.180991)
			(xy 0.129397 -1.177771) (xy 0.21328 -1.16324) (xy 0.29495 -1.139301) (xy 0.372915 -1.106395) (xy 0.375823 -1.104955)
			(xy 0.429066 -1.076015) (xy 0.479688 -1.04325) (xy 0.529407 -1.005349) (xy 0.579943 -0.961003) (xy 0.632656 -0.90927)
			(xy 0.660411 -0.880268) (xy 0.686423 -0.851893) (xy 0.711197 -0.823389) (xy 0.735239 -0.794003) (xy 0.759055 -0.762978)
			(xy 0.783151 -0.729562) (xy 0.808031 -0.692998) (xy 0.834203 -0.652531) (xy 0.862171 -0.607408) (xy 0.892442 -0.556874)
			(xy 0.92552 -0.500172) (xy 0.961912 -0.43655) (xy 1.002124 -0.365251) (xy 1.027442 -0.32) (xy 1.050032 -0.279721)
			(xy 1.07209 -0.24075) (xy 1.092922 -0.204285) (xy 1.111838 -0.17152) (xy 1.128147 -0.143651) (xy 1.141157 -0.121875)
			(xy 1.150178 -0.107386) (xy 1.151588 -0.105252) (xy 1.186827 -0.059589) (xy 1.226854 -0.019555) (xy 1.270158 0.013619)
			(xy 1.315233 0.038696) (xy 1.339419 0.048317) (xy 1.366339 0.0575) (xy 1.363313 0.12515) (xy 1.355806 0.195774)
			(xy 1.339924 0.268894) (xy 1.316387 0.342854) (xy 1.285917 0.415994) (xy 1.249233 0.486658) (xy 1.207057 0.553187)
			(xy 1.160109 0.613923) (xy 1.142001 0.634242) (xy 1.082505 0.69163) (xy 1.017106 0.742334) (xy 0.946861 0.785928)
			(xy 0.872826 0.821984) (xy 0.796059 0.850076) (xy 0.717616 0.869776) (xy 0.638555 0.880657) (xy 0.559932 0.882292)
			(xy 0.5325 0.880583) (xy 0.474736 0.873626) (xy 0.424008 0.862685) (xy 0.377836 0.846852) (xy 0.333739 0.825216)
			(xy 0.289239 0.79687) (xy 0.273942 0.785814) (xy 0.231335 0.750636) (xy 0.193027 0.71109) (xy 0.157772 0.665631)
			(xy 0.124327 0.612716) (xy 0.103116 0.573874) (xy 0.083473 0.535224) (xy 0.06805 0.502738) (xy 0.055879 0.474033)
			(xy 0.045995 0.446721) (xy 0.037432 0.418417) (xy 0.032217 0.398748) (xy 0.023826 0.362759) (xy 0.017672 0.328572)
			(xy 0.013777 0.294737) (xy 0.012166 0.259803) (xy 0.012863 0.22232) (xy 0.015891 0.180837) (xy 0.021274 0.133903)
			(xy 0.029036 0.080069) (xy 0.038418 0.0225) (xy 0.057049 -0.0875) (xy 0.051672 -0.1925) (xy 0.049677 -0.229162)
			(xy 0.047767 -0.257672) (xy 0.045703 -0.279877) (xy 0.043245 -0.297618) (xy 0.040153 -0.312741) (xy 0.036188 -0.32709)
			(xy 0.032818 -0.3375) (xy 0.010043 -0.390334) (xy -0.020235 -0.437505) (xy -0.057048 -0.478517) (xy -0.099427 -0.512875)
			(xy -0.146403 -0.540081) (xy -0.197009 -0.559639) (xy -0.250274 -0.571052) (xy -0.305231 -0.573825)
			(xy -0.36091 -0.56746) (xy -0.3975 -0.558039) (xy -0.452527 -0.535784) (xy -0.500952 -0.506021) (xy -0.542753 -0.468779)
			(xy -0.577904 -0.424086) (xy -0.60638 -0.371968) (xy -0.628156 -0.312454) (xy -0.631843 -0.299141)
			(xy -0.649672 -0.240726) (xy -0.672959 -0.178888) (xy -0.700301 -0.116748) (xy -0.730296 -0.057431)
			(xy -0.761539 -0.00406) (xy -0.770727 0.01) (xy -0.785018 0.029972) (xy -0.803829 0.054428) (xy -0.824893 0.080508)
			(xy -0.845943 0.105351) (xy -0.849553 0.109466) (xy -0.873948 0.138203) (xy -0.891175 0.161642) (xy -0.901556 0.181116)
			(xy -0.905407 0.197958) (xy -0.903049 0.213501) (xy -0.894801 0.229076) (xy -0.881985 0.244912) (xy -0.859118 0.263242)
			(xy -0.829317 0.27641) (xy -0.794401 0.284095) (xy -0.756186 0.285974) (xy -0.716491 0.281724) (xy -0.697962 0.27755)
			(xy -0.665038 0.26694) (xy -0.634919 0.252818) (xy -0.605607 0.2339) (xy -0.575105 0.208904) (xy -0.542724 0.177872)
			(xy -0.5228 0.157993) (xy -0.504372 0.140087) (xy -0.489012 0.125645) (xy -0.478289 0.116157) (xy -0.475224 0.113782)
			(xy -0.456632 0.106072) (xy -0.437295 0.106277) (xy -0.420548 0.114236) (xy -0.417997 0.116549) (xy -0.414705 0.120089)
			(xy -0.412075 0.124153) (xy -0.409999 0.129878) (xy -0.408369 0.138402) (xy -0.40708 0.150863) (xy -0.406023 0.168398)
			(xy -0.405092 0.192145) (xy -0.404179 0.223243) (xy -0.403178 0.262828) (xy -0.402813 0.277799) (xy -0.401807 0.322126)
			(xy -0.401195 0.357785) (xy -0.401009 0.386099) (xy -0.40128 0.408394) (xy -0.402041 0.425993) (xy -0.403323 0.440222)
			(xy -0.405158 0.452405) (xy -0.407259 0.4625) (xy -0.418796 0.499709) (xy -0.437486 0.542082) (xy -0.463508 0.589972)
			(xy -0.497044 0.643733) (xy -0.507979 0.660144) (xy -0.530995 0.695326) (xy -0.548561 0.725218) (xy -0.561645 0.752203)
			(xy -0.571214 0.778662) (xy -0.578235 0.806976) (xy -0.583674 0.839525) (xy -0.585081 0.85) (xy -0.588594 0.910254)
			(xy -0.584525 0.974981) (xy -0.573214 1.04255) (xy -0.555 1.11133) (xy -0.530222 1.179689) (xy -0.505127 1.234516)
			(xy -0.476104 1.287023) (xy -0.44468 1.333243) (xy -0.409259 1.374924) (xy -0.368244 1.413813) (xy -0.320037 1.45166)
			(xy -0.284014 1.476581) (xy -0.239689 1.507429) (xy -0.203905 1.535641) (xy -0.1758 1.561998) (xy -0.154517 1.587276)
			(xy -0.143791 1.603745) (xy -0.130082 1.6275) (xy -0.130041 1.748568) (xy -0.13 1.869637) (xy -0.08125 1.871272)
			(xy -0.057134 1.872104) (xy -0.034035 1.87294) (xy -0.015635 1.873647) (xy -0.01 1.87388) (xy 0.002498 1.873915)
			(xy 0.022778 1.873392) (xy 0.048643 1.872393) (xy 0.077894 1.870999) (xy 0.099642 1.869807) (xy 0.238023 1.856949)
			(xy 0.373549 1.834627) (xy 0.505938 1.802943) (xy 0.634907 1.761997) (xy 0.760175 1.711891) (xy 0.881459 1.652725)
			(xy 0.998478 1.584602) (xy 1.110949 1.507622) (xy 1.1125 1.506475) (xy 1.219022 1.421526) (xy 1.318044 1.330262)
			(xy 1.409425 1.233136) (xy 1.493024 1.130604) (xy 1.568701 1.023117) (xy 1.636315 0.911132) (xy 1.695726 0.795101)
			(xy 1.746794 0.675479) (xy 1.789377 0.55272) (xy 1.823336 0.427278) (xy 1.848529 0.299607) (xy 1.864818 0.170161)
			(xy 1.87206 0.039393) (xy 1.870116 -0.092241) (xy 1.858845 -0.224288) (xy 1.838107 -0.356294) (xy 1.80776 -0.487805)
			(xy 1.768829 -0.615) (xy 1.720536 -0.739975) (xy 1.663202 -0.861071) (xy 1.597202 -0.977779) (xy 1.522908 -1.089593)
			(xy 1.440695 -1.196005) (xy 1.350937 -1.296506) (xy 1.254006 -1.390589) (xy 1.150278 -1.477747) (xy 1.1125 -1.506476)
			(xy 1.000967 -1.582971) (xy 0.885127 -1.650647) (xy 0.76549 -1.709448) (xy 0.642567 -1.759318) (xy 0.516868 -1.800201)
			(xy 0.388902 -1.832041) (xy 0.259179 -1.854782) (xy 0.128211 -1.868368) (xy -0.003494 -1.872743)
			(xy -0.135424 -1.867852) (xy -0.26707 -1.853638) (xy -0.397922 -1.830045) (xy -0.527469 -1.797018)
			(xy -0.655201 -1.754501) (xy -0.759957 -1.711751) (xy -0.880445 -1.653209) (xy -0.994857 -1.587105)
			(xy -1.103791 -1.513023) (xy -1.207843 -1.430544) (xy -1.307608 -1.339253) (xy -1.341378 -1.305394)
			(xy -1.432129 -1.205984) (xy -1.513824 -1.103053) (xy -1.586901 -0.995875) (xy -1.651802 -0.883726)
			(xy -1.708969 -0.76588) (xy -1.758841 -0.641611) (xy -1.777661 -0.5875) (xy -1.810958 -0.477304)
			(xy -1.836562 -0.369027) (xy -1.854844 -0.260357) (xy -1.866173 -0.148981) (xy -1.870919 -0.032588)
			(xy -1.87112 -0.0025) (xy -2.497428 -0.0025) (xy -2.497271 -0.054935) (xy -2.496737 -0.101519) (xy -2.495775 -0.141397)
			(xy -2.494324 -0.176212) (xy -2.492326 -0.207608) (xy -2.48972 -0.237232) (xy -2.48838 -0.25) (xy -2.465936 -0.410234)
			(xy -2.434246 -0.566997) (xy -2.393461 -0.720023) (xy -2.343733 -0.869045) (xy -2.285214 -1.013795)
			(xy -2.218055 -1.154007) (xy -2.142407 -1.289414) (xy -2.058423 -1.419749) (xy -1.966255 -1.544744)
			(xy -1.866053 -1.664133) (xy -1.75797 -1.777649) (xy -1.642158 -1.885024) (xy -1.518767 -1.985992)
			(xy -1.489588 -2.008089) (xy -1.365262 -2.094748) (xy -1.234765 -2.173931) (xy -1.09894 -2.245291)
			(xy -0.958628 -2.308482) (xy -0.814671 -2.363157) (xy -0.66791 -2.408969) (xy -0.519188 -2.445571)
			(xy -0.369346 -2.472617) (xy -0.3575 -2.474334) (xy -0.313003 -2.480516) (xy -0.27404 -2.485504)
			(xy -0.238673 -2.489419) (xy -0.204966 -2.492384) (xy -0.170981 -2.494518) (xy -0.134781 -2.495944)
			(xy -0.094429 -2.496782) (xy -0.047986 -2.497154) (xy 0.006483 -2.49718)
		)
		(stroke
			(width 0)
			(type solid)
		)
		(fill solid)
		(layer "F.SilkS")
		(uuid "0bdd1948-9043-4e9f-b1ef-8921d5592108")
	)
)
