(footprint "WE-691201820001"
	(version 20240108)
	(generator "pcbnew")
	(generator_version "8.0")
	(layer "F.Cu")
	(descr "<b>WR-TBL Serie 2018 - 10.00 mm 45° Entry w. Rising Cage Clamp<br></b>Max Height =12mm , Pitch 10mm , 1 Pin")
	(property "Reference" "REF**"
		(at 2.5 -7.635 0)
		(layer "F.SilkS")
		(uuid "c3178570-d65e-4672-8e59-6e7fbb2bcb05")
		(effects
			(font
				(size 1 1)
				(thickness 0.15)
			)
		)
	)
	(property "Value" "691201820001"
		(at 7.12 7.865 0)
		(layer "F.Fab")
		(uuid "5b77b275-f99f-4fbd-81cf-a3f270fca90e")
		(effects
			(font
				(size 1 1)
				(thickness 0.15)
			)
		)
	)
	(property "Footprint" ""
		(at 0 0 0)
		(layer "F.Fab")
		(hide yes)
		(uuid "293e68f1-570a-4eeb-8167-8bf6f1a01b33")
		(effects
			(font
				(size 1.27 1.27)
				(thickness 0.15)
			)
		)
	)
	(property "Datasheet" ""
		(at 0 0 0)
		(layer "F.Fab")
		(hide yes)
		(uuid "4c9d9e8c-4c8e-491e-8629-2f09ca5e6cc1")
		(effects
			(font
				(size 1.27 1.27)
				(thickness 0.15)
			)
		)
	)
	(property "Description" ""
		(at 0 0 0)
		(layer "F.Fab")
		(hide yes)
		(uuid "1c8b74c3-3cf0-4dbb-9ce7-ac0be53f65a8")
		(effects
			(font
				(size 1.27 1.27)
				(thickness 0.15)
			)
		)
	)
	(attr through_hole)
	(fp_line
		(start -2.6 -6.1)
		(end 8.2 -6.1)
		(stroke
			(width 0.2)
			(type solid)
		)
		(layer "F.SilkS")
		(uuid "c0e43f71-12ef-436d-b029-b805731f25f8")
	)
	(fp_line
		(start -2.6 6.6)
		(end -2.6 -6.1)
		(stroke
			(width 0.2)
			(type solid)
		)
		(layer "F.SilkS")
		(uuid "983a0527-cbe4-4be9-8bcf-e1731be92d50")
	)
	(fp_line
		(start 7.6 -3.144)
		(end -2.6 -3.144)
		(stroke
			(width 0.2)
			(type solid)
		)
		(layer "F.SilkS")
		(uuid "b6187c27-9454-44d1-947d-f44cc868cc12")
	)
	(fp_line
		(start 7.6 -3.144)
		(end 7.6 6.6)
		(stroke
			(width 0.2)
			(type solid)
		)
		(layer "F.SilkS")
		(uuid "0dc20089-608e-4d14-9480-de3474cd7ec6")
	)
	(fp_line
		(start 7.6 6.6)
		(end -2.6 6.6)
		(stroke
			(width 0.2)
			(type solid)
		)
		(layer "F.SilkS")
		(uuid "ebb70cf9-ae61-4a57-a951-82e292fb9825")
	)
	(fp_line
		(start 8.2 -6.1)
		(end 8.2 -2.9)
		(stroke
			(width 0.2)
			(type solid)
		)
		(layer "F.SilkS")
		(uuid "2d220ae1-2b78-4435-b006-b99b0f8022de")
	)
	(fp_line
		(start 8.2 -2.9)
		(end 7.6 -3.144)
		(stroke
			(width 0.2)
			(type solid)
		)
		(layer "F.SilkS")
		(uuid "7a3f16d8-1be0-45ce-a025-425f034f7970")
	)
	(fp_poly
		(pts
			(xy -2.7 -6.2) (xy 8.3 -6.2) (xy 8.3 6.7) (xy -2.7 6.7)
		)
		(stroke
			(width 0.1)
			(type solid)
		)
		(fill none)
		(layer "F.CrtYd")
		(uuid "012b13e7-cf73-4f3a-ae7a-9d080141dca9")
	)
	(fp_line
		(start -2.5 -6)
		(end 8.1 -6)
		(stroke
			(width 0.1)
			(type solid)
		)
		(layer "F.Fab")
		(uuid "ddc9583a-3d78-4d41-9b69-c1eaba655991")
	)
	(fp_line
		(start -2.5 6.5)
		(end -2.5 -6)
		(stroke
			(width 0.1)
			(type solid)
		)
		(layer "F.Fab")
		(uuid "6bdaf90f-f907-4663-b34a-7fd64231b25d")
	)
	(fp_line
		(start 7.5 -3.244)
		(end 7.5 6.5)
		(stroke
			(width 0.1)
			(type solid)
		)
		(layer "F.Fab")
		(uuid "ba83ab08-44b5-4003-976a-d032d2f1d0c6")
	)
	(fp_line
		(start 7.5 -3.244)
		(end 8.1 -3)
		(stroke
			(width 0.1)
			(type solid)
		)
		(layer "F.Fab")
		(uuid "8e1a8bca-1ad1-47f8-9478-dfde6f9c62b9")
	)
	(fp_line
		(start 7.5 6.5)
		(end -2.5 6.5)
		(stroke
			(width 0.1)
			(type solid)
		)
		(layer "F.Fab")
		(uuid "731e701a-f57e-4ff4-9f7a-9bc471f26a43")
	)
	(fp_line
		(start 8.1 -6)
		(end 8.1 -3)
		(stroke
			(width 0.1)
			(type solid)
		)
		(layer "F.Fab")
		(uuid "48b45771-88a3-40c9-8b70-73cde0e8353a")
	)
	(pad "1" thru_hole circle
		(at 0 0)
		(size 1.95 1.95)
		(drill 1.3)
		(layers "*.Cu" "*.Mask")
		(remove_unused_layers no)
		(solder_mask_margin 0.102)
		(uuid "542ea40f-b367-42c6-97d3-cacae1717d2b")
	)
	(model "${KIPRJMOD}/kicad-library/3D/connectors.3dshapes/WE-691201820001.stp"
		(offset
			(xyz -2.5 6 0)
		)
		(scale
			(xyz 1 1 1)
		)
		(rotate
			(xyz -90 0 -90)
		)
	)
)
