ISO-10303-21;
HEADER;
FILE_DESCRIPTION(('STEP AP214'),'1');
FILE_NAME('SOT404_D2PAK_NEX','2023-06-20T03:02:13',(''),(''),'','','');
FILE_SCHEMA(('AUTOMOTIVE_DESIGN'));
ENDSEC;
DATA;
#1=SHAPE_DEFINITION_REPRESENTATION(#2,#3);
#2=PRODUCT_DEFINITION_SHAPE('',$,#4);
#3=SHAPE_REPRESENTATION('',(#188,#244,#541,#1411,#2282,#19),#11);
#4=PRODUCT_DEFINITION('design','example product_definition',#6,#5);
#5=PRODUCT_DEFINITION_CONTEXT('3D Mechanical Parts',#10,'design');
#6=PRODUCT_DEFINITION_FORMATION('1.0','first version',#8);
#7=APPLICATION_PROTOCOL_DEFINITION('international standard','automotive_design',2003,#10);
#8=PRODUCT('product','part','',(#9));
#9=PRODUCT_CONTEXT('3D Mechanical Parts',#10,'mechanical');
#10=APPLICATION_CONTEXT('Core Data for Automotive Mechanical Design Process');
#11=(GEOMETRIC_REPRESENTATION_CONTEXT(3) GLOBAL_UNCERTAINTY_ASSIGNED_CONTEXT((#12)) GLOBAL_UNIT_ASSIGNED_CONTEXT((#13,#14,#18)) REPRESENTATION_CONTEXT('ID1','3D'));
#12=UNCERTAINTY_MEASURE_WITH_UNIT(LENGTH_MEASURE(1.E-005),#13,'DISTANCE_ACCURACY_VALUE','Maximum model space distance between geometric entities at asserted connectivities');
#13=(LENGTH_UNIT() NAMED_UNIT(*) SI_UNIT(.MILLI.,.METRE.));
#14=(CONVERSION_BASED_UNIT('degree',#16) NAMED_UNIT(#15) PLANE_ANGLE_UNIT());
#15=DIMENSIONAL_EXPONENTS(0.,0.,0.,0.,0.,0.,0.);
#16=MEASURE_WITH_UNIT(PLANE_ANGLE_MEASURE(0.01745329252),#17);
#17=(NAMED_UNIT(*) PLANE_ANGLE_UNIT() SI_UNIT($,.RADIAN.));
#18=(NAMED_UNIT(*) SI_UNIT($,.STERADIAN.) SOLID_ANGLE_UNIT());
#19=AXIS2_PLACEMENT_3D('',#20,#21,#22);
#20=CARTESIAN_POINT('',(0.0,0.0,0.0));
#21=DIRECTION('',(0.0,0.0,1.0));
#22=DIRECTION('',(1.0,0.0,0.0));
#25=MECHANICAL_DESIGN_GEOMETRIC_PRESENTATION_REPRESENTATION($,(#240,#241,#242,#246,#295,#344,#393,#442,#491,#543,#592,#641,#690,#739,#788,#837,#886,#935,#986,#1037,#1088,#1139,#1275,#1413,#1462,#1511,#1560,#1609,#1658,#1707,#1756,#1805,#1856,#1907,#1958,#2009,#2145,#2284,#2333,#2382,#2431,#2480,#2529,#2578,#2627,#2676,#2725,#2774,#2823,#2872,#2941,#3030,#3179),#11);
#26=PRODUCT_CATEGORY_RELATIONSHIP('','',#27,#28);
#27=PRODUCT_CATEGORY('part','');
#28=PRODUCT_RELATED_PRODUCT_CATEGORY('','',(#8));
#34=PRESENTATION_STYLE_ASSIGNMENT((#35,#40));
#35=SURFACE_STYLE_USAGE(.BOTH.,#36);
#36=SURFACE_SIDE_STYLE('',(#37));
#37=SURFACE_STYLE_FILL_AREA(#38);
#38=FILL_AREA_STYLE('',(#39));
#39=FILL_AREA_STYLE_COLOUR('',#41);
#40=CURVE_STYLE('',#42,POSITIVE_LENGTH_MEASURE(0.1),#41);
#41=COLOUR_RGB('Aluminum',0.725,0.725,0.725);
#42=DRAUGHTING_PRE_DEFINED_CURVE_FONT('continuous');
#43=PRESENTATION_STYLE_ASSIGNMENT((#44,#49));
#44=SURFACE_STYLE_USAGE(.BOTH.,#45);
#45=SURFACE_SIDE_STYLE('',(#46));
#46=SURFACE_STYLE_FILL_AREA(#47);
#47=FILL_AREA_STYLE('',(#48));
#48=FILL_AREA_STYLE_COLOUR('',#50);
#49=CURVE_STYLE('',#51,POSITIVE_LENGTH_MEASURE(0.1),#50);
#50=COLOUR_RGB('Black',0.196,0.196,0.196);
#51=DRAUGHTING_PRE_DEFINED_CURVE_FONT('continuous');
#52=PRESENTATION_STYLE_ASSIGNMENT((#53,#58));
#53=SURFACE_STYLE_USAGE(.BOTH.,#54);
#54=SURFACE_SIDE_STYLE('',(#55));
#55=SURFACE_STYLE_FILL_AREA(#56);
#56=FILL_AREA_STYLE('',(#57));
#57=FILL_AREA_STYLE_COLOUR('',#59);
#58=CURVE_STYLE('',#60,POSITIVE_LENGTH_MEASURE(0.1),#59);
#59=COLOUR_RGB('Pin1',0.588,0.588,0.588);
#60=DRAUGHTING_PRE_DEFINED_CURVE_FONT('continuous');
#61=PRESENTATION_STYLE_ASSIGNMENT((#62,#67));
#62=SURFACE_STYLE_USAGE(.BOTH.,#63);
#63=SURFACE_SIDE_STYLE('',(#64));
#64=SURFACE_STYLE_FILL_AREA(#65);
#65=FILL_AREA_STYLE('',(#66));
#66=FILL_AREA_STYLE_COLOUR('',#68);
#67=CURVE_STYLE('',#69,POSITIVE_LENGTH_MEASURE(0.1),#68);
#68=COLOUR_RGB('HeatTab',0.588,0.588,0.588);
#69=DRAUGHTING_PRE_DEFINED_CURVE_FONT('continuous');
#70=PRESENTATION_STYLE_ASSIGNMENT((#71,#76));
#71=SURFACE_STYLE_USAGE(.BOTH.,#72);
#72=SURFACE_SIDE_STYLE('',(#73));
#73=SURFACE_STYLE_FILL_AREA(#74);
#74=FILL_AREA_STYLE('',(#75));
#75=FILL_AREA_STYLE_COLOUR('',#77);
#76=CURVE_STYLE('',#78,POSITIVE_LENGTH_MEASURE(0.1),#77);
#77=COLOUR_RGB('Gold',0.843,0.686,0.0);
#78=DRAUGHTING_PRE_DEFINED_CURVE_FONT('continuous');
#79=PRESENTATION_STYLE_ASSIGNMENT((#80,#85));
#80=SURFACE_STYLE_USAGE(.BOTH.,#81);
#81=SURFACE_SIDE_STYLE('',(#82));
#82=SURFACE_STYLE_FILL_AREA(#83);
#83=FILL_AREA_STYLE('',(#84));
#84=FILL_AREA_STYLE_COLOUR('',#86);
#85=CURVE_STYLE('',#87,POSITIVE_LENGTH_MEASURE(0.1),#86);
#86=COLOUR_RGB('Brown',0.459,0.345,0.176);
#87=DRAUGHTING_PRE_DEFINED_CURVE_FONT('continuous');
#88=PRESENTATION_STYLE_ASSIGNMENT((#89,#94));
#89=SURFACE_STYLE_USAGE(.BOTH.,#90);
#90=SURFACE_SIDE_STYLE('',(#91));
#91=SURFACE_STYLE_FILL_AREA(#92);
#92=FILL_AREA_STYLE('',(#93));
#93=FILL_AREA_STYLE_COLOUR('',#95);
#94=CURVE_STYLE('',#96,POSITIVE_LENGTH_MEASURE(0.1),#95);
#95=COLOUR_RGB('Tan',0.784,0.686,0.51);
#96=DRAUGHTING_PRE_DEFINED_CURVE_FONT('continuous');
#97=PRESENTATION_STYLE_ASSIGNMENT((#98,#103));
#98=SURFACE_STYLE_USAGE(.BOTH.,#99);
#99=SURFACE_SIDE_STYLE('',(#100));
#100=SURFACE_STYLE_FILL_AREA(#101);
#101=FILL_AREA_STYLE('',(#102));
#102=FILL_AREA_STYLE_COLOUR('',#104);
#103=CURVE_STYLE('',#105,POSITIVE_LENGTH_MEASURE(0.1),#104);
#104=COLOUR_RGB('Gray',0.431,0.431,0.431);
#105=DRAUGHTING_PRE_DEFINED_CURVE_FONT('continuous');
#106=PRESENTATION_STYLE_ASSIGNMENT((#107,#112));
#107=SURFACE_STYLE_USAGE(.BOTH.,#108);
#108=SURFACE_SIDE_STYLE('',(#109));
#109=SURFACE_STYLE_FILL_AREA(#110);
#110=FILL_AREA_STYLE('',(#111));
#111=FILL_AREA_STYLE_COLOUR('',#113);
#112=CURVE_STYLE('',#114,POSITIVE_LENGTH_MEASURE(0.1),#113);
#113=COLOUR_RGB('Red',0.6,0.0,0.0);
#114=DRAUGHTING_PRE_DEFINED_CURVE_FONT('continuous');
#115=PRESENTATION_STYLE_ASSIGNMENT((#116,#121));
#116=SURFACE_STYLE_USAGE(.BOTH.,#117);
#117=SURFACE_SIDE_STYLE('',(#118));
#118=SURFACE_STYLE_FILL_AREA(#119);
#119=FILL_AREA_STYLE('',(#120));
#120=FILL_AREA_STYLE_COLOUR('',#122);
#121=CURVE_STYLE('',#123,POSITIVE_LENGTH_MEASURE(0.1),#122);
#122=COLOUR_RGB('Blue',0.157,0.157,0.588);
#123=DRAUGHTING_PRE_DEFINED_CURVE_FONT('continuous');
#124=PRESENTATION_STYLE_ASSIGNMENT((#125,#130));
#125=SURFACE_STYLE_USAGE(.BOTH.,#126);
#126=SURFACE_SIDE_STYLE('',(#127));
#127=SURFACE_STYLE_FILL_AREA(#128);
#128=FILL_AREA_STYLE('',(#129));
#129=FILL_AREA_STYLE_COLOUR('',#131);
#130=CURVE_STYLE('',#132,POSITIVE_LENGTH_MEASURE(0.1),#131);
#131=COLOUR_RGB('Maroon',0.294,0.0,0.0);
#132=DRAUGHTING_PRE_DEFINED_CURVE_FONT('continuous');
#133=PRESENTATION_STYLE_ASSIGNMENT((#134,#139));
#134=SURFACE_STYLE_USAGE(.BOTH.,#135);
#135=SURFACE_SIDE_STYLE('',(#136));
#136=SURFACE_STYLE_FILL_AREA(#137);
#137=FILL_AREA_STYLE('',(#138));
#138=FILL_AREA_STYLE_COLOUR('',#140);
#139=CURVE_STYLE('',#141,POSITIVE_LENGTH_MEASURE(0.1),#140);
#140=COLOUR_RGB('Green',0.0,0.294,0.0);
#141=DRAUGHTING_PRE_DEFINED_CURVE_FONT('continuous');
#142=PRESENTATION_STYLE_ASSIGNMENT((#143,#148));
#143=SURFACE_STYLE_USAGE(.BOTH.,#144);
#144=SURFACE_SIDE_STYLE('',(#145));
#145=SURFACE_STYLE_FILL_AREA(#146);
#146=FILL_AREA_STYLE('',(#147));
#147=FILL_AREA_STYLE_COLOUR('',#149);
#148=CURVE_STYLE('',#150,POSITIVE_LENGTH_MEASURE(0.1),#149);
#149=COLOUR_RGB('Pin1Wrap',0.98,0.706,0.176);
#150=DRAUGHTING_PRE_DEFINED_CURVE_FONT('continuous');
#151=PRESENTATION_STYLE_ASSIGNMENT((#152,#157));
#152=SURFACE_STYLE_USAGE(.BOTH.,#153);
#153=SURFACE_SIDE_STYLE('',(#154));
#154=SURFACE_STYLE_FILL_AREA(#155);
#155=FILL_AREA_STYLE('',(#156));
#156=FILL_AREA_STYLE_COLOUR('',#158);
#157=CURVE_STYLE('',#159,POSITIVE_LENGTH_MEASURE(0.1),#158);
#158=COLOUR_RGB('Pin1Rad',0.588,0.588,0.588);
#159=DRAUGHTING_PRE_DEFINED_CURVE_FONT('continuous');
#160=PRESENTATION_STYLE_ASSIGNMENT((#161,#166));
#161=SURFACE_STYLE_USAGE(.BOTH.,#162);
#162=SURFACE_SIDE_STYLE('',(#163));
#163=SURFACE_STYLE_FILL_AREA(#164);
#164=FILL_AREA_STYLE('',(#165));
#165=FILL_AREA_STYLE_COLOUR('',#167);
#166=CURVE_STYLE('',#168,POSITIVE_LENGTH_MEASURE(0.1),#167);
#167=COLOUR_RGB('Pin1Axial',0.98,0.706,0.176);
#168=DRAUGHTING_PRE_DEFINED_CURVE_FONT('continuous');
#169=PRESENTATION_STYLE_ASSIGNMENT((#170,#175));
#170=SURFACE_STYLE_USAGE(.BOTH.,#171);
#171=SURFACE_SIDE_STYLE('',(#172));
#172=SURFACE_STYLE_FILL_AREA(#173);
#173=FILL_AREA_STYLE('',(#174));
#174=FILL_AREA_STYLE_COLOUR('',#176);
#175=CURVE_STYLE('',#177,POSITIVE_LENGTH_MEASURE(0.1),#176);
#176=COLOUR_RGB('Pin1Tant',0.459,0.345,0.176);
#177=DRAUGHTING_PRE_DEFINED_CURVE_FONT('continuous');
#178=PRESENTATION_STYLE_ASSIGNMENT((#179,#184));
#179=SURFACE_STYLE_USAGE(.BOTH.,#180);
#180=SURFACE_SIDE_STYLE('',(#181));
#181=SURFACE_STYLE_FILL_AREA(#182);
#182=FILL_AREA_STYLE('',(#183));
#183=FILL_AREA_STYLE_COLOUR('',#185);
#184=CURVE_STYLE('',#186,POSITIVE_LENGTH_MEASURE(0.1),#185);
#185=COLOUR_RGB('Shroud',0.235,0.235,0.235);
#186=DRAUGHTING_PRE_DEFINED_CURVE_FONT('continuous');
#188=MANIFOLD_SOLID_BREP($,#189);
#189=CLOSED_SHELL('',(#190,#191,#192));
#190=ADVANCED_FACE($,(#196,#195),#213,.T.);
#191=ADVANCED_FACE($,(#197),#193,.F.);
#192=ADVANCED_FACE($,(#198),#194,.T.);
#193=PLANE($,#218);
#194=PLANE($,#219);
#195=FACE_BOUND($,#200,.T.);
#196=FACE_OUTER_BOUND($,#199,.T.);
#197=FACE_OUTER_BOUND($,#201,.T.);
#198=FACE_OUTER_BOUND($,#202,.T.);
#199=EDGE_LOOP($,(#209));
#200=EDGE_LOOP($,(#210));
#201=EDGE_LOOP($,(#211));
#202=EDGE_LOOP($,(#212));
#203=CIRCLE($,#216,0.25781);
#204=CIRCLE($,#217,0.25781);
#205=VERTEX_POINT('',#234);
#206=VERTEX_POINT('',#236);
#207=EDGE_CURVE($,#205,#205,#203,.T.);
#208=EDGE_CURVE($,#206,#206,#204,.T.);
#209=ORIENTED_EDGE($,*,*,#207,.F.);
#210=ORIENTED_EDGE($,*,*,#208,.F.);
#211=ORIENTED_EDGE($,*,*,#208,.T.);
#212=ORIENTED_EDGE($,*,*,#207,.T.);
#213=CYLINDRICAL_SURFACE($,#215,0.25781);
#214=AXIS2_PLACEMENT_3D('placement',#232,#220,#221);
#215=AXIS2_PLACEMENT_3D($,#233,#222,#223);
#216=AXIS2_PLACEMENT_3D($,#235,#224,#225);
#217=AXIS2_PLACEMENT_3D($,#237,#226,#227);
#218=AXIS2_PLACEMENT_3D($,#238,#228,#229);
#219=AXIS2_PLACEMENT_3D($,#239,#230,#231);
#220=DIRECTION('axis',(0.,1.,0.));
#221=DIRECTION('refdir',(1.,0.,0.));
#222=DIRECTION('',(0.,0.,1.));
#223=DIRECTION('',(1.,0.,0.));
#224=DIRECTION('',(0.,0.,1.));
#225=DIRECTION('',(1.,0.,0.));
#226=DIRECTION('',(0.,0.,-1.));
#227=DIRECTION('',(1.,0.,0.));
#228=DIRECTION('',(0.,0.,1.));
#229=DIRECTION('',(0.,1.,0.));
#230=DIRECTION('',(0.,0.,1.));
#231=DIRECTION('',(0.,1.,0.));
#232=CARTESIAN_POINT('',(0.,0.,0.));
#233=CARTESIAN_POINT('',(-2.54,-3.503,4.496));
#234=CARTESIAN_POINT('',(-2.798,-3.503,4.498));
#235=CARTESIAN_POINT('',(-2.54,-3.503,4.498));
#236=CARTESIAN_POINT('',(-2.798,-3.503,4.496));
#237=CARTESIAN_POINT('',(-2.54,-3.503,4.496));
#238=CARTESIAN_POINT('',(-2.54,-3.503,4.496));
#239=CARTESIAN_POINT('',(-2.54,-3.503,4.498));
#240=STYLED_ITEM('color',(#52),#190);
#241=STYLED_ITEM('color',(#52),#191);
#242=STYLED_ITEM('color',(#52),#192);
#244=MANIFOLD_SOLID_BREP($,#245);
#245=CLOSED_SHELL('',(#247,#296,#345,#394,#443,#492));
#246=STYLED_ITEM('',(#43),#247);
#247=ADVANCED_FACE('',(#253),#248,.T.);
#248=PLANE('',#249);
#249=AXIS2_PLACEMENT_3D('',#250,#251,#252);
#250=CARTESIAN_POINT('',(-5.156,-5.499,0.0));
#251=DIRECTION('',(0.0,-1.0,0.0));
#252=DIRECTION('',(0.,0.,1.));
#253=FACE_OUTER_BOUND('',#254,.T.);
#254=EDGE_LOOP('',(#255,#265,#275,#285));
#258=CARTESIAN_POINT('',(5.156,-5.499,0.0));
#257=VERTEX_POINT('',#258);
#260=CARTESIAN_POINT('',(-5.156,-5.499,0.0));
#259=VERTEX_POINT('',#260);
#256=EDGE_CURVE('',#257,#259,#261,.T.);
#261=LINE('',#258,#263);
#263=VECTOR('',#264,10.3124);
#264=DIRECTION('',(-1.0,0.0,0.0));
#255=ORIENTED_EDGE('',*,*,#256,.F.);
#268=CARTESIAN_POINT('',(5.156,-5.499,4.496));
#267=VERTEX_POINT('',#268);
#266=EDGE_CURVE('',#267,#257,#271,.T.);
#271=LINE('',#268,#273);
#273=VECTOR('',#274,4.4958);
#274=DIRECTION('',(0.0,0.0,-1.0));
#265=ORIENTED_EDGE('',*,*,#266,.F.);
#278=CARTESIAN_POINT('',(-5.156,-5.499,4.496));
#277=VERTEX_POINT('',#278);
#276=EDGE_CURVE('',#277,#267,#281,.T.);
#281=LINE('',#278,#283);
#283=VECTOR('',#284,10.3124);
#284=DIRECTION('',(1.0,0.0,0.0));
#275=ORIENTED_EDGE('',*,*,#276,.F.);
#286=EDGE_CURVE('',#259,#277,#291,.T.);
#291=LINE('',#260,#293);
#293=VECTOR('',#294,4.4958);
#294=DIRECTION('',(0.0,0.0,1.0));
#285=ORIENTED_EDGE('',*,*,#286,.F.);
#295=STYLED_ITEM('',(#43),#296);
#296=ADVANCED_FACE('',(#302),#297,.T.);
#297=PLANE('',#298);
#298=AXIS2_PLACEMENT_3D('',#299,#300,#301);
#299=CARTESIAN_POINT('',(5.156,-5.499,0.0));
#300=DIRECTION('',(1.0,0.0,0.0));
#301=DIRECTION('',(0.,0.,1.));
#302=FACE_OUTER_BOUND('',#303,.T.);
#303=EDGE_LOOP('',(#304,#314,#324,#334));
#307=CARTESIAN_POINT('',(5.156,5.499,0.0));
#306=VERTEX_POINT('',#307);
#305=EDGE_CURVE('',#306,#257,#310,.T.);
#310=LINE('',#307,#312);
#312=VECTOR('',#313,10.9982);
#313=DIRECTION('',(0.0,-1.0,0.0));
#304=ORIENTED_EDGE('',*,*,#305,.F.);
#317=CARTESIAN_POINT('',(5.156,5.499,4.496));
#316=VERTEX_POINT('',#317);
#315=EDGE_CURVE('',#316,#306,#320,.T.);
#320=LINE('',#317,#322);
#322=VECTOR('',#323,4.4958);
#323=DIRECTION('',(0.0,0.0,-1.0));
#314=ORIENTED_EDGE('',*,*,#315,.F.);
#325=EDGE_CURVE('',#267,#316,#330,.T.);
#330=LINE('',#268,#332);
#332=VECTOR('',#333,10.9982);
#333=DIRECTION('',(0.0,1.0,0.0));
#324=ORIENTED_EDGE('',*,*,#325,.F.);
#334=ORIENTED_EDGE('',*,*,#266,.T.);
#344=STYLED_ITEM('',(#43),#345);
#345=ADVANCED_FACE('',(#351),#346,.T.);
#346=PLANE('',#347);
#347=AXIS2_PLACEMENT_3D('',#348,#349,#350);
#348=CARTESIAN_POINT('',(5.156,5.499,0.0));
#349=DIRECTION('',(0.0,1.0,0.0));
#350=DIRECTION('',(0.,0.,1.));
#351=FACE_OUTER_BOUND('',#352,.T.);
#352=EDGE_LOOP('',(#353,#363,#373,#383));
#356=CARTESIAN_POINT('',(-5.156,5.499,0.0));
#355=VERTEX_POINT('',#356);
#354=EDGE_CURVE('',#355,#306,#359,.T.);
#359=LINE('',#356,#361);
#361=VECTOR('',#362,10.3124);
#362=DIRECTION('',(1.0,0.0,0.0));
#353=ORIENTED_EDGE('',*,*,#354,.F.);
#366=CARTESIAN_POINT('',(-5.156,5.499,4.496));
#365=VERTEX_POINT('',#366);
#364=EDGE_CURVE('',#365,#355,#369,.T.);
#369=LINE('',#366,#371);
#371=VECTOR('',#372,4.4958);
#372=DIRECTION('',(0.0,0.0,-1.0));
#363=ORIENTED_EDGE('',*,*,#364,.F.);
#374=EDGE_CURVE('',#316,#365,#379,.T.);
#379=LINE('',#317,#381);
#381=VECTOR('',#382,10.3124);
#382=DIRECTION('',(-1.0,0.0,0.0));
#373=ORIENTED_EDGE('',*,*,#374,.F.);
#383=ORIENTED_EDGE('',*,*,#315,.T.);
#393=STYLED_ITEM('',(#43),#394);
#394=ADVANCED_FACE('',(#400),#395,.T.);
#395=PLANE('',#396);
#396=AXIS2_PLACEMENT_3D('',#397,#398,#399);
#397=CARTESIAN_POINT('',(-5.156,5.499,0.0));
#398=DIRECTION('',(-1.0,0.0,0.0));
#399=DIRECTION('',(0.,0.,1.));
#400=FACE_OUTER_BOUND('',#401,.T.);
#401=EDGE_LOOP('',(#402,#412,#422,#432));
#403=EDGE_CURVE('',#259,#355,#408,.T.);
#408=LINE('',#260,#410);
#410=VECTOR('',#411,10.9982);
#411=DIRECTION('',(0.0,1.0,0.0));
#402=ORIENTED_EDGE('',*,*,#403,.F.);
#412=ORIENTED_EDGE('',*,*,#286,.T.);
#423=EDGE_CURVE('',#365,#277,#428,.T.);
#428=LINE('',#366,#430);
#430=VECTOR('',#431,10.9982);
#431=DIRECTION('',(0.0,-1.0,0.0));
#422=ORIENTED_EDGE('',*,*,#423,.F.);
#432=ORIENTED_EDGE('',*,*,#364,.T.);
#442=STYLED_ITEM('',(#43),#443);
#443=ADVANCED_FACE('',(#449),#444,.T.);
#444=PLANE('',#445);
#445=AXIS2_PLACEMENT_3D('',#446,#447,#448);
#446=CARTESIAN_POINT('',(-5.156,5.499,0.0));
#447=DIRECTION('',(0.0,0.0,-1.0));
#448=DIRECTION('',(0.,1.,0.));
#449=FACE_OUTER_BOUND('',#450,.T.);
#450=EDGE_LOOP('',(#451,#461,#471,#481));
#451=ORIENTED_EDGE('',*,*,#354,.T.);
#461=ORIENTED_EDGE('',*,*,#305,.T.);
#471=ORIENTED_EDGE('',*,*,#256,.T.);
#481=ORIENTED_EDGE('',*,*,#403,.T.);
#491=STYLED_ITEM('',(#43),#492);
#492=ADVANCED_FACE('',(#498),#493,.T.);
#493=PLANE('',#494);
#494=AXIS2_PLACEMENT_3D('',#495,#496,#497);
#495=CARTESIAN_POINT('',(-5.156,-5.499,4.496));
#496=DIRECTION('',(0.0,0.0,1.0));
#497=DIRECTION('',(0.,1.,0.));
#498=FACE_OUTER_BOUND('',#499,.T.);
#499=EDGE_LOOP('',(#500,#510,#520,#530));
#500=ORIENTED_EDGE('',*,*,#276,.T.);
#510=ORIENTED_EDGE('',*,*,#325,.T.);
#520=ORIENTED_EDGE('',*,*,#374,.T.);
#530=ORIENTED_EDGE('',*,*,#423,.T.);
#541=MANIFOLD_SOLID_BREP($,#542);
#542=CLOSED_SHELL('',(#544,#593,#642,#691,#740,#789,#838,#887,#936,#987,#1038,#1089,#1140,#1276));
#543=STYLED_ITEM('',(#34),#544);
#544=ADVANCED_FACE('',(#550),#545,.T.);
#545=PLANE('',#546);
#546=AXIS2_PLACEMENT_3D('',#547,#548,#549);
#547=CARTESIAN_POINT('',(-2.121,-5.499,2.121));
#548=DIRECTION('',(0.0,1.0,0.0));
#549=DIRECTION('',(0.,0.,1.));
#550=FACE_OUTER_BOUND('',#551,.T.);
#551=EDGE_LOOP('',(#552,#562,#572,#582));
#555=CARTESIAN_POINT('',(-2.959,-5.499,2.121));
#554=VERTEX_POINT('',#555);
#557=CARTESIAN_POINT('',(-2.121,-5.499,2.121));
#556=VERTEX_POINT('',#557);
#553=EDGE_CURVE('',#554,#556,#558,.T.);
#558=LINE('',#555,#560);
#560=VECTOR('',#561,0.838199985779816);
#561=DIRECTION('',(1.0,0.0,0.0));
#552=ORIENTED_EDGE('',*,*,#553,.F.);
#565=CARTESIAN_POINT('',(-2.959,-5.499,2.375));
#564=VERTEX_POINT('',#565);
#563=EDGE_CURVE('',#564,#554,#568,.T.);
#568=LINE('',#565,#570);
#570=VECTOR('',#571,0.254);
#571=DIRECTION('',(0.0,0.0,-1.0));
#562=ORIENTED_EDGE('',*,*,#563,.F.);
#575=CARTESIAN_POINT('',(-2.121,-5.499,2.375));
#574=VERTEX_POINT('',#575);
#573=EDGE_CURVE('',#574,#564,#578,.T.);
#578=LINE('',#575,#580);
#580=VECTOR('',#581,0.838199985779816);
#581=DIRECTION('',(-1.0,0.0,0.0));
#572=ORIENTED_EDGE('',*,*,#573,.F.);
#583=EDGE_CURVE('',#556,#574,#588,.T.);
#588=LINE('',#557,#590);
#590=VECTOR('',#591,0.254);
#591=DIRECTION('',(0.0,0.0,1.0));
#582=ORIENTED_EDGE('',*,*,#583,.F.);
#592=STYLED_ITEM('',(#34),#593);
#593=ADVANCED_FACE('',(#599),#594,.T.);
#594=PLANE('',#595);
#595=AXIS2_PLACEMENT_3D('',#596,#597,#598);
#596=CARTESIAN_POINT('',(-2.121,-5.499,2.375));
#597=DIRECTION('',(0.0,0.0,1.0));
#598=DIRECTION('',(0.,1.,0.));
#599=FACE_OUTER_BOUND('',#600,.T.);
#600=EDGE_LOOP('',(#601,#611,#621,#631));
#601=ORIENTED_EDGE('',*,*,#573,.T.);
#614=CARTESIAN_POINT('',(-2.959,-6.713,2.375));
#613=VERTEX_POINT('',#614);
#612=EDGE_CURVE('',#613,#564,#617,.T.);
#617=LINE('',#614,#619);
#619=VECTOR('',#620,1.21420424868253);
#620=DIRECTION('',(0.0,1.0,0.0));
#611=ORIENTED_EDGE('',*,*,#612,.F.);
#624=CARTESIAN_POINT('',(-2.121,-6.713,2.375));
#623=VERTEX_POINT('',#624);
#622=EDGE_CURVE('',#623,#613,#627,.T.);
#627=LINE('',#624,#629);
#629=VECTOR('',#630,0.838199985861642);
#630=DIRECTION('',(-1.0,0.0,0.0));
#621=ORIENTED_EDGE('',*,*,#622,.F.);
#632=EDGE_CURVE('',#574,#623,#637,.T.);
#637=LINE('',#575,#639);
#639=VECTOR('',#640,1.21420424868253);
#640=DIRECTION('',(0.0,-1.0,0.0));
#631=ORIENTED_EDGE('',*,*,#632,.F.);
#641=STYLED_ITEM('',(#34),#642);
#642=ADVANCED_FACE('',(#648),#643,.T.);
#643=PLANE('',#644);
#644=AXIS2_PLACEMENT_3D('',#645,#646,#647);
#645=CARTESIAN_POINT('',(-2.959,-5.499,2.121));
#646=DIRECTION('',(0.0,0.0,-1.0));
#647=DIRECTION('',(0.,1.,0.));
#648=FACE_OUTER_BOUND('',#649,.T.);
#649=EDGE_LOOP('',(#650,#660,#670,#680));
#650=ORIENTED_EDGE('',*,*,#553,.T.);
#663=CARTESIAN_POINT('',(-2.121,-6.713,2.121));
#662=VERTEX_POINT('',#663);
#661=EDGE_CURVE('',#662,#556,#666,.T.);
#666=LINE('',#663,#668);
#668=VECTOR('',#669,1.21420424868253);
#669=DIRECTION('',(0.0,1.0,0.0));
#660=ORIENTED_EDGE('',*,*,#661,.F.);
#673=CARTESIAN_POINT('',(-2.959,-6.713,2.121));
#672=VERTEX_POINT('',#673);
#671=EDGE_CURVE('',#672,#662,#676,.T.);
#676=LINE('',#673,#678);
#678=VECTOR('',#679,0.838199985861642);
#679=DIRECTION('',(1.0,0.0,0.0));
#670=ORIENTED_EDGE('',*,*,#671,.F.);
#681=EDGE_CURVE('',#554,#672,#686,.T.);
#686=LINE('',#555,#688);
#688=VECTOR('',#689,1.21420424868253);
#689=DIRECTION('',(0.0,-1.0,0.0));
#680=ORIENTED_EDGE('',*,*,#681,.F.);
#690=STYLED_ITEM('',(#34),#691);
#691=ADVANCED_FACE('',(#697),#692,.T.);
#692=PLANE('',#693);
#693=AXIS2_PLACEMENT_3D('',#694,#695,#696);
#694=CARTESIAN_POINT('',(-2.959,-7.621,0.442));
#695=DIRECTION('',(0.0,-0.966,0.259));
#696=DIRECTION('',(0.,0.,1.));
#697=FACE_OUTER_BOUND('',#698,.T.);
#698=EDGE_LOOP('',(#699,#709,#719,#729));
#702=CARTESIAN_POINT('',(-2.121,-7.621,0.442));
#701=VERTEX_POINT('',#702);
#704=CARTESIAN_POINT('',(-2.959,-7.621,0.442));
#703=VERTEX_POINT('',#704);
#700=EDGE_CURVE('',#701,#703,#705,.T.);
#705=LINE('',#702,#707);
#707=VECTOR('',#708,0.83819998608939);
#708=DIRECTION('',(-1.0,0.0,0.0));
#699=ORIENTED_EDGE('',*,*,#700,.F.);
#712=CARTESIAN_POINT('',(-2.121,-7.204,1.998));
#711=VERTEX_POINT('',#712);
#710=EDGE_CURVE('',#711,#701,#715,.T.);
#715=LINE('',#712,#717);
#717=VECTOR('',#718,1.61101043226195);
#718=DIRECTION('',(0.0,-0.259,-0.966));
#709=ORIENTED_EDGE('',*,*,#710,.F.);
#722=CARTESIAN_POINT('',(-2.959,-7.204,1.998));
#721=VERTEX_POINT('',#722);
#720=EDGE_CURVE('',#721,#711,#725,.T.);
#725=LINE('',#722,#727);
#727=VECTOR('',#728,0.838199985945784);
#728=DIRECTION('',(1.0,0.0,0.0));
#719=ORIENTED_EDGE('',*,*,#720,.F.);
#730=EDGE_CURVE('',#703,#721,#735,.T.);
#735=LINE('',#704,#737);
#737=VECTOR('',#738,1.61101043226195);
#738=DIRECTION('',(0.0,0.259,0.966));
#729=ORIENTED_EDGE('',*,*,#730,.F.);
#739=STYLED_ITEM('',(#34),#740);
#740=ADVANCED_FACE('',(#746),#741,.T.);
#741=PLANE('',#742);
#742=AXIS2_PLACEMENT_3D('',#743,#744,#745);
#743=CARTESIAN_POINT('',(-2.121,-7.376,0.377));
#744=DIRECTION('',(0.0,0.966,-0.259));
#745=DIRECTION('',(0.,0.,1.));
#746=FACE_OUTER_BOUND('',#747,.T.);
#747=EDGE_LOOP('',(#748,#758,#768,#778));
#751=CARTESIAN_POINT('',(-2.959,-7.376,0.377));
#750=VERTEX_POINT('',#751);
#753=CARTESIAN_POINT('',(-2.121,-7.376,0.377));
#752=VERTEX_POINT('',#753);
#749=EDGE_CURVE('',#750,#752,#754,.T.);
#754=LINE('',#751,#756);
#756=VECTOR('',#757,0.838199985992867);
#757=DIRECTION('',(1.0,0.0,0.0));
#748=ORIENTED_EDGE('',*,*,#749,.F.);
#761=CARTESIAN_POINT('',(-2.959,-6.959,1.933));
#760=VERTEX_POINT('',#761);
#759=EDGE_CURVE('',#760,#750,#764,.T.);
#764=LINE('',#761,#766);
#766=VECTOR('',#767,1.61101043228755);
#767=DIRECTION('',(0.0,-0.259,-0.966));
#758=ORIENTED_EDGE('',*,*,#759,.F.);
#771=CARTESIAN_POINT('',(-2.121,-6.959,1.933));
#770=VERTEX_POINT('',#771);
#769=EDGE_CURVE('',#770,#760,#774,.T.);
#774=LINE('',#771,#776);
#776=VECTOR('',#777,0.838199985896668);
#777=DIRECTION('',(-1.0,0.0,0.0));
#768=ORIENTED_EDGE('',*,*,#769,.F.);
#779=EDGE_CURVE('',#752,#770,#784,.T.);
#784=LINE('',#753,#786);
#786=VECTOR('',#787,1.61101043228755);
#787=DIRECTION('',(0.0,0.259,0.966));
#778=ORIENTED_EDGE('',*,*,#779,.F.);
#788=STYLED_ITEM('',(#34),#789);
#789=ADVANCED_FACE('',(#795),#790,.T.);
#790=PLANE('',#791);
#791=AXIS2_PLACEMENT_3D('',#792,#793,#794);
#792=CARTESIAN_POINT('',(-2.959,-9.08,0.254));
#793=DIRECTION('',(0.0,0.0,1.0));
#794=DIRECTION('',(0.,1.,0.));
#795=FACE_OUTER_BOUND('',#796,.T.);
#796=EDGE_LOOP('',(#797,#807,#817,#827));
#800=CARTESIAN_POINT('',(-2.121,-9.081,0.254));
#799=VERTEX_POINT('',#800);
#802=CARTESIAN_POINT('',(-2.959,-9.08,0.254));
#801=VERTEX_POINT('',#802);
#798=EDGE_CURVE('',#799,#801,#803,.T.);
#803=LINE('',#800,#805);
#805=VECTOR('',#806,0.8382);
#806=DIRECTION('',(-1.0,0.0,0.0));
#797=ORIENTED_EDGE('',*,*,#798,.F.);
#810=CARTESIAN_POINT('',(-2.121,-7.866,0.254));
#809=VERTEX_POINT('',#810);
#808=EDGE_CURVE('',#809,#799,#813,.T.);
#813=LINE('',#810,#815);
#815=VECTOR('',#816,1.21420424024618);
#816=DIRECTION('',(0.0,-1.0,0.0));
#807=ORIENTED_EDGE('',*,*,#808,.F.);
#820=CARTESIAN_POINT('',(-2.959,-7.866,0.254));
#819=VERTEX_POINT('',#820);
#818=EDGE_CURVE('',#819,#809,#823,.T.);
#823=LINE('',#820,#825);
#825=VECTOR('',#826,0.838199986245034);
#826=DIRECTION('',(1.0,0.0,0.0));
#817=ORIENTED_EDGE('',*,*,#818,.F.);
#828=EDGE_CURVE('',#801,#819,#833,.T.);
#833=LINE('',#802,#835);
#835=VECTOR('',#836,1.21420424024618);
#836=DIRECTION('',(0.0,1.0,0.0));
#827=ORIENTED_EDGE('',*,*,#828,.F.);
#837=STYLED_ITEM('',(#34),#838);
#838=ADVANCED_FACE('',(#844),#839,.T.);
#839=PLANE('',#840);
#840=AXIS2_PLACEMENT_3D('',#841,#842,#843);
#841=CARTESIAN_POINT('',(-2.959,-7.866,0.0));
#842=DIRECTION('',(0.0,0.0,-1.0));
#843=DIRECTION('',(0.,1.,0.));
#844=FACE_OUTER_BOUND('',#845,.T.);
#845=EDGE_LOOP('',(#846,#856,#866,#876));
#849=CARTESIAN_POINT('',(-2.121,-7.866,0.0));
#848=VERTEX_POINT('',#849);
#851=CARTESIAN_POINT('',(-2.959,-7.866,0.0));
#850=VERTEX_POINT('',#851);
#847=EDGE_CURVE('',#848,#850,#852,.T.);
#852=LINE('',#849,#854);
#854=VECTOR('',#855,0.838199986245034);
#855=DIRECTION('',(-1.0,0.0,0.0));
#846=ORIENTED_EDGE('',*,*,#847,.F.);
#859=CARTESIAN_POINT('',(-2.121,-9.081,0.0));
#858=VERTEX_POINT('',#859);
#857=EDGE_CURVE('',#858,#848,#862,.T.);
#862=LINE('',#859,#864);
#864=VECTOR('',#865,1.21420424024618);
#865=DIRECTION('',(0.0,1.0,0.0));
#856=ORIENTED_EDGE('',*,*,#857,.F.);
#869=CARTESIAN_POINT('',(-2.959,-9.08,0.0));
#868=VERTEX_POINT('',#869);
#867=EDGE_CURVE('',#868,#858,#872,.T.);
#872=LINE('',#869,#874);
#874=VECTOR('',#875,0.8382);
#875=DIRECTION('',(1.0,0.0,0.0));
#866=ORIENTED_EDGE('',*,*,#867,.F.);
#877=EDGE_CURVE('',#850,#868,#882,.T.);
#882=LINE('',#851,#884);
#884=VECTOR('',#885,1.21420424024618);
#885=DIRECTION('',(0.0,-1.0,0.0));
#876=ORIENTED_EDGE('',*,*,#877,.F.);
#886=STYLED_ITEM('',(#34),#887);
#887=ADVANCED_FACE('',(#893),#888,.T.);
#888=PLANE('',#889);
#889=AXIS2_PLACEMENT_3D('',#890,#891,#892);
#890=CARTESIAN_POINT('',(-2.959,-9.08,0.0));
#891=DIRECTION('',(0.0,-1.0,0.0));
#892=DIRECTION('',(0.,0.,1.));
#893=FACE_OUTER_BOUND('',#894,.T.);
#894=EDGE_LOOP('',(#895,#905,#915,#925));
#895=ORIENTED_EDGE('',*,*,#867,.T.);
#906=EDGE_CURVE('',#799,#858,#911,.T.);
#911=LINE('',#800,#913);
#913=VECTOR('',#914,0.254);
#914=DIRECTION('',(0.0,0.0,-1.0));
#905=ORIENTED_EDGE('',*,*,#906,.F.);
#915=ORIENTED_EDGE('',*,*,#798,.T.);
#926=EDGE_CURVE('',#868,#801,#931,.T.);
#931=LINE('',#869,#933);
#933=VECTOR('',#934,0.254);
#934=DIRECTION('',(0.0,0.0,1.0));
#925=ORIENTED_EDGE('',*,*,#926,.F.);
#935=STYLED_ITEM($,(#34),#936);
#936=ADVANCED_FACE($,(#942),#937,.T.);
#937=CYLINDRICAL_SURFACE($,#938,0.508);
#938=AXIS2_PLACEMENT_3D($,#939,#940,#941);
#939=CARTESIAN_POINT('',(-2.121,-6.713,1.867));
#940=DIRECTION('',(1.0,0.0,0.0));
#941=DIRECTION('',(0.,0.,1.));
#942=FACE_OUTER_BOUND($,#943,.T.);
#943=EDGE_LOOP($,(#955,#965,#976,#944));
#955=ORIENTED_EDGE('',*,*,#622,.T.);
#966=EDGE_CURVE($,#721,#613,#971,.T.);
#971=CIRCLE($,#972,0.508);
#973=CARTESIAN_POINT('',(-2.959,-6.713,1.867));
#972=AXIS2_PLACEMENT_3D($,#973,#974,#975);
#974=DIRECTION('',(-1.0,0.0,0.0));
#975=DIRECTION('',(0.0,0.793,0.609));
#965=ORIENTED_EDGE('',*,*,#966,.F.);
#976=ORIENTED_EDGE('',*,*,#720,.T.);
#945=EDGE_CURVE($,#623,#711,#950,.T.);
#950=CIRCLE($,#951,0.508);
#952=CARTESIAN_POINT('',(-2.121,-6.713,1.867));
#951=AXIS2_PLACEMENT_3D($,#952,#953,#954);
#953=DIRECTION('',(1.0,0.0,0.0));
#954=DIRECTION('',(0.0,-0.793,-0.609));
#944=ORIENTED_EDGE('',*,*,#945,.F.);
#986=STYLED_ITEM($,(#34),#987);
#987=ADVANCED_FACE($,(#993),#988,.F.);
#988=CYLINDRICAL_SURFACE($,#989,0.254);
#989=AXIS2_PLACEMENT_3D($,#990,#991,#992);
#990=CARTESIAN_POINT('',(-2.959,-6.713,1.867));
#991=DIRECTION('',(1.0,0.0,0.0));
#992=DIRECTION('',(0.,0.,-1.));
#993=FACE_OUTER_BOUND($,#994,.T.);
#994=EDGE_LOOP($,(#1006,#1016,#1027,#995));
#1006=ORIENTED_EDGE('',*,*,#671,.T.);
#1017=EDGE_CURVE($,#770,#662,#1022,.T.);
#1022=CIRCLE($,#1023,0.254);
#1023=AXIS2_PLACEMENT_3D($,#952,#1025,#1026);
#1025=DIRECTION('',(-1.0,0.0,0.0));
#1026=DIRECTION('',(0.0,0.793,0.609));
#1016=ORIENTED_EDGE('',*,*,#1017,.F.);
#1027=ORIENTED_EDGE('',*,*,#769,.T.);
#996=EDGE_CURVE($,#672,#760,#1001,.T.);
#1001=CIRCLE($,#1002,0.254);
#1002=AXIS2_PLACEMENT_3D($,#973,#1004,#1005);
#1004=DIRECTION('',(1.0,0.0,0.0));
#1005=DIRECTION('',(0.0,-0.793,-0.609));
#995=ORIENTED_EDGE('',*,*,#996,.F.);
#1037=STYLED_ITEM($,(#34),#1038);
#1038=ADVANCED_FACE($,(#1044),#1039,.F.);
#1039=CYLINDRICAL_SURFACE($,#1040,0.254);
#1040=AXIS2_PLACEMENT_3D($,#1041,#1042,#1043);
#1041=CARTESIAN_POINT('',(-2.959,-7.866,0.508));
#1042=DIRECTION('',(1.0,0.0,0.0));
#1043=DIRECTION('',(0.,0.,1.));
#1044=FACE_OUTER_BOUND($,#1045,.T.);
#1045=EDGE_LOOP($,(#1057,#1067,#1078,#1046));
#1057=ORIENTED_EDGE('',*,*,#818,.T.);
#1068=EDGE_CURVE($,#701,#809,#1073,.T.);
#1073=CIRCLE($,#1074,0.254);
#1075=CARTESIAN_POINT('',(-2.121,-7.866,0.508));
#1074=AXIS2_PLACEMENT_3D($,#1075,#1076,#1077);
#1076=DIRECTION('',(-1.0,0.0,0.0));
#1077=DIRECTION('',(0.0,-0.793,-0.609));
#1067=ORIENTED_EDGE('',*,*,#1068,.F.);
#1078=ORIENTED_EDGE('',*,*,#700,.T.);
#1047=EDGE_CURVE($,#819,#703,#1052,.T.);
#1052=CIRCLE($,#1053,0.254);
#1054=CARTESIAN_POINT('',(-2.959,-7.866,0.508));
#1053=AXIS2_PLACEMENT_3D($,#1054,#1055,#1056);
#1055=DIRECTION('',(1.0,0.0,0.0));
#1056=DIRECTION('',(0.0,0.793,0.609));
#1046=ORIENTED_EDGE('',*,*,#1047,.F.);
#1088=STYLED_ITEM($,(#34),#1089);
#1089=ADVANCED_FACE($,(#1095),#1090,.T.);
#1090=CYLINDRICAL_SURFACE($,#1091,0.508);
#1091=AXIS2_PLACEMENT_3D($,#1092,#1093,#1094);
#1092=CARTESIAN_POINT('',(-2.959,-7.866,0.508));
#1093=DIRECTION('',(1.0,0.0,0.0));
#1094=DIRECTION('',(0.,0.,-1.));
#1095=FACE_OUTER_BOUND($,#1096,.T.);
#1096=EDGE_LOOP($,(#1108,#1118,#1129,#1097));
#1108=ORIENTED_EDGE('',*,*,#847,.T.);
#1119=EDGE_CURVE($,#750,#850,#1124,.T.);
#1124=CIRCLE($,#1125,0.508);
#1125=AXIS2_PLACEMENT_3D($,#1054,#1127,#1128);
#1127=DIRECTION('',(-1.0,0.0,0.0));
#1128=DIRECTION('',(0.0,-0.793,-0.609));
#1118=ORIENTED_EDGE('',*,*,#1119,.F.);
#1129=ORIENTED_EDGE('',*,*,#749,.T.);
#1098=EDGE_CURVE($,#848,#752,#1103,.T.);
#1103=CIRCLE($,#1104,0.508);
#1104=AXIS2_PLACEMENT_3D($,#1075,#1106,#1107);
#1106=DIRECTION('',(1.0,0.0,0.0));
#1107=DIRECTION('',(0.0,0.793,0.609));
#1097=ORIENTED_EDGE('',*,*,#1098,.F.);
#1139=STYLED_ITEM('color',(#34),#1140);
#1140=ADVANCED_FACE($,(#1146),#1141,.T.);
#1141=PLANE($,#1142);
#1142=AXIS2_PLACEMENT_3D($,#1143,#1144,#1145);
#1143=CARTESIAN_POINT('',(-2.959,-5.499,2.121));
#1144=DIRECTION('',(-1.0,0.0,0.0));
#1145=DIRECTION('',(1.,0.,0.));
#1146=FACE_OUTER_BOUND($,#1147,.T.);
#1147=EDGE_LOOP($,(#1150, #1160, #1170, #1233, #1244, #1180, #1191, #1201, #1211, #1221, #1254, #1264));
#1150=ORIENTED_EDGE('',*,*,#612,.T.);
#1160=ORIENTED_EDGE('',*,*,#563,.T.);
#1170=ORIENTED_EDGE('',*,*,#681,.T.);
#1233=ORIENTED_EDGE('',*,*,#996,.T.);
#1244=ORIENTED_EDGE('',*,*,#759,.T.);
#1180=ORIENTED_EDGE('',*,*,#1119,.T.);
#1191=ORIENTED_EDGE('',*,*,#877,.T.);
#1201=ORIENTED_EDGE('',*,*,#926,.T.);
#1211=ORIENTED_EDGE('',*,*,#828,.T.);
#1221=ORIENTED_EDGE('',*,*,#1047,.T.);
#1254=ORIENTED_EDGE('',*,*,#730,.T.);
#1264=ORIENTED_EDGE('',*,*,#966,.T.);
#1275=STYLED_ITEM('color',(#34),#1276);
#1276=ADVANCED_FACE($,(#1282),#1277,.T.);
#1277=PLANE($,#1278);
#1278=AXIS2_PLACEMENT_3D($,#1279,#1280,#1281);
#1279=CARTESIAN_POINT('',(-2.121,-7.866,0.254));
#1280=DIRECTION('',(1.0,0.0,0.0));
#1281=DIRECTION('',(1.,0.,0.));
#1282=FACE_OUTER_BOUND($,#1283,.T.);
#1283=EDGE_LOOP($,(#1286, #1296, #1306, #1369, #1380, #1316, #1327, #1337, #1347, #1357, #1390, #1400));
#1286=ORIENTED_EDGE('',*,*,#661,.T.);
#1296=ORIENTED_EDGE('',*,*,#583,.T.);
#1306=ORIENTED_EDGE('',*,*,#632,.T.);
#1369=ORIENTED_EDGE('',*,*,#945,.T.);
#1380=ORIENTED_EDGE('',*,*,#710,.T.);
#1316=ORIENTED_EDGE('',*,*,#1068,.T.);
#1327=ORIENTED_EDGE('',*,*,#808,.T.);
#1337=ORIENTED_EDGE('',*,*,#906,.T.);
#1347=ORIENTED_EDGE('',*,*,#857,.T.);
#1357=ORIENTED_EDGE('',*,*,#1098,.T.);
#1390=ORIENTED_EDGE('',*,*,#779,.T.);
#1400=ORIENTED_EDGE('',*,*,#1017,.T.);
#1411=MANIFOLD_SOLID_BREP($,#1412);
#1412=CLOSED_SHELL('',(#1414,#1463,#1512,#1561,#1610,#1659,#1708,#1757,#1806,#1857,#1908,#1959,#2010,#2146));
#1413=STYLED_ITEM('',(#34),#1414);
#1414=ADVANCED_FACE('',(#1420),#1415,.T.);
#1415=PLANE('',#1416);
#1416=AXIS2_PLACEMENT_3D('',#1417,#1418,#1419);
#1417=CARTESIAN_POINT('',(2.959,-5.499,2.121));
#1418=DIRECTION('',(0.0,1.0,0.0));
#1419=DIRECTION('',(0.,0.,1.));
#1420=FACE_OUTER_BOUND('',#1421,.T.);
#1421=EDGE_LOOP('',(#1422,#1432,#1442,#1452));
#1425=CARTESIAN_POINT('',(2.121,-5.499,2.121));
#1424=VERTEX_POINT('',#1425);
#1427=CARTESIAN_POINT('',(2.959,-5.499,2.121));
#1426=VERTEX_POINT('',#1427);
#1423=EDGE_CURVE('',#1424,#1426,#1428,.T.);
#1428=LINE('',#1425,#1430);
#1430=VECTOR('',#1431,0.838199985779816);
#1431=DIRECTION('',(1.0,0.0,0.0));
#1422=ORIENTED_EDGE('',*,*,#1423,.F.);
#1435=CARTESIAN_POINT('',(2.121,-5.499,2.375));
#1434=VERTEX_POINT('',#1435);
#1433=EDGE_CURVE('',#1434,#1424,#1438,.T.);
#1438=LINE('',#1435,#1440);
#1440=VECTOR('',#1441,0.254);
#1441=DIRECTION('',(0.0,0.0,-1.0));
#1432=ORIENTED_EDGE('',*,*,#1433,.F.);
#1445=CARTESIAN_POINT('',(2.959,-5.499,2.375));
#1444=VERTEX_POINT('',#1445);
#1443=EDGE_CURVE('',#1444,#1434,#1448,.T.);
#1448=LINE('',#1445,#1450);
#1450=VECTOR('',#1451,0.838199985779816);
#1451=DIRECTION('',(-1.0,0.0,0.0));
#1442=ORIENTED_EDGE('',*,*,#1443,.F.);
#1453=EDGE_CURVE('',#1426,#1444,#1458,.T.);
#1458=LINE('',#1427,#1460);
#1460=VECTOR('',#1461,0.254);
#1461=DIRECTION('',(0.0,0.0,1.0));
#1452=ORIENTED_EDGE('',*,*,#1453,.F.);
#1462=STYLED_ITEM('',(#34),#1463);
#1463=ADVANCED_FACE('',(#1469),#1464,.T.);
#1464=PLANE('',#1465);
#1465=AXIS2_PLACEMENT_3D('',#1466,#1467,#1468);
#1466=CARTESIAN_POINT('',(2.959,-5.499,2.375));
#1467=DIRECTION('',(0.0,0.0,1.0));
#1468=DIRECTION('',(0.,1.,0.));
#1469=FACE_OUTER_BOUND('',#1470,.T.);
#1470=EDGE_LOOP('',(#1471,#1481,#1491,#1501));
#1471=ORIENTED_EDGE('',*,*,#1443,.T.);
#1484=CARTESIAN_POINT('',(2.121,-6.713,2.375));
#1483=VERTEX_POINT('',#1484);
#1482=EDGE_CURVE('',#1483,#1434,#1487,.T.);
#1487=LINE('',#1484,#1489);
#1489=VECTOR('',#1490,1.21420424868253);
#1490=DIRECTION('',(0.0,1.0,0.0));
#1481=ORIENTED_EDGE('',*,*,#1482,.F.);
#1494=CARTESIAN_POINT('',(2.959,-6.713,2.375));
#1493=VERTEX_POINT('',#1494);
#1492=EDGE_CURVE('',#1493,#1483,#1497,.T.);
#1497=LINE('',#1494,#1499);
#1499=VECTOR('',#1500,0.838199985861642);
#1500=DIRECTION('',(-1.0,0.0,0.0));
#1491=ORIENTED_EDGE('',*,*,#1492,.F.);
#1502=EDGE_CURVE('',#1444,#1493,#1507,.T.);
#1507=LINE('',#1445,#1509);
#1509=VECTOR('',#1510,1.21420424868253);
#1510=DIRECTION('',(0.0,-1.0,0.0));
#1501=ORIENTED_EDGE('',*,*,#1502,.F.);
#1511=STYLED_ITEM('',(#34),#1512);
#1512=ADVANCED_FACE('',(#1518),#1513,.T.);
#1513=PLANE('',#1514);
#1514=AXIS2_PLACEMENT_3D('',#1515,#1516,#1517);
#1515=CARTESIAN_POINT('',(2.121,-5.499,2.121));
#1516=DIRECTION('',(0.0,0.0,-1.0));
#1517=DIRECTION('',(0.,1.,0.));
#1518=FACE_OUTER_BOUND('',#1519,.T.);
#1519=EDGE_LOOP('',(#1520,#1530,#1540,#1550));
#1520=ORIENTED_EDGE('',*,*,#1423,.T.);
#1533=CARTESIAN_POINT('',(2.959,-6.713,2.121));
#1532=VERTEX_POINT('',#1533);
#1531=EDGE_CURVE('',#1532,#1426,#1536,.T.);
#1536=LINE('',#1533,#1538);
#1538=VECTOR('',#1539,1.21420424868253);
#1539=DIRECTION('',(0.0,1.0,0.0));
#1530=ORIENTED_EDGE('',*,*,#1531,.F.);
#1543=CARTESIAN_POINT('',(2.121,-6.713,2.121));
#1542=VERTEX_POINT('',#1543);
#1541=EDGE_CURVE('',#1542,#1532,#1546,.T.);
#1546=LINE('',#1543,#1548);
#1548=VECTOR('',#1549,0.838199985861642);
#1549=DIRECTION('',(1.0,0.0,0.0));
#1540=ORIENTED_EDGE('',*,*,#1541,.F.);
#1551=EDGE_CURVE('',#1424,#1542,#1556,.T.);
#1556=LINE('',#1425,#1558);
#1558=VECTOR('',#1559,1.21420424868253);
#1559=DIRECTION('',(0.0,-1.0,0.0));
#1550=ORIENTED_EDGE('',*,*,#1551,.F.);
#1560=STYLED_ITEM('',(#34),#1561);
#1561=ADVANCED_FACE('',(#1567),#1562,.T.);
#1562=PLANE('',#1563);
#1563=AXIS2_PLACEMENT_3D('',#1564,#1565,#1566);
#1564=CARTESIAN_POINT('',(2.121,-7.621,0.442));
#1565=DIRECTION('',(0.0,-0.966,0.259));
#1566=DIRECTION('',(0.,0.,1.));
#1567=FACE_OUTER_BOUND('',#1568,.T.);
#1568=EDGE_LOOP('',(#1569,#1579,#1589,#1599));
#1572=CARTESIAN_POINT('',(2.959,-7.621,0.442));
#1571=VERTEX_POINT('',#1572);
#1574=CARTESIAN_POINT('',(2.121,-7.621,0.442));
#1573=VERTEX_POINT('',#1574);
#1570=EDGE_CURVE('',#1571,#1573,#1575,.T.);
#1575=LINE('',#1572,#1577);
#1577=VECTOR('',#1578,0.83819998608939);
#1578=DIRECTION('',(-1.0,0.0,0.0));
#1569=ORIENTED_EDGE('',*,*,#1570,.F.);
#1582=CARTESIAN_POINT('',(2.959,-7.204,1.998));
#1581=VERTEX_POINT('',#1582);
#1580=EDGE_CURVE('',#1581,#1571,#1585,.T.);
#1585=LINE('',#1582,#1587);
#1587=VECTOR('',#1588,1.61101043226195);
#1588=DIRECTION('',(0.0,-0.259,-0.966));
#1579=ORIENTED_EDGE('',*,*,#1580,.F.);
#1592=CARTESIAN_POINT('',(2.121,-7.204,1.998));
#1591=VERTEX_POINT('',#1592);
#1590=EDGE_CURVE('',#1591,#1581,#1595,.T.);
#1595=LINE('',#1592,#1597);
#1597=VECTOR('',#1598,0.838199985945784);
#1598=DIRECTION('',(1.0,0.0,0.0));
#1589=ORIENTED_EDGE('',*,*,#1590,.F.);
#1600=EDGE_CURVE('',#1573,#1591,#1605,.T.);
#1605=LINE('',#1574,#1607);
#1607=VECTOR('',#1608,1.61101043226195);
#1608=DIRECTION('',(0.0,0.259,0.966));
#1599=ORIENTED_EDGE('',*,*,#1600,.F.);
#1609=STYLED_ITEM('',(#34),#1610);
#1610=ADVANCED_FACE('',(#1616),#1611,.T.);
#1611=PLANE('',#1612);
#1612=AXIS2_PLACEMENT_3D('',#1613,#1614,#1615);
#1613=CARTESIAN_POINT('',(2.959,-7.376,0.377));
#1614=DIRECTION('',(0.0,0.966,-0.259));
#1615=DIRECTION('',(0.,0.,1.));
#1616=FACE_OUTER_BOUND('',#1617,.T.);
#1617=EDGE_LOOP('',(#1618,#1628,#1638,#1648));
#1621=CARTESIAN_POINT('',(2.121,-7.376,0.377));
#1620=VERTEX_POINT('',#1621);
#1623=CARTESIAN_POINT('',(2.959,-7.376,0.377));
#1622=VERTEX_POINT('',#1623);
#1619=EDGE_CURVE('',#1620,#1622,#1624,.T.);
#1624=LINE('',#1621,#1626);
#1626=VECTOR('',#1627,0.838199985992867);
#1627=DIRECTION('',(1.0,0.0,0.0));
#1618=ORIENTED_EDGE('',*,*,#1619,.F.);
#1631=CARTESIAN_POINT('',(2.121,-6.959,1.933));
#1630=VERTEX_POINT('',#1631);
#1629=EDGE_CURVE('',#1630,#1620,#1634,.T.);
#1634=LINE('',#1631,#1636);
#1636=VECTOR('',#1637,1.61101043228755);
#1637=DIRECTION('',(0.0,-0.259,-0.966));
#1628=ORIENTED_EDGE('',*,*,#1629,.F.);
#1641=CARTESIAN_POINT('',(2.959,-6.959,1.933));
#1640=VERTEX_POINT('',#1641);
#1639=EDGE_CURVE('',#1640,#1630,#1644,.T.);
#1644=LINE('',#1641,#1646);
#1646=VECTOR('',#1647,0.838199985896668);
#1647=DIRECTION('',(-1.0,0.0,0.0));
#1638=ORIENTED_EDGE('',*,*,#1639,.F.);
#1649=EDGE_CURVE('',#1622,#1640,#1654,.T.);
#1654=LINE('',#1623,#1656);
#1656=VECTOR('',#1657,1.61101043228755);
#1657=DIRECTION('',(0.0,0.259,0.966));
#1648=ORIENTED_EDGE('',*,*,#1649,.F.);
#1658=STYLED_ITEM('',(#34),#1659);
#1659=ADVANCED_FACE('',(#1665),#1660,.T.);
#1660=PLANE('',#1661);
#1661=AXIS2_PLACEMENT_3D('',#1662,#1663,#1664);
#1662=CARTESIAN_POINT('',(2.121,-9.08,0.254));
#1663=DIRECTION('',(0.0,0.0,1.0));
#1664=DIRECTION('',(0.,1.,0.));
#1665=FACE_OUTER_BOUND('',#1666,.T.);
#1666=EDGE_LOOP('',(#1667,#1677,#1687,#1697));
#1670=CARTESIAN_POINT('',(2.959,-9.081,0.254));
#1669=VERTEX_POINT('',#1670);
#1672=CARTESIAN_POINT('',(2.121,-9.08,0.254));
#1671=VERTEX_POINT('',#1672);
#1668=EDGE_CURVE('',#1669,#1671,#1673,.T.);
#1673=LINE('',#1670,#1675);
#1675=VECTOR('',#1676,0.8382);
#1676=DIRECTION('',(-1.0,0.0,0.0));
#1667=ORIENTED_EDGE('',*,*,#1668,.F.);
#1680=CARTESIAN_POINT('',(2.959,-7.866,0.254));
#1679=VERTEX_POINT('',#1680);
#1678=EDGE_CURVE('',#1679,#1669,#1683,.T.);
#1683=LINE('',#1680,#1685);
#1685=VECTOR('',#1686,1.21420424024618);
#1686=DIRECTION('',(0.0,-1.0,0.0));
#1677=ORIENTED_EDGE('',*,*,#1678,.F.);
#1690=CARTESIAN_POINT('',(2.121,-7.866,0.254));
#1689=VERTEX_POINT('',#1690);
#1688=EDGE_CURVE('',#1689,#1679,#1693,.T.);
#1693=LINE('',#1690,#1695);
#1695=VECTOR('',#1696,0.838199986245034);
#1696=DIRECTION('',(1.0,0.0,0.0));
#1687=ORIENTED_EDGE('',*,*,#1688,.F.);
#1698=EDGE_CURVE('',#1671,#1689,#1703,.T.);
#1703=LINE('',#1672,#1705);
#1705=VECTOR('',#1706,1.21420424024618);
#1706=DIRECTION('',(0.0,1.0,0.0));
#1697=ORIENTED_EDGE('',*,*,#1698,.F.);
#1707=STYLED_ITEM('',(#34),#1708);
#1708=ADVANCED_FACE('',(#1714),#1709,.T.);
#1709=PLANE('',#1710);
#1710=AXIS2_PLACEMENT_3D('',#1711,#1712,#1713);
#1711=CARTESIAN_POINT('',(2.121,-7.866,0.0));
#1712=DIRECTION('',(0.0,0.0,-1.0));
#1713=DIRECTION('',(0.,1.,0.));
#1714=FACE_OUTER_BOUND('',#1715,.T.);
#1715=EDGE_LOOP('',(#1716,#1726,#1736,#1746));
#1719=CARTESIAN_POINT('',(2.959,-7.866,0.0));
#1718=VERTEX_POINT('',#1719);
#1721=CARTESIAN_POINT('',(2.121,-7.866,0.0));
#1720=VERTEX_POINT('',#1721);
#1717=EDGE_CURVE('',#1718,#1720,#1722,.T.);
#1722=LINE('',#1719,#1724);
#1724=VECTOR('',#1725,0.838199986245034);
#1725=DIRECTION('',(-1.0,0.0,0.0));
#1716=ORIENTED_EDGE('',*,*,#1717,.F.);
#1729=CARTESIAN_POINT('',(2.959,-9.081,0.0));
#1728=VERTEX_POINT('',#1729);
#1727=EDGE_CURVE('',#1728,#1718,#1732,.T.);
#1732=LINE('',#1729,#1734);
#1734=VECTOR('',#1735,1.21420424024618);
#1735=DIRECTION('',(0.0,1.0,0.0));
#1726=ORIENTED_EDGE('',*,*,#1727,.F.);
#1739=CARTESIAN_POINT('',(2.121,-9.08,0.0));
#1738=VERTEX_POINT('',#1739);
#1737=EDGE_CURVE('',#1738,#1728,#1742,.T.);
#1742=LINE('',#1739,#1744);
#1744=VECTOR('',#1745,0.8382);
#1745=DIRECTION('',(1.0,0.0,0.0));
#1736=ORIENTED_EDGE('',*,*,#1737,.F.);
#1747=EDGE_CURVE('',#1720,#1738,#1752,.T.);
#1752=LINE('',#1721,#1754);
#1754=VECTOR('',#1755,1.21420424024618);
#1755=DIRECTION('',(0.0,-1.0,0.0));
#1746=ORIENTED_EDGE('',*,*,#1747,.F.);
#1756=STYLED_ITEM('',(#34),#1757);
#1757=ADVANCED_FACE('',(#1763),#1758,.T.);
#1758=PLANE('',#1759);
#1759=AXIS2_PLACEMENT_3D('',#1760,#1761,#1762);
#1760=CARTESIAN_POINT('',(2.121,-9.08,0.0));
#1761=DIRECTION('',(0.0,-1.0,0.0));
#1762=DIRECTION('',(0.,0.,1.));
#1763=FACE_OUTER_BOUND('',#1764,.T.);
#1764=EDGE_LOOP('',(#1765,#1775,#1785,#1795));
#1765=ORIENTED_EDGE('',*,*,#1737,.T.);
#1776=EDGE_CURVE('',#1669,#1728,#1781,.T.);
#1781=LINE('',#1670,#1783);
#1783=VECTOR('',#1784,0.254);
#1784=DIRECTION('',(0.0,0.0,-1.0));
#1775=ORIENTED_EDGE('',*,*,#1776,.F.);
#1785=ORIENTED_EDGE('',*,*,#1668,.T.);
#1796=EDGE_CURVE('',#1738,#1671,#1801,.T.);
#1801=LINE('',#1739,#1803);
#1803=VECTOR('',#1804,0.254);
#1804=DIRECTION('',(0.0,0.0,1.0));
#1795=ORIENTED_EDGE('',*,*,#1796,.F.);
#1805=STYLED_ITEM($,(#34),#1806);
#1806=ADVANCED_FACE($,(#1812),#1807,.T.);
#1807=CYLINDRICAL_SURFACE($,#1808,0.508);
#1808=AXIS2_PLACEMENT_3D($,#1809,#1810,#1811);
#1809=CARTESIAN_POINT('',(2.959,-6.713,1.867));
#1810=DIRECTION('',(1.0,0.0,0.0));
#1811=DIRECTION('',(0.,0.,1.));
#1812=FACE_OUTER_BOUND($,#1813,.T.);
#1813=EDGE_LOOP($,(#1825,#1835,#1846,#1814));
#1825=ORIENTED_EDGE('',*,*,#1492,.T.);
#1836=EDGE_CURVE($,#1591,#1483,#1841,.T.);
#1841=CIRCLE($,#1842,0.508);
#1843=CARTESIAN_POINT('',(2.121,-6.713,1.867));
#1842=AXIS2_PLACEMENT_3D($,#1843,#1844,#1845);
#1844=DIRECTION('',(-1.0,0.0,0.0));
#1845=DIRECTION('',(0.0,0.793,0.609));
#1835=ORIENTED_EDGE('',*,*,#1836,.F.);
#1846=ORIENTED_EDGE('',*,*,#1590,.T.);
#1815=EDGE_CURVE($,#1493,#1581,#1820,.T.);
#1820=CIRCLE($,#1821,0.508);
#1822=CARTESIAN_POINT('',(2.959,-6.713,1.867));
#1821=AXIS2_PLACEMENT_3D($,#1822,#1823,#1824);
#1823=DIRECTION('',(1.0,0.0,0.0));
#1824=DIRECTION('',(0.0,-0.793,-0.609));
#1814=ORIENTED_EDGE('',*,*,#1815,.F.);
#1856=STYLED_ITEM($,(#34),#1857);
#1857=ADVANCED_FACE($,(#1863),#1858,.F.);
#1858=CYLINDRICAL_SURFACE($,#1859,0.254);
#1859=AXIS2_PLACEMENT_3D($,#1860,#1861,#1862);
#1860=CARTESIAN_POINT('',(2.121,-6.713,1.867));
#1861=DIRECTION('',(1.0,0.0,0.0));
#1862=DIRECTION('',(0.,0.,-1.));
#1863=FACE_OUTER_BOUND($,#1864,.T.);
#1864=EDGE_LOOP($,(#1876,#1886,#1897,#1865));
#1876=ORIENTED_EDGE('',*,*,#1541,.T.);
#1887=EDGE_CURVE($,#1640,#1532,#1892,.T.);
#1892=CIRCLE($,#1893,0.254);
#1893=AXIS2_PLACEMENT_3D($,#1822,#1895,#1896);
#1895=DIRECTION('',(-1.0,0.0,0.0));
#1896=DIRECTION('',(0.0,0.793,0.609));
#1886=ORIENTED_EDGE('',*,*,#1887,.F.);
#1897=ORIENTED_EDGE('',*,*,#1639,.T.);
#1866=EDGE_CURVE($,#1542,#1630,#1871,.T.);
#1871=CIRCLE($,#1872,0.254);
#1872=AXIS2_PLACEMENT_3D($,#1843,#1874,#1875);
#1874=DIRECTION('',(1.0,0.0,0.0));
#1875=DIRECTION('',(0.0,-0.793,-0.609));
#1865=ORIENTED_EDGE('',*,*,#1866,.F.);
#1907=STYLED_ITEM($,(#34),#1908);
#1908=ADVANCED_FACE($,(#1914),#1909,.F.);
#1909=CYLINDRICAL_SURFACE($,#1910,0.254);
#1910=AXIS2_PLACEMENT_3D($,#1911,#1912,#1913);
#1911=CARTESIAN_POINT('',(2.121,-7.866,0.508));
#1912=DIRECTION('',(1.0,0.0,0.0));
#1913=DIRECTION('',(0.,0.,1.));
#1914=FACE_OUTER_BOUND($,#1915,.T.);
#1915=EDGE_LOOP($,(#1927,#1937,#1948,#1916));
#1927=ORIENTED_EDGE('',*,*,#1688,.T.);
#1938=EDGE_CURVE($,#1571,#1679,#1943,.T.);
#1943=CIRCLE($,#1944,0.254);
#1945=CARTESIAN_POINT('',(2.959,-7.866,0.508));
#1944=AXIS2_PLACEMENT_3D($,#1945,#1946,#1947);
#1946=DIRECTION('',(-1.0,0.0,0.0));
#1947=DIRECTION('',(0.0,-0.793,-0.609));
#1937=ORIENTED_EDGE('',*,*,#1938,.F.);
#1948=ORIENTED_EDGE('',*,*,#1570,.T.);
#1917=EDGE_CURVE($,#1689,#1573,#1922,.T.);
#1922=CIRCLE($,#1923,0.254);
#1924=CARTESIAN_POINT('',(2.121,-7.866,0.508));
#1923=AXIS2_PLACEMENT_3D($,#1924,#1925,#1926);
#1925=DIRECTION('',(1.0,0.0,0.0));
#1926=DIRECTION('',(0.0,0.793,0.609));
#1916=ORIENTED_EDGE('',*,*,#1917,.F.);
#1958=STYLED_ITEM($,(#34),#1959);
#1959=ADVANCED_FACE($,(#1965),#1960,.T.);
#1960=CYLINDRICAL_SURFACE($,#1961,0.508);
#1961=AXIS2_PLACEMENT_3D($,#1962,#1963,#1964);
#1962=CARTESIAN_POINT('',(2.121,-7.866,0.508));
#1963=DIRECTION('',(1.0,0.0,0.0));
#1964=DIRECTION('',(0.,0.,-1.));
#1965=FACE_OUTER_BOUND($,#1966,.T.);
#1966=EDGE_LOOP($,(#1978,#1988,#1999,#1967));
#1978=ORIENTED_EDGE('',*,*,#1717,.T.);
#1989=EDGE_CURVE($,#1620,#1720,#1994,.T.);
#1994=CIRCLE($,#1995,0.508);
#1995=AXIS2_PLACEMENT_3D($,#1924,#1997,#1998);
#1997=DIRECTION('',(-1.0,0.0,0.0));
#1998=DIRECTION('',(0.0,-0.793,-0.609));
#1988=ORIENTED_EDGE('',*,*,#1989,.F.);
#1999=ORIENTED_EDGE('',*,*,#1619,.T.);
#1968=EDGE_CURVE($,#1718,#1622,#1973,.T.);
#1973=CIRCLE($,#1974,0.508);
#1974=AXIS2_PLACEMENT_3D($,#1945,#1976,#1977);
#1976=DIRECTION('',(1.0,0.0,0.0));
#1977=DIRECTION('',(0.0,0.793,0.609));
#1967=ORIENTED_EDGE('',*,*,#1968,.F.);
#2009=STYLED_ITEM('color',(#34),#2010);
#2010=ADVANCED_FACE($,(#2016),#2011,.T.);
#2011=PLANE($,#2012);
#2012=AXIS2_PLACEMENT_3D($,#2013,#2014,#2015);
#2013=CARTESIAN_POINT('',(2.121,-5.499,2.121));
#2014=DIRECTION('',(-1.0,0.0,0.0));
#2015=DIRECTION('',(1.,0.,0.));
#2016=FACE_OUTER_BOUND($,#2017,.T.);
#2017=EDGE_LOOP($,(#2020, #2030, #2040, #2103, #2114, #2050, #2061, #2071, #2081, #2091, #2124, #2134));
#2020=ORIENTED_EDGE('',*,*,#1482,.T.);
#2030=ORIENTED_EDGE('',*,*,#1433,.T.);
#2040=ORIENTED_EDGE('',*,*,#1551,.T.);
#2103=ORIENTED_EDGE('',*,*,#1866,.T.);
#2114=ORIENTED_EDGE('',*,*,#1629,.T.);
#2050=ORIENTED_EDGE('',*,*,#1989,.T.);
#2061=ORIENTED_EDGE('',*,*,#1747,.T.);
#2071=ORIENTED_EDGE('',*,*,#1796,.T.);
#2081=ORIENTED_EDGE('',*,*,#1698,.T.);
#2091=ORIENTED_EDGE('',*,*,#1917,.T.);
#2124=ORIENTED_EDGE('',*,*,#1600,.T.);
#2134=ORIENTED_EDGE('',*,*,#1836,.T.);
#2145=STYLED_ITEM('color',(#34),#2146);
#2146=ADVANCED_FACE($,(#2152),#2147,.T.);
#2147=PLANE($,#2148);
#2148=AXIS2_PLACEMENT_3D($,#2149,#2150,#2151);
#2149=CARTESIAN_POINT('',(2.959,-7.866,0.254));
#2150=DIRECTION('',(1.0,0.0,0.0));
#2151=DIRECTION('',(1.,0.,0.));
#2152=FACE_OUTER_BOUND($,#2153,.T.);
#2153=EDGE_LOOP($,(#2156, #2166, #2176, #2239, #2250, #2186, #2197, #2207, #2217, #2227, #2260, #2270));
#2156=ORIENTED_EDGE('',*,*,#1531,.T.);
#2166=ORIENTED_EDGE('',*,*,#1453,.T.);
#2176=ORIENTED_EDGE('',*,*,#1502,.T.);
#2239=ORIENTED_EDGE('',*,*,#1815,.T.);
#2250=ORIENTED_EDGE('',*,*,#1580,.T.);
#2186=ORIENTED_EDGE('',*,*,#1938,.T.);
#2197=ORIENTED_EDGE('',*,*,#1678,.T.);
#2207=ORIENTED_EDGE('',*,*,#1776,.T.);
#2217=ORIENTED_EDGE('',*,*,#1727,.T.);
#2227=ORIENTED_EDGE('',*,*,#1968,.T.);
#2260=ORIENTED_EDGE('',*,*,#1649,.T.);
#2270=ORIENTED_EDGE('',*,*,#1887,.T.);
#2282=MANIFOLD_SOLID_BREP($,#2283);
#2283=CLOSED_SHELL('',(#2285,#2334,#2383,#2432,#2481,#2530,#2579,#2628,#2677,#2726,#2775,#2824,#2873,#2942,#3031,#3180));
#2284=STYLED_ITEM('',(#61),#2285);
#2285=ADVANCED_FACE('',(#2291),#2286,.T.);
#2286=PLANE('',#2287);
#2287=AXIS2_PLACEMENT_3D('',#2288,#2289,#2290);
#2288=CARTESIAN_POINT('',(-4.383,-1.359,-0.051));
#2289=DIRECTION('',(0.0,-1.0,0.0));
#2290=DIRECTION('',(0.,0.,1.));
#2291=FACE_OUTER_BOUND('',#2292,.T.);
#2292=EDGE_LOOP('',(#2293,#2303,#2313,#2323));
#2296=CARTESIAN_POINT('',(4.383,-1.359,-0.051));
#2295=VERTEX_POINT('',#2296);
#2298=CARTESIAN_POINT('',(-4.383,-1.359,-0.051));
#2297=VERTEX_POINT('',#2298);
#2294=EDGE_CURVE('',#2295,#2297,#2299,.T.);
#2299=LINE('',#2296,#2301);
#2301=VECTOR('',#2302,8.76554);
#2302=DIRECTION('',(-1.0,0.0,0.0));
#2293=ORIENTED_EDGE('',*,*,#2294,.F.);
#2306=CARTESIAN_POINT('',(4.383,-1.359,0.0));
#2305=VERTEX_POINT('',#2306);
#2304=EDGE_CURVE('',#2305,#2295,#2309,.T.);
#2309=LINE('',#2306,#2311);
#2311=VECTOR('',#2312,0.0508);
#2312=DIRECTION('',(0.0,0.0,-1.0));
#2303=ORIENTED_EDGE('',*,*,#2304,.F.);
#2316=CARTESIAN_POINT('',(-4.383,-1.359,0.0));
#2315=VERTEX_POINT('',#2316);
#2314=EDGE_CURVE('',#2315,#2305,#2319,.T.);
#2319=LINE('',#2316,#2321);
#2321=VECTOR('',#2322,8.76554);
#2322=DIRECTION('',(1.0,0.0,0.0));
#2313=ORIENTED_EDGE('',*,*,#2314,.F.);
#2324=EDGE_CURVE('',#2297,#2315,#2329,.T.);
#2329=LINE('',#2298,#2331);
#2331=VECTOR('',#2332,0.0508);
#2332=DIRECTION('',(0.0,0.0,1.0));
#2323=ORIENTED_EDGE('',*,*,#2324,.F.);
#2333=STYLED_ITEM('',(#61),#2334);
#2334=ADVANCED_FACE('',(#2340),#2335,.T.);
#2335=PLANE('',#2336);
#2336=AXIS2_PLACEMENT_3D('',#2337,#2338,#2339);
#2337=CARTESIAN_POINT('',(4.383,-1.359,-0.051));
#2338=DIRECTION('',(1.0,0.0,0.0));
#2339=DIRECTION('',(0.,0.,1.));
#2340=FACE_OUTER_BOUND('',#2341,.T.);
#2341=EDGE_LOOP('',(#2342,#2352,#2362,#2372));
#2345=CARTESIAN_POINT('',(4.383,5.156,-0.051));
#2344=VERTEX_POINT('',#2345);
#2343=EDGE_CURVE('',#2344,#2295,#2348,.T.);
#2348=LINE('',#2345,#2350);
#2350=VECTOR('',#2351,6.5151);
#2351=DIRECTION('',(0.0,-1.0,0.0));
#2342=ORIENTED_EDGE('',*,*,#2343,.F.);
#2355=CARTESIAN_POINT('',(4.383,5.156,0.0));
#2354=VERTEX_POINT('',#2355);
#2353=EDGE_CURVE('',#2354,#2344,#2358,.T.);
#2358=LINE('',#2355,#2360);
#2360=VECTOR('',#2361,0.0508);
#2361=DIRECTION('',(0.0,0.0,-1.0));
#2352=ORIENTED_EDGE('',*,*,#2353,.F.);
#2363=EDGE_CURVE('',#2305,#2354,#2368,.T.);
#2368=LINE('',#2306,#2370);
#2370=VECTOR('',#2371,6.5151);
#2371=DIRECTION('',(0.0,1.0,0.0));
#2362=ORIENTED_EDGE('',*,*,#2363,.F.);
#2372=ORIENTED_EDGE('',*,*,#2304,.T.);
#2382=STYLED_ITEM('',(#61),#2383);
#2383=ADVANCED_FACE('',(#2389),#2384,.T.);
#2384=PLANE('',#2385);
#2385=AXIS2_PLACEMENT_3D('',#2386,#2387,#2388);
#2386=CARTESIAN_POINT('',(4.383,5.156,-0.051));
#2387=DIRECTION('',(0.0,1.0,0.0));
#2388=DIRECTION('',(0.,0.,1.));
#2389=FACE_OUTER_BOUND('',#2390,.T.);
#2390=EDGE_LOOP('',(#2391,#2401,#2411,#2421));
#2394=CARTESIAN_POINT('',(3.867,5.156,-0.051));
#2393=VERTEX_POINT('',#2394);
#2392=EDGE_CURVE('',#2393,#2344,#2397,.T.);
#2397=LINE('',#2394,#2399);
#2399=VECTOR('',#2400,0.51562);
#2400=DIRECTION('',(1.0,0.0,0.0));
#2391=ORIENTED_EDGE('',*,*,#2392,.F.);
#2404=CARTESIAN_POINT('',(3.867,5.156,0.0));
#2403=VERTEX_POINT('',#2404);
#2402=EDGE_CURVE('',#2403,#2393,#2407,.T.);
#2407=LINE('',#2404,#2409);
#2409=VECTOR('',#2410,0.0508);
#2410=DIRECTION('',(0.0,0.0,-1.0));
#2401=ORIENTED_EDGE('',*,*,#2402,.F.);
#2412=EDGE_CURVE('',#2354,#2403,#2417,.T.);
#2417=LINE('',#2355,#2419);
#2419=VECTOR('',#2420,0.51562);
#2420=DIRECTION('',(-1.0,0.0,0.0));
#2411=ORIENTED_EDGE('',*,*,#2412,.F.);
#2421=ORIENTED_EDGE('',*,*,#2353,.T.);
#2431=STYLED_ITEM('',(#61),#2432);
#2432=ADVANCED_FACE('',(#2438),#2433,.T.);
#2433=PLANE('',#2434);
#2434=AXIS2_PLACEMENT_3D('',#2435,#2436,#2437);
#2435=CARTESIAN_POINT('',(3.867,5.156,-0.051));
#2436=DIRECTION('',(1.0,0.0,0.0));
#2437=DIRECTION('',(0.,0.,1.));
#2438=FACE_OUTER_BOUND('',#2439,.T.);
#2439=EDGE_LOOP('',(#2440,#2450,#2460,#2470));
#2443=CARTESIAN_POINT('',(3.867,5.499,-0.051));
#2442=VERTEX_POINT('',#2443);
#2441=EDGE_CURVE('',#2442,#2393,#2446,.T.);
#2446=LINE('',#2443,#2448);
#2448=VECTOR('',#2449,0.3429);
#2449=DIRECTION('',(0.0,-1.0,0.0));
#2440=ORIENTED_EDGE('',*,*,#2441,.F.);
#2453=CARTESIAN_POINT('',(3.867,5.499,0.0));
#2452=VERTEX_POINT('',#2453);
#2451=EDGE_CURVE('',#2452,#2442,#2456,.T.);
#2456=LINE('',#2453,#2458);
#2458=VECTOR('',#2459,0.0508);
#2459=DIRECTION('',(0.0,0.0,-1.0));
#2450=ORIENTED_EDGE('',*,*,#2451,.F.);
#2461=EDGE_CURVE('',#2403,#2452,#2466,.T.);
#2466=LINE('',#2404,#2468);
#2468=VECTOR('',#2469,0.3429);
#2469=DIRECTION('',(0.0,1.0,0.0));
#2460=ORIENTED_EDGE('',*,*,#2461,.F.);
#2470=ORIENTED_EDGE('',*,*,#2402,.T.);
#2480=STYLED_ITEM('',(#61),#2481);
#2481=ADVANCED_FACE('',(#2487),#2482,.T.);
#2482=PLANE('',#2483);
#2483=AXIS2_PLACEMENT_3D('',#2484,#2485,#2486);
#2484=CARTESIAN_POINT('',(5.156,5.499,-0.051));
#2485=DIRECTION('',(1.0,0.0,0.0));
#2486=DIRECTION('',(0.,0.,1.));
#2487=FACE_OUTER_BOUND('',#2488,.T.);
#2488=EDGE_LOOP('',(#2489,#2499,#2509,#2519));
#2492=CARTESIAN_POINT('',(5.156,6.299,-0.051));
#2491=VERTEX_POINT('',#2492);
#2494=CARTESIAN_POINT('',(5.156,5.499,-0.051));
#2493=VERTEX_POINT('',#2494);
#2490=EDGE_CURVE('',#2491,#2493,#2495,.T.);
#2495=LINE('',#2492,#2497);
#2497=VECTOR('',#2498,0.8001);
#2498=DIRECTION('',(0.0,-1.0,0.0));
#2489=ORIENTED_EDGE('',*,*,#2490,.F.);
#2502=CARTESIAN_POINT('',(5.156,6.299,0.203));
#2501=VERTEX_POINT('',#2502);
#2500=EDGE_CURVE('',#2501,#2491,#2505,.T.);
#2505=LINE('',#2502,#2507);
#2507=VECTOR('',#2508,0.254);
#2508=DIRECTION('',(0.0,0.0,-1.0));
#2499=ORIENTED_EDGE('',*,*,#2500,.F.);
#2512=CARTESIAN_POINT('',(5.156,5.499,0.203));
#2511=VERTEX_POINT('',#2512);
#2510=EDGE_CURVE('',#2511,#2501,#2515,.T.);
#2515=LINE('',#2512,#2517);
#2517=VECTOR('',#2518,0.8001);
#2518=DIRECTION('',(0.0,1.0,0.0));
#2509=ORIENTED_EDGE('',*,*,#2510,.F.);
#2520=EDGE_CURVE('',#2493,#2511,#2525,.T.);
#2525=LINE('',#2494,#2527);
#2527=VECTOR('',#2528,0.254);
#2528=DIRECTION('',(0.0,0.0,1.0));
#2519=ORIENTED_EDGE('',*,*,#2520,.F.);
#2529=STYLED_ITEM('',(#61),#2530);
#2530=ADVANCED_FACE('',(#2536),#2531,.T.);
#2531=PLANE('',#2532);
#2532=AXIS2_PLACEMENT_3D('',#2533,#2534,#2535);
#2533=CARTESIAN_POINT('',(5.156,6.299,-0.051));
#2534=DIRECTION('',(0.527,0.85,0.0));
#2535=DIRECTION('',(0.,0.,1.));
#2536=FACE_OUTER_BOUND('',#2537,.T.);
#2537=EDGE_LOOP('',(#2538,#2548,#2558,#2568));
#2541=CARTESIAN_POINT('',(3.867,7.099,-0.051));
#2540=VERTEX_POINT('',#2541);
#2539=EDGE_CURVE('',#2540,#2491,#2544,.T.);
#2544=LINE('',#2541,#2546);
#2546=VECTOR('',#2547,1.51717168194638);
#2547=DIRECTION('',(0.85,-0.527,0.0));
#2538=ORIENTED_EDGE('',*,*,#2539,.F.);
#2551=CARTESIAN_POINT('',(3.867,7.099,0.203));
#2550=VERTEX_POINT('',#2551);
#2549=EDGE_CURVE('',#2550,#2540,#2554,.T.);
#2554=LINE('',#2551,#2556);
#2556=VECTOR('',#2557,0.254);
#2557=DIRECTION('',(0.0,0.0,-1.0));
#2548=ORIENTED_EDGE('',*,*,#2549,.F.);
#2559=EDGE_CURVE('',#2501,#2550,#2564,.T.);
#2564=LINE('',#2502,#2566);
#2566=VECTOR('',#2567,1.51717168194638);
#2567=DIRECTION('',(-0.85,0.527,0.0));
#2558=ORIENTED_EDGE('',*,*,#2559,.F.);
#2568=ORIENTED_EDGE('',*,*,#2500,.T.);
#2578=STYLED_ITEM('',(#61),#2579);
#2579=ADVANCED_FACE('',(#2585),#2580,.T.);
#2580=PLANE('',#2581);
#2581=AXIS2_PLACEMENT_3D('',#2582,#2583,#2584);
#2582=CARTESIAN_POINT('',(3.867,7.099,-0.051));
#2583=DIRECTION('',(0.0,1.0,0.0));
#2584=DIRECTION('',(0.,0.,1.));
#2585=FACE_OUTER_BOUND('',#2586,.T.);
#2586=EDGE_LOOP('',(#2587,#2597,#2607,#2617));
#2590=CARTESIAN_POINT('',(-3.867,7.099,-0.051));
#2589=VERTEX_POINT('',#2590);
#2588=EDGE_CURVE('',#2589,#2540,#2593,.T.);
#2593=LINE('',#2590,#2595);
#2595=VECTOR('',#2596,7.7343);
#2596=DIRECTION('',(1.0,0.0,0.0));
#2587=ORIENTED_EDGE('',*,*,#2588,.F.);
#2600=CARTESIAN_POINT('',(-3.867,7.099,0.203));
#2599=VERTEX_POINT('',#2600);
#2598=EDGE_CURVE('',#2599,#2589,#2603,.T.);
#2603=LINE('',#2600,#2605);
#2605=VECTOR('',#2606,0.254);
#2606=DIRECTION('',(0.0,0.0,-1.0));
#2597=ORIENTED_EDGE('',*,*,#2598,.F.);
#2608=EDGE_CURVE('',#2550,#2599,#2613,.T.);
#2613=LINE('',#2551,#2615);
#2615=VECTOR('',#2616,7.7343);
#2616=DIRECTION('',(-1.0,0.0,0.0));
#2607=ORIENTED_EDGE('',*,*,#2608,.F.);
#2617=ORIENTED_EDGE('',*,*,#2549,.T.);
#2627=STYLED_ITEM('',(#61),#2628);
#2628=ADVANCED_FACE('',(#2634),#2629,.T.);
#2629=PLANE('',#2630);
#2630=AXIS2_PLACEMENT_3D('',#2631,#2632,#2633);
#2631=CARTESIAN_POINT('',(-3.867,7.099,-0.051));
#2632=DIRECTION('',(-0.527,0.85,0.0));
#2633=DIRECTION('',(0.,0.,1.));
#2634=FACE_OUTER_BOUND('',#2635,.T.);
#2635=EDGE_LOOP('',(#2636,#2646,#2656,#2666));
#2639=CARTESIAN_POINT('',(-5.156,6.299,-0.051));
#2638=VERTEX_POINT('',#2639);
#2637=EDGE_CURVE('',#2638,#2589,#2642,.T.);
#2642=LINE('',#2639,#2644);
#2644=VECTOR('',#2645,1.51717168194638);
#2645=DIRECTION('',(0.85,0.527,0.0));
#2636=ORIENTED_EDGE('',*,*,#2637,.F.);
#2649=CARTESIAN_POINT('',(-5.156,6.299,0.203));
#2648=VERTEX_POINT('',#2649);
#2647=EDGE_CURVE('',#2648,#2638,#2652,.T.);
#2652=LINE('',#2649,#2654);
#2654=VECTOR('',#2655,0.254);
#2655=DIRECTION('',(0.0,0.0,-1.0));
#2646=ORIENTED_EDGE('',*,*,#2647,.F.);
#2657=EDGE_CURVE('',#2599,#2648,#2662,.T.);
#2662=LINE('',#2600,#2664);
#2664=VECTOR('',#2665,1.51717168194638);
#2665=DIRECTION('',(-0.85,-0.527,0.0));
#2656=ORIENTED_EDGE('',*,*,#2657,.F.);
#2666=ORIENTED_EDGE('',*,*,#2598,.T.);
#2676=STYLED_ITEM('',(#61),#2677);
#2677=ADVANCED_FACE('',(#2683),#2678,.T.);
#2678=PLANE('',#2679);
#2679=AXIS2_PLACEMENT_3D('',#2680,#2681,#2682);
#2680=CARTESIAN_POINT('',(-5.156,6.299,-0.051));
#2681=DIRECTION('',(-1.0,0.0,0.0));
#2682=DIRECTION('',(0.,0.,1.));
#2683=FACE_OUTER_BOUND('',#2684,.T.);
#2684=EDGE_LOOP('',(#2685,#2695,#2705,#2715));
#2688=CARTESIAN_POINT('',(-5.156,5.499,-0.051));
#2687=VERTEX_POINT('',#2688);
#2686=EDGE_CURVE('',#2687,#2638,#2691,.T.);
#2691=LINE('',#2688,#2693);
#2693=VECTOR('',#2694,0.8001);
#2694=DIRECTION('',(0.0,1.0,0.0));
#2685=ORIENTED_EDGE('',*,*,#2686,.F.);
#2698=CARTESIAN_POINT('',(-5.156,5.499,0.203));
#2697=VERTEX_POINT('',#2698);
#2696=EDGE_CURVE('',#2697,#2687,#2701,.T.);
#2701=LINE('',#2698,#2703);
#2703=VECTOR('',#2704,0.254);
#2704=DIRECTION('',(0.0,0.0,-1.0));
#2695=ORIENTED_EDGE('',*,*,#2696,.F.);
#2706=EDGE_CURVE('',#2648,#2697,#2711,.T.);
#2711=LINE('',#2649,#2713);
#2713=VECTOR('',#2714,0.8001);
#2714=DIRECTION('',(0.0,-1.0,0.0));
#2705=ORIENTED_EDGE('',*,*,#2706,.F.);
#2715=ORIENTED_EDGE('',*,*,#2647,.T.);
#2725=STYLED_ITEM('',(#61),#2726);
#2726=ADVANCED_FACE('',(#2732),#2727,.T.);
#2727=PLANE('',#2728);
#2728=AXIS2_PLACEMENT_3D('',#2729,#2730,#2731);
#2729=CARTESIAN_POINT('',(-3.867,5.499,-0.051));
#2730=DIRECTION('',(-1.0,0.0,0.0));
#2731=DIRECTION('',(0.,0.,1.));
#2732=FACE_OUTER_BOUND('',#2733,.T.);
#2733=EDGE_LOOP('',(#2734,#2744,#2754,#2764));
#2737=CARTESIAN_POINT('',(-3.867,5.156,-0.051));
#2736=VERTEX_POINT('',#2737);
#2739=CARTESIAN_POINT('',(-3.867,5.499,-0.051));
#2738=VERTEX_POINT('',#2739);
#2735=EDGE_CURVE('',#2736,#2738,#2740,.T.);
#2740=LINE('',#2737,#2742);
#2742=VECTOR('',#2743,0.3429);
#2743=DIRECTION('',(0.0,1.0,0.0));
#2734=ORIENTED_EDGE('',*,*,#2735,.F.);
#2747=CARTESIAN_POINT('',(-3.867,5.156,0.0));
#2746=VERTEX_POINT('',#2747);
#2745=EDGE_CURVE('',#2746,#2736,#2750,.T.);
#2750=LINE('',#2747,#2752);
#2752=VECTOR('',#2753,0.0508);
#2753=DIRECTION('',(0.0,0.0,-1.0));
#2744=ORIENTED_EDGE('',*,*,#2745,.F.);
#2757=CARTESIAN_POINT('',(-3.867,5.499,0.0));
#2756=VERTEX_POINT('',#2757);
#2755=EDGE_CURVE('',#2756,#2746,#2760,.T.);
#2760=LINE('',#2757,#2762);
#2762=VECTOR('',#2763,0.3429);
#2763=DIRECTION('',(0.0,-1.0,0.0));
#2754=ORIENTED_EDGE('',*,*,#2755,.F.);
#2765=EDGE_CURVE('',#2738,#2756,#2770,.T.);
#2770=LINE('',#2739,#2772);
#2772=VECTOR('',#2773,0.0508);
#2773=DIRECTION('',(0.0,0.0,1.0));
#2764=ORIENTED_EDGE('',*,*,#2765,.F.);
#2774=STYLED_ITEM('',(#61),#2775);
#2775=ADVANCED_FACE('',(#2781),#2776,.T.);
#2776=PLANE('',#2777);
#2777=AXIS2_PLACEMENT_3D('',#2778,#2779,#2780);
#2778=CARTESIAN_POINT('',(-3.867,5.156,-0.051));
#2779=DIRECTION('',(0.0,1.0,0.0));
#2780=DIRECTION('',(0.,0.,1.));
#2781=FACE_OUTER_BOUND('',#2782,.T.);
#2782=EDGE_LOOP('',(#2783,#2793,#2803,#2813));
#2786=CARTESIAN_POINT('',(-4.383,5.156,-0.051));
#2785=VERTEX_POINT('',#2786);
#2784=EDGE_CURVE('',#2785,#2736,#2789,.T.);
#2789=LINE('',#2786,#2791);
#2791=VECTOR('',#2792,0.51562);
#2792=DIRECTION('',(1.0,0.0,0.0));
#2783=ORIENTED_EDGE('',*,*,#2784,.F.);
#2796=CARTESIAN_POINT('',(-4.383,5.156,0.0));
#2795=VERTEX_POINT('',#2796);
#2794=EDGE_CURVE('',#2795,#2785,#2799,.T.);
#2799=LINE('',#2796,#2801);
#2801=VECTOR('',#2802,0.0508);
#2802=DIRECTION('',(0.0,0.0,-1.0));
#2793=ORIENTED_EDGE('',*,*,#2794,.F.);
#2804=EDGE_CURVE('',#2746,#2795,#2809,.T.);
#2809=LINE('',#2747,#2811);
#2811=VECTOR('',#2812,0.51562);
#2812=DIRECTION('',(-1.0,0.0,0.0));
#2803=ORIENTED_EDGE('',*,*,#2804,.F.);
#2813=ORIENTED_EDGE('',*,*,#2745,.T.);
#2823=STYLED_ITEM('',(#61),#2824);
#2824=ADVANCED_FACE('',(#2830),#2825,.T.);
#2825=PLANE('',#2826);
#2826=AXIS2_PLACEMENT_3D('',#2827,#2828,#2829);
#2827=CARTESIAN_POINT('',(-4.383,5.156,-0.051));
#2828=DIRECTION('',(-1.0,0.0,0.0));
#2829=DIRECTION('',(0.,0.,1.));
#2830=FACE_OUTER_BOUND('',#2831,.T.);
#2831=EDGE_LOOP('',(#2832,#2842,#2852,#2862));
#2833=EDGE_CURVE('',#2297,#2785,#2838,.T.);
#2838=LINE('',#2298,#2840);
#2840=VECTOR('',#2841,6.5151);
#2841=DIRECTION('',(0.0,1.0,0.0));
#2832=ORIENTED_EDGE('',*,*,#2833,.F.);
#2842=ORIENTED_EDGE('',*,*,#2324,.T.);
#2853=EDGE_CURVE('',#2795,#2315,#2858,.T.);
#2858=LINE('',#2796,#2860);
#2860=VECTOR('',#2861,6.5151);
#2861=DIRECTION('',(0.0,-1.0,0.0));
#2852=ORIENTED_EDGE('',*,*,#2853,.F.);
#2862=ORIENTED_EDGE('',*,*,#2794,.T.);
#2872=STYLED_ITEM('',(#61),#2873);
#2873=ADVANCED_FACE('',(#2879),#2874,.T.);
#2874=PLANE('',#2875);
#2875=AXIS2_PLACEMENT_3D('',#2876,#2877,#2878);
#2876=CARTESIAN_POINT('',(-5.156,6.299,0.203));
#2877=DIRECTION('',(0.0,0.0,1.0));
#2878=DIRECTION('',(0.,1.,0.));
#2879=FACE_OUTER_BOUND('',#2880,.T.);
#2880=EDGE_LOOP('',(#2881,#2891,#2901,#2911,#2921,#2931));
#2881=ORIENTED_EDGE('',*,*,#2706,.T.);
#2892=EDGE_CURVE('',#2511,#2697,#2897,.T.);
#2897=LINE('',#2512,#2899);
#2899=VECTOR('',#2900,10.3124);
#2900=DIRECTION('',(-1.0,0.0,0.0));
#2891=ORIENTED_EDGE('',*,*,#2892,.F.);
#2901=ORIENTED_EDGE('',*,*,#2510,.T.);
#2911=ORIENTED_EDGE('',*,*,#2559,.T.);
#2921=ORIENTED_EDGE('',*,*,#2608,.T.);
#2931=ORIENTED_EDGE('',*,*,#2657,.T.);
#2941=STYLED_ITEM('',(#61),#2942);
#2942=ADVANCED_FACE('',(#2948),#2943,.T.);
#2943=PLANE('',#2944);
#2944=AXIS2_PLACEMENT_3D('',#2945,#2946,#2947);
#2945=CARTESIAN_POINT('',(-4.383,5.156,0.0));
#2946=DIRECTION('',(0.0,0.0,1.0));
#2947=DIRECTION('',(0.,1.,0.));
#2948=FACE_OUTER_BOUND('',#2949,.T.);
#2949=EDGE_LOOP('',(#2950,#2960,#2970,#2980,#2990,#3000,#3010,#3020));
#2950=ORIENTED_EDGE('',*,*,#2853,.T.);
#2960=ORIENTED_EDGE('',*,*,#2314,.T.);
#2970=ORIENTED_EDGE('',*,*,#2363,.T.);
#2980=ORIENTED_EDGE('',*,*,#2412,.T.);
#2990=ORIENTED_EDGE('',*,*,#2461,.T.);
#3001=EDGE_CURVE('',#2756,#2452,#3006,.T.);
#3006=LINE('',#2757,#3008);
#3008=VECTOR('',#3009,7.7343);
#3009=DIRECTION('',(1.0,0.0,0.0));
#3000=ORIENTED_EDGE('',*,*,#3001,.F.);
#3010=ORIENTED_EDGE('',*,*,#2755,.T.);
#3020=ORIENTED_EDGE('',*,*,#2804,.T.);
#3030=STYLED_ITEM('',(#61),#3031);
#3031=ADVANCED_FACE('',(#3037),#3032,.T.);
#3032=PLANE('',#3033);
#3033=AXIS2_PLACEMENT_3D('',#3034,#3035,#3036);
#3034=CARTESIAN_POINT('',(4.383,-1.359,-0.051));
#3035=DIRECTION('',(0.0,0.0,-1.0));
#3036=DIRECTION('',(0.,1.,0.));
#3037=FACE_OUTER_BOUND('',#3038,.T.);
#3038=EDGE_LOOP('',(#3039,#3049,#3059,#3069,#3079,#3089,#3099,#3109,#3119,#3129,#3139,#3149,#3159,#3169));
#3039=ORIENTED_EDGE('',*,*,#2294,.T.);
#3049=ORIENTED_EDGE('',*,*,#2833,.T.);
#3059=ORIENTED_EDGE('',*,*,#2784,.T.);
#3069=ORIENTED_EDGE('',*,*,#2735,.T.);
#3080=EDGE_CURVE('',#2687,#2738,#3085,.T.);
#3085=LINE('',#2688,#3087);
#3087=VECTOR('',#3088,1.28905);
#3088=DIRECTION('',(1.0,0.0,0.0));
#3079=ORIENTED_EDGE('',*,*,#3080,.F.);
#3089=ORIENTED_EDGE('',*,*,#2686,.T.);
#3099=ORIENTED_EDGE('',*,*,#2637,.T.);
#3109=ORIENTED_EDGE('',*,*,#2588,.T.);
#3119=ORIENTED_EDGE('',*,*,#2539,.T.);
#3129=ORIENTED_EDGE('',*,*,#2490,.T.);
#3140=EDGE_CURVE('',#2442,#2493,#3145,.T.);
#3145=LINE('',#2443,#3147);
#3147=VECTOR('',#3148,1.28905);
#3148=DIRECTION('',(1.0,0.0,0.0));
#3139=ORIENTED_EDGE('',*,*,#3140,.F.);
#3149=ORIENTED_EDGE('',*,*,#2441,.T.);
#3159=ORIENTED_EDGE('',*,*,#2392,.T.);
#3169=ORIENTED_EDGE('',*,*,#2343,.T.);
#3179=STYLED_ITEM('',(#61),#3180);
#3180=ADVANCED_FACE('',(#3186),#3181,.T.);
#3181=PLANE('',#3182);
#3182=AXIS2_PLACEMENT_3D('',#3183,#3184,#3185);
#3183=CARTESIAN_POINT('',(-5.156,5.499,-0.051));
#3184=DIRECTION('',(0.0,-1.0,0.0));
#3185=DIRECTION('',(0.,0.,1.));
#3186=FACE_OUTER_BOUND('',#3187,.T.);
#3187=EDGE_LOOP('',(#3188,#3198,#3208,#3218,#3228,#3238,#3248,#3258));
#3188=ORIENTED_EDGE('',*,*,#3080,.T.);
#3198=ORIENTED_EDGE('',*,*,#2765,.T.);
#3208=ORIENTED_EDGE('',*,*,#3001,.T.);
#3218=ORIENTED_EDGE('',*,*,#2451,.T.);
#3228=ORIENTED_EDGE('',*,*,#3140,.T.);
#3238=ORIENTED_EDGE('',*,*,#2520,.T.);
#3248=ORIENTED_EDGE('',*,*,#2892,.T.);
#3258=ORIENTED_EDGE('',*,*,#2696,.T.);
ENDSEC;
END-ISO-10303-21;
