(footprint "CONV_R-783.3-1.0"
	(version 20240108)
	(generator "pcbnew")
	(generator_version "8.0")
	(layer "F.Cu")
	(property "Reference" "REF**"
		(at -2.54 -5.08 0)
		(layer "F.SilkS")
		(uuid "e545510e-5a62-4f3b-8983-8a36dbd5268a")
		(effects
			(font
				(size 1 1)
				(thickness 0.15)
			)
		)
	)
	(property "Value" "CONV_R-783.3-1.0"
		(at 4.445 5.08 0)
		(layer "F.Fab")
		(uuid "85e84384-93db-4d20-a064-bc0c337fe647")
		(effects
			(font
				(size 1 1)
				(thickness 0.15)
			)
		)
	)
	(property "Footprint" ""
		(at 0 0 0)
		(layer "F.Fab")
		(hide yes)
		(uuid "00fd8deb-716b-499d-a9cb-cdb0e92b6e74")
		(effects
			(font
				(size 1.27 1.27)
				(thickness 0.15)
			)
		)
	)
	(property "Datasheet" ""
		(at 0 0 0)
		(layer "F.Fab")
		(hide yes)
		(uuid "314ac578-6a48-4a6b-8a36-4886615bdf80")
		(effects
			(font
				(size 1.27 1.27)
				(thickness 0.15)
			)
		)
	)
	(property "Description" ""
		(at 0 0 0)
		(layer "F.Fab")
		(hide yes)
		(uuid "cadd3386-82cc-4899-bc44-c2ea61db5411")
		(effects
			(font
				(size 1.27 1.27)
				(thickness 0.15)
			)
		)
	)
	(attr through_hole)
	(fp_line
		(start -5.75 -3.775)
		(end -5.75 3.775)
		(stroke
			(width 0.127)
			(type solid)
		)
		(layer "F.SilkS")
		(uuid "8e06fc44-e7d5-45d6-8589-36fed869fc30")
	)
	(fp_line
		(start -5.75 3.775)
		(end 5.75 3.775)
		(stroke
			(width 0.127)
			(type solid)
		)
		(layer "F.SilkS")
		(uuid "967989c4-1cb2-4bf3-a0c6-c885aaf441a3")
	)
	(fp_line
		(start 5.75 -3.775)
		(end -5.75 -3.775)
		(stroke
			(width 0.127)
			(type solid)
		)
		(layer "F.SilkS")
		(uuid "c509f30b-5ca6-44ac-a7f6-58dabaa39e25")
	)
	(fp_line
		(start 5.75 3.775)
		(end 5.75 -3.775)
		(stroke
			(width 0.127)
			(type solid)
		)
		(layer "F.SilkS")
		(uuid "0c3bf3bd-142d-4ddf-83cb-c4a4468ea63d")
	)
	(fp_circle
		(center -6.4 1.775)
		(end -6.3 1.775)
		(stroke
			(width 0.2)
			(type solid)
		)
		(fill none)
		(layer "F.SilkS")
		(uuid "5904dae0-1e69-48f3-97ad-69bdf094ab40")
	)
	(fp_line
		(start -6 -4.025)
		(end -6 4.025)
		(stroke
			(width 0.05)
			(type solid)
		)
		(layer "F.CrtYd")
		(uuid "d5261b62-76df-410d-a39f-04293b5a3b3d")
	)
	(fp_line
		(start -6 4.025)
		(end 6 4.025)
		(stroke
			(width 0.05)
			(type solid)
		)
		(layer "F.CrtYd")
		(uuid "97ea51ff-afd2-4f19-b74a-89f2986d138c")
	)
	(fp_line
		(start 6 -4.025)
		(end -6 -4.025)
		(stroke
			(width 0.05)
			(type solid)
		)
		(layer "F.CrtYd")
		(uuid "3998e7d2-232d-45f1-80a8-0deb32d9fcbf")
	)
	(fp_line
		(start 6 4.025)
		(end 6 -4.025)
		(stroke
			(width 0.05)
			(type solid)
		)
		(layer "F.CrtYd")
		(uuid "df289449-f1bd-4deb-8b1d-e5d5b2c0b866")
	)
	(fp_line
		(start -5.75 -3.775)
		(end -5.75 3.775)
		(stroke
			(width 0.127)
			(type solid)
		)
		(layer "F.Fab")
		(uuid "298cab69-b675-4531-b800-82d28c5702e3")
	)
	(fp_line
		(start -5.75 3.775)
		(end 5.75 3.775)
		(stroke
			(width 0.127)
			(type solid)
		)
		(layer "F.Fab")
		(uuid "2447a383-8a04-4752-a271-9fec41db08bc")
	)
	(fp_line
		(start 5.75 -3.775)
		(end -5.75 -3.775)
		(stroke
			(width 0.127)
			(type solid)
		)
		(layer "F.Fab")
		(uuid "f7cdebfb-b3e7-4974-950f-bc599e7e5f88")
	)
	(fp_line
		(start 5.75 3.775)
		(end 5.75 -3.775)
		(stroke
			(width 0.127)
			(type solid)
		)
		(layer "F.Fab")
		(uuid "8b5a1861-f577-425a-851f-efa0c971fcb8")
	)
	(fp_circle
		(center -6.4 1.775)
		(end -6.3 1.775)
		(stroke
			(width 0.2)
			(type solid)
		)
		(fill none)
		(layer "F.Fab")
		(uuid "ff78f1d3-55f5-4023-8138-a88f5688555a")
	)
	(pad "1" thru_hole rect
		(at -2.54 1.775)
		(size 1.508 1.508)
		(drill 1)
		(layers "*.Cu" "*.Mask")
		(remove_unused_layers no)
		(uuid "835284b3-b6e7-47cd-b0ba-a38d081b95aa")
	)
	(pad "2" thru_hole circle
		(at 0 1.775)
		(size 1.508 1.508)
		(drill 1)
		(layers "*.Cu" "*.Mask")
		(remove_unused_layers no)
		(uuid "e610ab7a-e999-478d-96eb-50049945d4a9")
	)
	(pad "3" thru_hole circle
		(at 2.54 1.775)
		(size 1.508 1.508)
		(drill 1)
		(layers "*.Cu" "*.Mask")
		(remove_unused_layers no)
		(uuid "1cd2fad3-6870-4995-9db1-a51b0faa37d1")
	)
	(model "${KIPRJMOD}/kicad-library/3D/converters.3dshapes/R-783.3-1.00.step"
		(offset
			(xyz 0 0 10.5)
		)
		(scale
			(xyz 1 1 1)
		)
		(rotate
			(xyz 90 0 90)
		)
	)
)
