(footprint "DS01C-254-L-03BE"
	(version 20240108)
	(generator "pcbnew")
	(generator_version "8.0")
	(layer "F.Cu")
	(property "Reference" "REF**"
		(at -0.555 -6.889 0)
		(layer "F.SilkS")
		(uuid "af92ae3d-6971-4c4f-ae9c-2eb024c7b3e2")
		(effects
			(font
				(size 1.4 1.4)
				(thickness 0.15)
			)
		)
	)
	(property "Value" "DS01C-254-L-03BE"
		(at 0 8.5 0)
		(layer "F.Fab")
		(uuid "60ac7f3a-1989-4af4-b898-44468019ac7c")
		(effects
			(font
				(size 1.4 1.4)
				(thickness 0.15)
			)
		)
	)
	(property "Footprint" ""
		(at 0 0 0)
		(layer "F.Fab")
		(hide yes)
		(uuid "e32adaec-0b84-4975-9037-62ab3a03af0b")
		(effects
			(font
				(size 1.27 1.27)
				(thickness 0.15)
			)
		)
	)
	(property "Datasheet" ""
		(at 0 0 0)
		(layer "F.Fab")
		(hide yes)
		(uuid "03e7bdf9-a3a2-4f34-bcdb-f71be8c229ea")
		(effects
			(font
				(size 1.27 1.27)
				(thickness 0.15)
			)
		)
	)
	(property "Description" ""
		(at 0 0 0)
		(layer "F.Fab")
		(hide yes)
		(uuid "1a6673a5-e516-4bdd-a546-993590dec98e")
		(effects
			(font
				(size 1.27 1.27)
				(thickness 0.15)
			)
		)
	)
	(attr through_hole)
	(fp_line
		(start -4.52 -4.95)
		(end 4.52 -4.95)
		(stroke
			(width 0.127)
			(type solid)
		)
		(layer "F.SilkS")
		(uuid "b3272ad2-8422-451b-9103-db62df8401d0")
	)
	(fp_line
		(start -4.52 4.95)
		(end -4.52 -4.95)
		(stroke
			(width 0.127)
			(type solid)
		)
		(layer "F.SilkS")
		(uuid "205d1081-7794-4ed5-8bd9-d4f304f6b22a")
	)
	(fp_line
		(start 4.52 -4.95)
		(end 4.52 4.95)
		(stroke
			(width 0.127)
			(type solid)
		)
		(layer "F.SilkS")
		(uuid "cb7483d0-751e-4794-b12c-39426d674dc2")
	)
	(fp_line
		(start 4.52 4.95)
		(end -4.52 4.95)
		(stroke
			(width 0.127)
			(type solid)
		)
		(layer "F.SilkS")
		(uuid "80c97f35-d61a-4435-8150-f3a6e7c15df0")
	)
	(fp_circle
		(center -2.6 5.7)
		(end -2.5 5.7)
		(stroke
			(width 0.2)
			(type solid)
		)
		(fill none)
		(layer "F.SilkS")
		(uuid "0e8da68a-9487-4d76-a40d-96e44ed55823")
	)
	(fp_line
		(start -4.77 -5.2)
		(end -4.77 5.2)
		(stroke
			(width 0.05)
			(type solid)
		)
		(layer "F.CrtYd")
		(uuid "3a5874bd-5f85-4a07-9630-26a3b188980c")
	)
	(fp_line
		(start -4.77 5.2)
		(end 4.77 5.2)
		(stroke
			(width 0.05)
			(type solid)
		)
		(layer "F.CrtYd")
		(uuid "801333ad-63a1-4570-b3e5-b2023de7fe3d")
	)
	(fp_line
		(start 4.77 -5.2)
		(end -4.77 -5.2)
		(stroke
			(width 0.05)
			(type solid)
		)
		(layer "F.CrtYd")
		(uuid "520eaedc-2947-4fbe-8498-57e2222438ce")
	)
	(fp_line
		(start 4.77 5.2)
		(end 4.77 -5.2)
		(stroke
			(width 0.05)
			(type solid)
		)
		(layer "F.CrtYd")
		(uuid "1ac0e887-53b0-4fbe-aa67-210e465db5c8")
	)
	(fp_line
		(start -4.52 -4.95)
		(end 4.52 -4.95)
		(stroke
			(width 0.127)
			(type solid)
		)
		(layer "F.Fab")
		(uuid "0988428f-6d14-41ba-9f19-9ec6176d8246")
	)
	(fp_line
		(start -4.52 4.95)
		(end -4.52 -4.95)
		(stroke
			(width 0.127)
			(type solid)
		)
		(layer "F.Fab")
		(uuid "636f76e1-fe33-4a9d-b0dd-bddb9dc44a96")
	)
	(fp_line
		(start 4.52 -4.95)
		(end 4.52 4.95)
		(stroke
			(width 0.127)
			(type solid)
		)
		(layer "F.Fab")
		(uuid "2b06f73b-08bf-43f1-8c31-87238b6fa5ea")
	)
	(fp_line
		(start 4.52 4.95)
		(end -4.52 4.95)
		(stroke
			(width 0.127)
			(type solid)
		)
		(layer "F.Fab")
		(uuid "f52580cb-156c-43f2-853a-5d93aa45577e")
	)
	(fp_circle
		(center -2.6 5.7)
		(end -2.5 5.7)
		(stroke
			(width 0.2)
			(type solid)
		)
		(fill none)
		(layer "F.Fab")
		(uuid "28767b72-e1db-4e48-afb1-255c6f99b389")
	)
	(pad "1A" thru_hole rect
		(at -2.54 3.81)
		(size 1.58 1.58)
		(drill 1)
		(layers "*.Cu" "*.Mask")
		(remove_unused_layers no)
		(uuid "61595e46-7713-425c-9181-9ad75c3e6338")
	)
	(pad "1B" thru_hole circle
		(at -2.54 -3.81)
		(size 1.58 1.58)
		(drill 1)
		(layers "*.Cu" "*.Mask")
		(remove_unused_layers no)
		(uuid "c82640ee-0049-4c03-ab98-971b703afca8")
	)
	(pad "2A" thru_hole circle
		(at 0 3.81)
		(size 1.58 1.58)
		(drill 1)
		(layers "*.Cu" "*.Mask")
		(remove_unused_layers no)
		(uuid "6d2c8846-0663-488a-a5d1-20d0c6afe8f0")
	)
	(pad "2B" thru_hole circle
		(at 0 -3.81)
		(size 1.58 1.58)
		(drill 1)
		(layers "*.Cu" "*.Mask")
		(remove_unused_layers no)
		(uuid "1e030793-3e83-4b01-8c3c-75c31b829bba")
	)
	(pad "3A" thru_hole circle
		(at 2.54 3.81)
		(size 1.58 1.58)
		(drill 1)
		(layers "*.Cu" "*.Mask")
		(remove_unused_layers no)
		(uuid "9b1cbdd8-0010-4bdc-bd30-74bec0450e49")
	)
	(pad "3B" thru_hole circle
		(at 2.54 -3.81)
		(size 1.58 1.58)
		(drill 1)
		(layers "*.Cu" "*.Mask")
		(remove_unused_layers no)
		(uuid "ec301329-b5f0-46b7-9e83-ee321f2c44b0")
	)
	(model "${KIPRJMOD}/kicad-library/3D/switches.3dshapes/DS01C-254-L-03BE.step"
		(offset
			(xyz 0.125 0 1.75)
		)
		(scale
			(xyz 1 1 1)
		)
		(rotate
			(xyz -90 0 90)
		)
	)
)
