(footprint "TCR-Logo-PCBArt"
	(version 20240108)
	(generator "pcbnew")
	(generator_version "8.0")
	(layer "F.Cu")
	(descr "svg2mod generated Logo PCBArt")
	(tags "svg2mod")
	(property "Reference" "svg2mod"
		(at 0 -22.948028 0)
		(layer "F.SilkS")
		(hide yes)
		(uuid "5cb9f421-fb73-43dd-b989-5472ff8ed4b8")
		(effects
			(font
				(size 1.524 1.524)
				(thickness 0.3048)
			)
		)
	)
	(property "Value" "G***"
		(at 0 22.948028 0)
		(layer "F.SilkS")
		(hide yes)
		(uuid "8b4737c8-4e51-435f-896e-6ca63da6e90b")
		(effects
			(font
				(size 1.524 1.524)
				(thickness 0.3048)
			)
		)
	)
	(property "Footprint" ""
		(at 0 0 0)
		(layer "F.Fab")
		(hide yes)
		(uuid "203c08fd-ac04-4da2-bbac-ab9336c53395")
		(effects
			(font
				(size 1.27 1.27)
				(thickness 0.15)
			)
		)
	)
	(property "Datasheet" ""
		(at 0 0 0)
		(layer "F.Fab")
		(hide yes)
		(uuid "bf906b98-39ea-4e29-b8d6-81d90682d948")
		(effects
			(font
				(size 1.27 1.27)
				(thickness 0.15)
			)
		)
	)
	(property "Description" ""
		(at 0 0 0)
		(layer "F.Fab")
		(hide yes)
		(uuid "b394b309-3693-4672-a815-3a9e448573de")
		(effects
			(font
				(size 1.27 1.27)
				(thickness 0.15)
			)
		)
	)
	(attr board_only exclude_from_pos_files exclude_from_bom)
	(fp_poly
		(pts
			(xy 1.204064 -13.945399) (xy 0.459996 -13.530661) (xy -0.252178 -13.063282) (xy -1.010991 -12.483142)
			(xy -1.739012 -11.863524) (xy -2.45256 -11.226702) (xy -3.262576 -10.501985) (xy -4.06771 -9.772059)
			(xy -4.858615 -9.026836) (xy -5.632118 -8.251884) (xy -6.376431 -7.448891) (xy -7.08608 -6.61567)
			(xy -7.755596 -5.750034) (xy -8.482313 -4.68779) (xy -9.129247 -3.575517) (xy -9.678854 -2.414655)
			(xy -10.113592 -1.206642) (xy -10.363623 -0.229259) (xy -10.529587 0.765848) (xy -10.587465 1.085725)
			(xy -10.65051 1.370462) (xy -10.780734 1.616959) (xy -11.121282 1.962157) (xy -11.353309 2.147676)
			(xy -11.909864 2.579174) (xy -12.531412 3.104017) (xy -13.141314 3.642675) (xy -14.01878 4.400768)
			(xy -14.172775 4.533057) (xy -13.313913 6.551541) (xy -13.308233 6.563941) (xy -13.123638 6.92531)
			(xy -12.907885 7.269142) (xy -12.199257 8.452198) (xy -12.182204 8.478558) (xy -11.531762 9.346422)
			(xy -10.820013 10.16476) (xy -10.784873 10.20507) (xy -9.778361 11.179309) (xy -8.803523 11.960753)
			(xy -7.969412 12.536535) (xy -7.385082 12.893792) (xy -7.131195 13.017155) (xy -5.393469 13.855495)
			(xy -4.824785 14.074293) (xy -3.196708 14.537629) (xy -1.878213 14.76733) (xy -1.012345 14.86319)
			(xy -1.012345 12.997154) (xy -1.359094 12.437499) (xy -2.001361 11.907622) (xy -2.702165 11.441177)
			(xy -3.374395 10.804233) (xy -3.902774 10.039093) (xy -4.291732 9.191185) (xy -4.597589 8.080399)
			(xy -4.665842 6.951135) (xy -4.418339 5.848754) (xy -4.219901 5.532494) (xy -3.869018 5.022447) (xy -3.424827 4.245766)
			(xy -3.17242 3.399807) (xy -3.18844 2.441726) (xy -3.19624 1.135863) (xy -3.29184 0.946727) (xy -3.481492 0.851127)
			(xy -3.651508 0.865597) (xy -3.805503 0.942597) (xy -4.051483 1.183409) (xy -4.779087 1.880008) (xy -5.76094 2.275849)
			(xy -6.82134 2.117719) (xy -7.079722 1.888276) (xy -7.185659 1.563231) (xy -7.054918 1.221133) (xy -6.805837 0.945698)
			(xy -6.346134 0.416674) (xy -5.950592 -0.162245) (xy -5.428143 -1.191123) (xy -5.029718 -2.274778)
			(xy -4.710691 -3.179338) (xy -4.110753 -3.904764) (xy -3.294369 -4.386996) (xy -2.326007 -4.561976)
			(xy -1.281044 -4.356346) (xy -0.420651 -3.794607) (xy 0.172163 -2.959487) (xy 0.414394 -1.933713)
			(xy 0.452477 -1.196805) (xy 0.454184 -0.574623) (xy 0.308456 0.281656) (xy 0.262466 0.534353) (xy 0.160147 1.202013)
			(xy 0.110537 1.881558) (xy 0.134307 2.416926) (xy 0.211307 2.93524) (xy 0.396825 3.613235) (xy 0.572008 4.04525)
			(xy 0.749258 4.390965) (xy 0.967333 4.824531) (xy 1.201944 5.207453) (xy 1.609154 5.734553) (xy 1.934716 6.062698)
			(xy 2.688158 6.592898) (xy 3.147562 6.790302) (xy 3.575442 6.910708) (xy 4.229666 7.011477) (xy 5.013597 7.015577)
			(xy 5.59289 6.944777) (xy 6.13601 6.823337) (xy 6.780415 6.61043) (xy 7.351439 6.354115) (xy 8.257844 5.797043)
			(xy 8.834553 5.305084) (xy 9.302225 4.799171) (xy 9.564224 4.461207) (xy 9.876867 3.988368) (xy 10.170905 3.443182)
			(xy 10.402933 2.904713) (xy 10.563646 2.423089) (xy 10.663899 2.121299) (xy 10.789989 1.602984) (xy 10.833399 1.172519)
			(xy 10.844249 0.47127) (xy 10.232215 0.214033) (xy 9.695482 -0.176752) (xy 9.13492 -0.847232) (xy 8.682624 -1.603022)
			(xy 8.244469 -2.392031) (xy 7.806868 -3.18148) (xy 7.363842 -3.967735) (xy 6.814164 -4.898512) (xy 6.219725 -5.800699)
			(xy 5.568457 -6.6415) (xy 4.844099 -7.419721) (xy 4.057007 -8.103963) (xy 3.184769 -8.672358) (xy 2.124805 -9.116614)
			(xy 0.998339 -9.343118) (xy 0.800418 -9.359138) (xy 0.775467 -10.178114) (xy 0.828838 -10.99573)
			(xy 0.957542 -11.852727) (xy 1.097555 -12.708287) (xy 1.204009 -13.945421) (xy 1.204064 -13.945399)
		)
		(stroke
			(width 0)
			(type solid)
		)
		(fill solid)
		(layer "B.Paste")
		(uuid "2286e52f-15be-42f2-b8df-b78b869289c5")
	)
	(fp_poly
		(pts
			(xy 0.011373 -19.850982) (xy -0.963222 -19.827042) (xy -1.935469 -19.755311) (xy -2.903024 -19.635961)
			(xy -3.863559 -19.469281) (xy -4.814757 -19.255671) (xy -5.754329 -18.995646) (xy -6.680011 -18.689832)
			(xy -7.589573 -18.338967) (xy -8.480823 -17.943895) (xy -9.351614 -17.505569) (xy -10.19985 -17.025043)
			(xy -11.023486 -16.503476) (xy -11.820539 -15.942124) (xy -12.589087 -15.34234) (xy -13.327281 -14.705568)
			(xy -14.033341 -14.033342) (xy -14.705567 -13.327282) (xy -15.342339 -12.589088) (xy -15.942123 -11.82054)
			(xy -16.503475 -11.023487) (xy -17.025042 -10.199851) (xy -17.505567 -9.351615) (xy -17.943894 -8.480824)
			(xy -18.338966 -7.589573) (xy -18.689831 -6.680012) (xy -18.995644 -5.75433) (xy -19.255669 -4.814758)
			(xy -19.469279 -3.863559) (xy -19.63596 -2.903025) (xy -19.755309 -1.935469) (xy -19.82704 -0.963223)
			(xy -19.85098 0.011372) (xy -19.827065 0.985984) (xy -19.755357 1.958248) (xy -19.636028 2.925823)
			(xy -19.469367 3.886377) (xy -19.255775 4.837596) (xy -18.995766 5.777189) (xy -18.689967 6.702892)
			(xy -18.339114 7.612476) (xy -17.944052 8.503748) (xy -17.505734 9.374562) (xy -17.025216 10.22282)
			(xy -16.503654 11.046479) (xy -15.942306 11.843553) (xy -15.342523 12.612124) (xy -14.705751 13.350339)
			(xy -14.033523 14.056419) (xy -13.32746 14.728665) (xy -12.589262 15.365457) (xy -11.820707 15.965259)
			(xy -11.023647 16.526628) (xy -10.200002 17.048212) (xy -9.351756 17.528752) (xy -8.480954 17.967093)
			(xy -7.589692 18.362177) (xy -6.680117 18.713054) (xy -5.754422 19.018877) (xy -4.814836 19.278911)
			(xy -3.863622 19.492528) (xy -2.903072 19.659214) (xy -1.935501 19.778567) (xy -0.963238 19.850301)
			(xy 0.011373 19.874241) (xy 0.011373 14.898834) (xy -0.719121 14.880903) (xy -1.447854 14.827149)
			(xy -2.173073 14.737703) (xy -2.893029 14.61278) (xy -3.605988 14.452681) (xy -4.310232 14.257791)
			(xy -5.004066 14.02858) (xy -5.685816 13.765601) (xy -6.353842 13.469486) (xy -7.006533 13.140949)
			(xy -7.642318 12.780782) (xy -8.259664 12.389852) (xy -8.857085 11.969102) (xy -9.43314 11.519544)
			(xy -9.986443 11.042262) (xy -10.51566 10.538405) (xy -11.019517 10.009188) (xy -11.496799 9.455885)
			(xy -11.946357 8.879829) (xy -12.367108 8.282409) (xy -12.758037 7.665063) (xy -13.118204 7.029278)
			(xy -13.446741 6.376587) (xy -13.742856 5.708561) (xy -14.005836 5.02681) (xy -14.235046 4.332977)
			(xy -14.429936 3.628733) (xy -14.590036 2.915774) (xy -14.714959 2.195818) (xy -14.804405 1.470599)
			(xy -14.858159 0.741865) (xy -14.87609 0.011372) (xy -14.858159 -0.719122) (xy -14.804405 -1.447855)
			(xy -14.714959 -2.173074) (xy -14.590036 -2.89303) (xy -14.429937 -3.605989) (xy -14.235047 -4.310233)
			(xy -14.005836 -5.004067) (xy -13.742856 -5.685817) (xy -13.446741 -6.353843) (xy -13.118205 -7.006535)
			(xy -12.758038 -7.642319) (xy -12.367108 -8.259665) (xy -11.946357 -8.857086) (xy -11.496799 -9.433142)
			(xy -11.019517 -9.986444) (xy -10.515661 -10.515662) (xy -9.986443 -11.019518) (xy -9.433141 -11.4968)
			(xy -8.857085 -11.946358) (xy -8.259664 -12.367109) (xy -7.642318 -12.758039) (xy -7.006534 -13.118206)
			(xy -6.353842 -13.446743) (xy -5.685817 -13.742857) (xy -5.004066 -14.005837) (xy -4.310232 -14.235048)
			(xy -3.605988 -14.429938) (xy -2.893029 -14.590037) (xy -2.173073 -14.71496) (xy -1.447855 -14.804407)
			(xy -0.719121 -14.85816) (xy 0.011373 -14.876091) (xy 0.741866 -14.85816) (xy 1.4706 -14.804407)
			(xy 2.195819 -14.71496) (xy 2.915775 -14.590037) (xy 3.628734 -14.429938) (xy 4.332978 -14.235048)
			(xy 5.026811 -14.005837) (xy 5.708562 -13.742857) (xy 6.376588 -13.446743) (xy 7.029279 -13.118206)
			(xy 7.665064 -12.758039) (xy 8.28241 -12.367109) (xy 8.879831 -11.946358) (xy 9.455886 -11.4968)
			(xy 10.009189 -11.019518) (xy 10.538406 -10.515662) (xy 11.042263 -9.986444) (xy 11.519545 -9.433142)
			(xy 11.969103 -8.857086) (xy 12.389854 -8.259665) (xy 12.780783 -7.642319) (xy 13.14095 -7.006535)
			(xy 13.469487 -6.353843) (xy 13.765602 -5.685817) (xy 14.028582 -5.004067) (xy 14.257792 -4.310233)
			(xy 14.452682 -3.605989) (xy 14.612782 -2.89303) (xy 14.737705 -2.173074) (xy 14.827151 -1.447855)
			(xy 14.880904 -0.719122) (xy 14.898836 0.011372) (xy 14.880904 0.741865) (xy 14.827151 1.470599)
			(xy 14.737705 2.195818) (xy 14.612781 2.915774) (xy 14.452682 3.628733) (xy 14.257792 4.332977) (xy 14.028581 5.02681)
			(xy 13.765602 5.708561) (xy 13.469487 6.376587) (xy 13.14095 7.029278) (xy 12.780783 7.665063) (xy 12.389853 8.282409)
			(xy 11.969103 8.879829) (xy 11.519545 9.455885) (xy 11.042263 10.009188) (xy 10.538406 10.538405)
			(xy 10.009189 11.042262) (xy 9.455886 11.519544) (xy 8.87983 11.969102) (xy 8.28241 12.389852) (xy 7.665064 12.780782)
			(xy 7.029279 13.140949) (xy 6.376588 13.469486) (xy 5.708562 13.765601) (xy 5.026811 14.02858) (xy 4.332978 14.257791)
			(xy 3.628733 14.452681) (xy 2.915774 14.61278) (xy 2.195819 14.737703) (xy 1.4706 14.827149) (xy 0.741866 14.880903)
			(xy 0.011373 14.898834) (xy 0.011373 19.874241) (xy 0.986001 19.850325) (xy 1.958281 19.778615) (xy 2.925871 19.659283)
			(xy 3.886441 19.492616) (xy 4.837675 19.279017) (xy 5.777283 19.018999) (xy 6.703 18.71319) (xy 7.612596 18.362326)
			(xy 8.503881 17.967252) (xy 9.374706 17.52892) (xy 10.222974 17.048386) (xy 11.046641 16.526808)
			(xy 11.843723 15.965442) (xy 12.6123 15.365641) (xy 13.350519 14.72885) (xy 14.056603 14.056602)
			(xy 14.728851 13.350518) (xy 15.365642 12.612299) (xy 15.965443 11.843722) (xy 16.526809 11.04664)
			(xy 17.048387 10.222973) (xy 17.528921 9.374705) (xy 17.967253 8.50388) (xy 18.362327 7.612595) (xy 18.713191 6.702999)
			(xy 19.019001 5.777282) (xy 19.279018 4.837674) (xy 19.492617 3.88644) (xy 19.659284 2.92587) (xy 19.778616 1.95828)
			(xy 19.850327 0.986) (xy 19.874243 0.011372) (xy 19.850302 -0.963239) (xy 19.778569 -1.935502) (xy 19.659215 -2.903073)
			(xy 19.492529 -3.863623) (xy 19.278912 -4.814837) (xy 19.018879 -5.754423) (xy 18.713056 -6.680119)
			(xy 18.362179 -7.589693) (xy 17.967095 -8.480955) (xy 17.528754 -9.351758) (xy 17.048213 -10.200003)
			(xy 16.52663 -11.023648) (xy 15.965261 -11.820708) (xy 15.365458 -12.589263) (xy 14.728667 -13.327462)
			(xy 14.056421 -14.033525) (xy 13.35034 -14.705752) (xy 12.612125 -15.342525) (xy 11.843555 -15.942307)
			(xy 11.04648 -16.503656) (xy 10.222822 -17.025218) (xy 9.374564 -17.505736) (xy 8.503749 -17.944054)
			(xy 7.612477 -18.339116) (xy 6.702893 -18.689969) (xy 5.77719 -18.995768) (xy 4.837597 -19.255777)
			(xy 3.886378 -19.469369) (xy 2.925824 -19.63603) (xy 1.958249 -19.755359) (xy 0.985985 -19.827067)
			(xy 0.011373 -19.850982)
		)
		(stroke
			(width 0.074672)
			(type solid)
		)
		(fill solid)
		(layer "B.Paste")
		(uuid "7d0d6a41-01db-4499-8925-b3ea317e276f")
	)
	(fp_poly
		(pts
			(xy 1.204064 -13.945399) (xy 0.459996 -13.530661) (xy -0.252178 -13.063282) (xy -1.010991 -12.483142)
			(xy -1.739012 -11.863524) (xy -2.45256 -11.226702) (xy -3.262576 -10.501985) (xy -4.06771 -9.772059)
			(xy -4.858615 -9.026836) (xy -5.632118 -8.251884) (xy -6.376431 -7.448891) (xy -7.08608 -6.61567)
			(xy -7.755596 -5.750034) (xy -8.482313 -4.68779) (xy -9.129247 -3.575517) (xy -9.678854 -2.414655)
			(xy -10.113592 -1.206642) (xy -10.363623 -0.229259) (xy -10.529587 0.765848) (xy -10.587465 1.085725)
			(xy -10.65051 1.370462) (xy -10.780734 1.616959) (xy -11.121282 1.962157) (xy -11.353309 2.147676)
			(xy -11.909864 2.579174) (xy -12.531412 3.104017) (xy -13.141314 3.642675) (xy -14.01878 4.400768)
			(xy -14.172775 4.533057) (xy -13.313913 6.551541) (xy -13.308233 6.563941) (xy -13.123638 6.92531)
			(xy -12.907885 7.269142) (xy -12.199257 8.452198) (xy -12.182204 8.478558) (xy -11.531762 9.346422)
			(xy -10.820013 10.16476) (xy -10.784873 10.20507) (xy -9.778361 11.179309) (xy -8.803523 11.960753)
			(xy -7.969412 12.536535) (xy -7.385082 12.893792) (xy -7.131195 13.017155) (xy -5.393469 13.855495)
			(xy -4.824785 14.074293) (xy -3.196708 14.537629) (xy -1.878213 14.76733) (xy -1.012345 14.86319)
			(xy -1.012345 12.997154) (xy -1.359094 12.437499) (xy -2.001361 11.907622) (xy -2.702165 11.441177)
			(xy -3.374395 10.804233) (xy -3.902774 10.039093) (xy -4.291732 9.191185) (xy -4.597589 8.080399)
			(xy -4.665842 6.951135) (xy -4.418339 5.848754) (xy -4.219901 5.532494) (xy -3.869018 5.022447) (xy -3.424827 4.245766)
			(xy -3.17242 3.399807) (xy -3.18844 2.441726) (xy -3.19624 1.135863) (xy -3.29184 0.946727) (xy -3.481492 0.851127)
			(xy -3.651508 0.865597) (xy -3.805503 0.942597) (xy -4.051483 1.183409) (xy -4.779087 1.880008) (xy -5.76094 2.275849)
			(xy -6.82134 2.117719) (xy -7.079722 1.888276) (xy -7.185659 1.563231) (xy -7.054918 1.221133) (xy -6.805837 0.945698)
			(xy -6.346134 0.416674) (xy -5.950592 -0.162245) (xy -5.428143 -1.191123) (xy -5.029718 -2.274778)
			(xy -4.710691 -3.179338) (xy -4.110753 -3.904764) (xy -3.294369 -4.386996) (xy -2.326007 -4.561976)
			(xy -1.281044 -4.356346) (xy -0.420651 -3.794607) (xy 0.172163 -2.959487) (xy 0.414394 -1.933713)
			(xy 0.452477 -1.196805) (xy 0.454184 -0.574623) (xy 0.308456 0.281656) (xy 0.262466 0.534353) (xy 0.160147 1.202013)
			(xy 0.110537 1.881558) (xy 0.134307 2.416926) (xy 0.211307 2.93524) (xy 0.396825 3.613235) (xy 0.572008 4.04525)
			(xy 0.749258 4.390965) (xy 0.967333 4.824531) (xy 1.201944 5.207453) (xy 1.609154 5.734553) (xy 1.934716 6.062698)
			(xy 2.688158 6.592898) (xy 3.147562 6.790302) (xy 3.575442 6.910708) (xy 4.229666 7.011477) (xy 5.013597 7.015577)
			(xy 5.59289 6.944777) (xy 6.13601 6.823337) (xy 6.780415 6.61043) (xy 7.351439 6.354115) (xy 8.257844 5.797043)
			(xy 8.834553 5.305084) (xy 9.302225 4.799171) (xy 9.564224 4.461207) (xy 9.876867 3.988368) (xy 10.170905 3.443182)
			(xy 10.402933 2.904713) (xy 10.563646 2.423089) (xy 10.663899 2.121299) (xy 10.789989 1.602984) (xy 10.833399 1.172519)
			(xy 10.844249 0.47127) (xy 10.232215 0.214033) (xy 9.695482 -0.176752) (xy 9.13492 -0.847232) (xy 8.682624 -1.603022)
			(xy 8.244469 -2.392031) (xy 7.806868 -3.18148) (xy 7.363842 -3.967735) (xy 6.814164 -4.898512) (xy 6.219725 -5.800699)
			(xy 5.568457 -6.6415) (xy 4.844099 -7.419721) (xy 4.057007 -8.103963) (xy 3.184769 -8.672358) (xy 2.124805 -9.116614)
			(xy 0.998339 -9.343118) (xy 0.800418 -9.359138) (xy 0.775467 -10.178114) (xy 0.828838 -10.99573)
			(xy 0.957542 -11.852727) (xy 1.097555 -12.708287) (xy 1.204009 -13.945421) (xy 1.204064 -13.945399)
		)
		(stroke
			(width 0)
			(type solid)
		)
		(fill solid)
		(layer "F.Paste")
		(uuid "6d79c586-70ff-4c9d-ace7-064b2cbeb43f")
	)
	(fp_poly
		(pts
			(xy 0.011373 -19.850982) (xy -0.963222 -19.827042) (xy -1.935469 -19.755311) (xy -2.903024 -19.635961)
			(xy -3.863559 -19.469281) (xy -4.814757 -19.255671) (xy -5.754329 -18.995646) (xy -6.680011 -18.689832)
			(xy -7.589573 -18.338967) (xy -8.480823 -17.943895) (xy -9.351614 -17.505569) (xy -10.19985 -17.025043)
			(xy -11.023486 -16.503476) (xy -11.820539 -15.942124) (xy -12.589087 -15.34234) (xy -13.327281 -14.705568)
			(xy -14.033341 -14.033342) (xy -14.705567 -13.327282) (xy -15.342339 -12.589088) (xy -15.942123 -11.82054)
			(xy -16.503475 -11.023487) (xy -17.025042 -10.199851) (xy -17.505567 -9.351615) (xy -17.943894 -8.480824)
			(xy -18.338966 -7.589573) (xy -18.689831 -6.680012) (xy -18.995644 -5.75433) (xy -19.255669 -4.814758)
			(xy -19.469279 -3.863559) (xy -19.63596 -2.903025) (xy -19.755309 -1.935469) (xy -19.82704 -0.963223)
			(xy -19.85098 0.011372) (xy -19.827065 0.985984) (xy -19.755357 1.958248) (xy -19.636028 2.925823)
			(xy -19.469367 3.886377) (xy -19.255775 4.837596) (xy -18.995766 5.777189) (xy -18.689967 6.702892)
			(xy -18.339114 7.612476) (xy -17.944052 8.503748) (xy -17.505734 9.374562) (xy -17.025216 10.22282)
			(xy -16.503654 11.046479) (xy -15.942306 11.843553) (xy -15.342523 12.612124) (xy -14.705751 13.350339)
			(xy -14.033523 14.056419) (xy -13.32746 14.728665) (xy -12.589262 15.365457) (xy -11.820707 15.965259)
			(xy -11.023647 16.526628) (xy -10.200002 17.048212) (xy -9.351756 17.528752) (xy -8.480954 17.967093)
			(xy -7.589692 18.362177) (xy -6.680117 18.713054) (xy -5.754422 19.018877) (xy -4.814836 19.278911)
			(xy -3.863622 19.492528) (xy -2.903072 19.659214) (xy -1.935501 19.778567) (xy -0.963238 19.850301)
			(xy 0.011373 19.874241) (xy 0.011373 14.898834) (xy -0.719121 14.880903) (xy -1.447854 14.827149)
			(xy -2.173073 14.737703) (xy -2.893029 14.61278) (xy -3.605988 14.452681) (xy -4.310232 14.257791)
			(xy -5.004066 14.02858) (xy -5.685816 13.765601) (xy -6.353842 13.469486) (xy -7.006533 13.140949)
			(xy -7.642318 12.780782) (xy -8.259664 12.389852) (xy -8.857085 11.969102) (xy -9.43314 11.519544)
			(xy -9.986443 11.042262) (xy -10.51566 10.538405) (xy -11.019517 10.009188) (xy -11.496799 9.455885)
			(xy -11.946357 8.879829) (xy -12.367108 8.282409) (xy -12.758037 7.665063) (xy -13.118204 7.029278)
			(xy -13.446741 6.376587) (xy -13.742856 5.708561) (xy -14.005836 5.02681) (xy -14.235046 4.332977)
			(xy -14.429936 3.628733) (xy -14.590036 2.915774) (xy -14.714959 2.195818) (xy -14.804405 1.470599)
			(xy -14.858159 0.741865) (xy -14.87609 0.011372) (xy -14.858159 -0.719122) (xy -14.804405 -1.447855)
			(xy -14.714959 -2.173074) (xy -14.590036 -2.89303) (xy -14.429937 -3.605989) (xy -14.235047 -4.310233)
			(xy -14.005836 -5.004067) (xy -13.742856 -5.685817) (xy -13.446741 -6.353843) (xy -13.118205 -7.006535)
			(xy -12.758038 -7.642319) (xy -12.367108 -8.259665) (xy -11.946357 -8.857086) (xy -11.496799 -9.433142)
			(xy -11.019517 -9.986444) (xy -10.515661 -10.515662) (xy -9.986443 -11.019518) (xy -9.433141 -11.4968)
			(xy -8.857085 -11.946358) (xy -8.259664 -12.367109) (xy -7.642318 -12.758039) (xy -7.006534 -13.118206)
			(xy -6.353842 -13.446743) (xy -5.685817 -13.742857) (xy -5.004066 -14.005837) (xy -4.310232 -14.235048)
			(xy -3.605988 -14.429938) (xy -2.893029 -14.590037) (xy -2.173073 -14.71496) (xy -1.447855 -14.804407)
			(xy -0.719121 -14.85816) (xy 0.011373 -14.876091) (xy 0.741866 -14.85816) (xy 1.4706 -14.804407)
			(xy 2.195819 -14.71496) (xy 2.915775 -14.590037) (xy 3.628734 -14.429938) (xy 4.332978 -14.235048)
			(xy 5.026811 -14.005837) (xy 5.708562 -13.742857) (xy 6.376588 -13.446743) (xy 7.029279 -13.118206)
			(xy 7.665064 -12.758039) (xy 8.28241 -12.367109) (xy 8.879831 -11.946358) (xy 9.455886 -11.4968)
			(xy 10.009189 -11.019518) (xy 10.538406 -10.515662) (xy 11.042263 -9.986444) (xy 11.519545 -9.433142)
			(xy 11.969103 -8.857086) (xy 12.389854 -8.259665) (xy 12.780783 -7.642319) (xy 13.14095 -7.006535)
			(xy 13.469487 -6.353843) (xy 13.765602 -5.685817) (xy 14.028582 -5.004067) (xy 14.257792 -4.310233)
			(xy 14.452682 -3.605989) (xy 14.612782 -2.89303) (xy 14.737705 -2.173074) (xy 14.827151 -1.447855)
			(xy 14.880904 -0.719122) (xy 14.898836 0.011372) (xy 14.880904 0.741865) (xy 14.827151 1.470599)
			(xy 14.737705 2.195818) (xy 14.612781 2.915774) (xy 14.452682 3.628733) (xy 14.257792 4.332977) (xy 14.028581 5.02681)
			(xy 13.765602 5.708561) (xy 13.469487 6.376587) (xy 13.14095 7.029278) (xy 12.780783 7.665063) (xy 12.389853 8.282409)
			(xy 11.969103 8.879829) (xy 11.519545 9.455885) (xy 11.042263 10.009188) (xy 10.538406 10.538405)
			(xy 10.009189 11.042262) (xy 9.455886 11.519544) (xy 8.87983 11.969102) (xy 8.28241 12.389852) (xy 7.665064 12.780782)
			(xy 7.029279 13.140949) (xy 6.376588 13.469486) (xy 5.708562 13.765601) (xy 5.026811 14.02858) (xy 4.332978 14.257791)
			(xy 3.628733 14.452681) (xy 2.915774 14.61278) (xy 2.195819 14.737703) (xy 1.4706 14.827149) (xy 0.741866 14.880903)
			(xy 0.011373 14.898834) (xy 0.011373 19.874241) (xy 0.986001 19.850325) (xy 1.958281 19.778615) (xy 2.925871 19.659283)
			(xy 3.886441 19.492616) (xy 4.837675 19.279017) (xy 5.777283 19.018999) (xy 6.703 18.71319) (xy 7.612596 18.362326)
			(xy 8.503881 17.967252) (xy 9.374706 17.52892) (xy 10.222974 17.048386) (xy 11.046641 16.526808)
			(xy 11.843723 15.965442) (xy 12.6123 15.365641) (xy 13.350519 14.72885) (xy 14.056603 14.056602)
			(xy 14.728851 13.350518) (xy 15.365642 12.612299) (xy 15.965443 11.843722) (xy 16.526809 11.04664)
			(xy 17.048387 10.222973) (xy 17.528921 9.374705) (xy 17.967253 8.50388) (xy 18.362327 7.612595) (xy 18.713191 6.702999)
			(xy 19.019001 5.777282) (xy 19.279018 4.837674) (xy 19.492617 3.88644) (xy 19.659284 2.92587) (xy 19.778616 1.95828)
			(xy 19.850327 0.986) (xy 19.874243 0.011372) (xy 19.850302 -0.963239) (xy 19.778569 -1.935502) (xy 19.659215 -2.903073)
			(xy 19.492529 -3.863623) (xy 19.278912 -4.814837) (xy 19.018879 -5.754423) (xy 18.713056 -6.680119)
			(xy 18.362179 -7.589693) (xy 17.967095 -8.480955) (xy 17.528754 -9.351758) (xy 17.048213 -10.200003)
			(xy 16.52663 -11.023648) (xy 15.965261 -11.820708) (xy 15.365458 -12.589263) (xy 14.728667 -13.327462)
			(xy 14.056421 -14.033525) (xy 13.35034 -14.705752) (xy 12.612125 -15.342525) (xy 11.843555 -15.942307)
			(xy 11.04648 -16.503656) (xy 10.222822 -17.025218) (xy 9.374564 -17.505736) (xy 8.503749 -17.944054)
			(xy 7.612477 -18.339116) (xy 6.702893 -18.689969) (xy 5.77719 -18.995768) (xy 4.837597 -19.255777)
			(xy 3.886378 -19.469369) (xy 2.925824 -19.63603) (xy 1.958249 -19.755359) (xy 0.985985 -19.827067)
			(xy 0.011373 -19.850982)
		)
		(stroke
			(width 0.074672)
			(type solid)
		)
		(fill solid)
		(layer "F.Paste")
		(uuid "428e88c0-a90c-4f04-9baf-9ecb17ced8fa")
	)
	(fp_poly
		(pts
			(xy -1.68654 -1.843532) (xy -1.71235 -1.660232) (xy -1.7739 -1.515298) (xy -1.85702 -1.401037) (xy -1.986243 -1.290734)
			(xy -2.078863 -1.240394) (xy -2.193512 -1.201754) (xy -2.346051 -1.184024) (xy -2.441691 -1.190924)
			(xy -2.532481 -1.210764) (xy -2.739994 -1.31458) (xy -2.924427 -1.52639) (xy -2.993507 -1.717395)
			(xy -3.005557 -1.843549) (xy -2.994347 -1.965286) (xy -2.967107 -2.065988) (xy -2.902657 -2.197464)
			(xy -2.838177 -2.282604) (xy -2.716102 -2.38953) (xy -2.643702 -2.43222) (xy -2.537453 -2.47485)
			(xy -2.346054 -2.50305) (xy -2.235029 -2.49375) (xy -2.159249 -2.47622) (xy -2.079029 -2.44675) (xy -2.012859 -2.41281)
			(xy -1.915439 -2.34307) (xy -1.848319 -2.27622) (xy -1.799739 -2.21308) (xy -1.748309 -2.12253) (xy -1.702419 -1.987945)
			(xy -1.686559 -1.843537) (xy -1.68654 -1.843532)
		)
		(stroke
			(width 0)
			(type solid)
		)
		(fill solid)
		(layer "B.SilkS")
		(uuid "4c3595a4-cb25-42c6-a514-392856fafd31")
	)
	(fp_poly
		(pts
			(xy 14.898453 0.011006) (xy 14.88052 0.741498) (xy 14.826766 1.470231) (xy 14.737319 2.195448) (xy 14.612395 2.915403)
			(xy 14.452295 3.628361) (xy 14.257405 4.332604) (xy 14.028193 5.026436) (xy 13.765214 5.708185) (xy 13.469099 6.37621)
			(xy 13.140562 7.0289) (xy 12.780395 7.664683) (xy 12.389466 8.282028) (xy 11.968716 8.879448) (xy 11.519158 9.455502)
			(xy 11.041877 10.008804) (xy 10.538021 10.538021) (xy 10.008804 11.041877) (xy 9.455502 11.519158)
			(xy 8.879448 11.968716) (xy 8.282028 12.389466) (xy 7.664683 12.780395) (xy 7.0289 13.140562) (xy 6.37621 13.469099)
			(xy 5.708185 13.765214) (xy 5.026436 14.028193) (xy 4.332604 14.257405) (xy 3.628361 14.452295) (xy 2.915403 14.612395)
			(xy 2.195448 14.737319) (xy 1.470231 14.826766) (xy 0.741498 14.88052) (xy 0.011006 14.898453) (xy -0.719486 14.88052)
			(xy -1.448219 14.826766) (xy -2.173436 14.737319) (xy -2.893391 14.612395) (xy -3.606349 14.452295)
			(xy -4.310592 14.257405) (xy -5.004424 14.028194) (xy -5.686173 13.765214) (xy -6.354198 13.469099)
			(xy -7.006888 13.140562) (xy -7.642672 12.780395) (xy -8.260017 12.389466) (xy -8.857436 11.968716)
			(xy -9.433491 11.519158) (xy -9.986793 11.041877) (xy -10.516009 10.538021) (xy -11.019865 10.008805)
			(xy -11.497147 9.455503) (xy -11.946704 8.879448) (xy -12.367454 8.282029) (xy -12.758384 7.664684)
			(xy -13.118551 7.0289) (xy -13.447087 6.37621) (xy -13.743202 5.708185) (xy -14.006182 5.026436)
			(xy -14.235393 4.332604) (xy -14.430283 3.628361) (xy -14.590383 2.915403) (xy -14.715307 2.195448)
			(xy -14.804754 1.470231) (xy -14.858509 0.741498) (xy -14.876442 0.011006) (xy -14.876441 0.011006)
			(xy -14.858509 -0.719486) (xy -14.804754 -1.448219) (xy -14.715307 -2.173436) (xy -14.590383 -2.893391)
			(xy -14.430283 -3.606349) (xy -14.235393 -4.310592) (xy -14.006182 -5.004424) (xy -13.743202 -5.686174)
			(xy -13.447087 -6.354198) (xy -13.118551 -7.006888) (xy -12.758384 -7.642672) (xy -12.367454 -8.260017)
			(xy -11.946704 -8.857436) (xy -11.497147 -9.433491) (xy -11.019865 -9.986793) (xy -10.516009 -10.516009)
			(xy -9.986793 -11.019865) (xy -9.433491 -11.497147) (xy -8.857436 -11.946704) (xy -8.260017 -12.367454)
			(xy -7.642672 -12.758384) (xy -7.006888 -13.118551) (xy -6.354198 -13.447087) (xy -5.686174 -13.743202)
			(xy -5.004424 -14.006182) (xy -4.310592 -14.235393) (xy -3.606349 -14.430283) (xy -2.893391 -14.590383)
			(xy -2.173436 -14.715307) (xy -1.448219 -14.804754) (xy -0.719486 -14.858509) (xy 0.011006 -14.876441)
			(xy 0.011006 -14.876442) (xy 0.741498 -14.858509) (xy 1.470231 -14.804754) (xy 2.195448 -14.715307)
			(xy 2.915403 -14.590383) (xy 3.628361 -14.430283) (xy 4.332604 -14.235393) (xy 5.026436 -14.006182)
			(xy 5.708185 -13.743202) (xy 6.37621 -13.447087) (xy 7.0289 -13.118551) (xy 7.664684 -12.758384)
			(xy 8.282029 -12.367454) (xy 8.879448 -11.946704) (xy 9.455503 -11.497147) (xy 10.008805 -11.019865)
			(xy 10.538021 -10.516009) (xy 11.041877 -9.986793) (xy 11.519158 -9.433491) (xy 11.968716 -8.857436)
			(xy 12.389466 -8.260017) (xy 12.780395 -7.642672) (xy 13.140562 -7.006888) (xy 13.469099 -6.354198)
			(xy 13.765214 -5.686173) (xy 14.028194 -5.004424) (xy 14.257405 -4.310592) (xy 14.452295 -3.606349)
			(xy 14.612395 -2.893391) (xy 14.737319 -2.173436) (xy 14.826766 -1.448219) (xy 14.88052 -0.719486)
			(xy 14.898453 0.011006)
		)
		(stroke
			(width 0.75)
			(type solid)
		)
		(fill none)
		(layer "B.SilkS")
		(uuid "c6de4087-67b1-46b3-85a8-fda3bbad3d40")
	)
	(fp_poly
		(pts
			(xy -1.68654 -1.843532) (xy -1.71235 -1.660232) (xy -1.7739 -1.515298) (xy -1.85702 -1.401037) (xy -1.986243 -1.290734)
			(xy -2.078863 -1.240394) (xy -2.193512 -1.201754) (xy -2.346051 -1.184024) (xy -2.441691 -1.190924)
			(xy -2.532481 -1.210764) (xy -2.739994 -1.31458) (xy -2.924427 -1.52639) (xy -2.993507 -1.717395)
			(xy -3.005557 -1.843549) (xy -2.994347 -1.965286) (xy -2.967107 -2.065988) (xy -2.902657 -2.197464)
			(xy -2.838177 -2.282604) (xy -2.716102 -2.38953) (xy -2.643702 -2.43222) (xy -2.537453 -2.47485)
			(xy -2.346054 -2.50305) (xy -2.235029 -2.49375) (xy -2.159249 -2.47622) (xy -2.079029 -2.44675) (xy -2.012859 -2.41281)
			(xy -1.915439 -2.34307) (xy -1.848319 -2.27622) (xy -1.799739 -2.21308) (xy -1.748309 -2.12253) (xy -1.702419 -1.987945)
			(xy -1.686559 -1.843537) (xy -1.68654 -1.843532)
		)
		(stroke
			(width 0)
			(type solid)
		)
		(fill solid)
		(layer "F.SilkS")
		(uuid "956aef27-be6e-4081-a32d-6ddbdd75f7c5")
	)
	(fp_poly
		(pts
			(xy 14.898453 0.011006) (xy 14.88052 0.741498) (xy 14.826766 1.470231) (xy 14.737319 2.195448) (xy 14.612395 2.915403)
			(xy 14.452295 3.628361) (xy 14.257405 4.332604) (xy 14.028193 5.026436) (xy 13.765214 5.708185) (xy 13.469099 6.37621)
			(xy 13.140562 7.0289) (xy 12.780395 7.664683) (xy 12.389466 8.282028) (xy 11.968716 8.879448) (xy 11.519158 9.455502)
			(xy 11.041877 10.008804) (xy 10.538021 10.538021) (xy 10.008804 11.041877) (xy 9.455502 11.519158)
			(xy 8.879448 11.968716) (xy 8.282028 12.389466) (xy 7.664683 12.780395) (xy 7.0289 13.140562) (xy 6.37621 13.469099)
			(xy 5.708185 13.765214) (xy 5.026436 14.028193) (xy 4.332604 14.257405) (xy 3.628361 14.452295) (xy 2.915403 14.612395)
			(xy 2.195448 14.737319) (xy 1.470231 14.826766) (xy 0.741498 14.88052) (xy 0.011006 14.898453) (xy -0.719486 14.88052)
			(xy -1.448219 14.826766) (xy -2.173436 14.737319) (xy -2.893391 14.612395) (xy -3.606349 14.452295)
			(xy -4.310592 14.257405) (xy -5.004424 14.028194) (xy -5.686173 13.765214) (xy -6.354198 13.469099)
			(xy -7.006888 13.140562) (xy -7.642672 12.780395) (xy -8.260017 12.389466) (xy -8.857436 11.968716)
			(xy -9.433491 11.519158) (xy -9.986793 11.041877) (xy -10.516009 10.538021) (xy -11.019865 10.008805)
			(xy -11.497147 9.455503) (xy -11.946704 8.879448) (xy -12.367454 8.282029) (xy -12.758384 7.664684)
			(xy -13.118551 7.0289) (xy -13.447087 6.37621) (xy -13.743202 5.708185) (xy -14.006182 5.026436)
			(xy -14.235393 4.332604) (xy -14.430283 3.628361) (xy -14.590383 2.915403) (xy -14.715307 2.195448)
			(xy -14.804754 1.470231) (xy -14.858509 0.741498) (xy -14.876442 0.011006) (xy -14.876441 0.011006)
			(xy -14.858509 -0.719486) (xy -14.804754 -1.448219) (xy -14.715307 -2.173436) (xy -14.590383 -2.893391)
			(xy -14.430283 -3.606349) (xy -14.235393 -4.310592) (xy -14.006182 -5.004424) (xy -13.743202 -5.686174)
			(xy -13.447087 -6.354198) (xy -13.118551 -7.006888) (xy -12.758384 -7.642672) (xy -12.367454 -8.260017)
			(xy -11.946704 -8.857436) (xy -11.497147 -9.433491) (xy -11.019865 -9.986793) (xy -10.516009 -10.516009)
			(xy -9.986793 -11.019865) (xy -9.433491 -11.497147) (xy -8.857436 -11.946704) (xy -8.260017 -12.367454)
			(xy -7.642672 -12.758384) (xy -7.006888 -13.118551) (xy -6.354198 -13.447087) (xy -5.686174 -13.743202)
			(xy -5.004424 -14.006182) (xy -4.310592 -14.235393) (xy -3.606349 -14.430283) (xy -2.893391 -14.590383)
			(xy -2.173436 -14.715307) (xy -1.448219 -14.804754) (xy -0.719486 -14.858509) (xy 0.011006 -14.876441)
			(xy 0.011006 -14.876442) (xy 0.741498 -14.858509) (xy 1.470231 -14.804754) (xy 2.195448 -14.715307)
			(xy 2.915403 -14.590383) (xy 3.628361 -14.430283) (xy 4.332604 -14.235393) (xy 5.026436 -14.006182)
			(xy 5.708185 -13.743202) (xy 6.37621 -13.447087) (xy 7.0289 -13.118551) (xy 7.664684 -12.758384)
			(xy 8.282029 -12.367454) (xy 8.879448 -11.946704) (xy 9.455503 -11.497147) (xy 10.008805 -11.019865)
			(xy 10.538021 -10.516009) (xy 11.041877 -9.986793) (xy 11.519158 -9.433491) (xy 11.968716 -8.857436)
			(xy 12.389466 -8.260017) (xy 12.780395 -7.642672) (xy 13.140562 -7.006888) (xy 13.469099 -6.354198)
			(xy 13.765214 -5.686173) (xy 14.028194 -5.004424) (xy 14.257405 -4.310592) (xy 14.452295 -3.606349)
			(xy 14.612395 -2.893391) (xy 14.737319 -2.173436) (xy 14.826766 -1.448219) (xy 14.88052 -0.719486)
			(xy 14.898453 0.011006)
		)
		(stroke
			(width 0.75)
			(type solid)
		)
		(fill none)
		(layer "F.SilkS")
		(uuid "a01f0a81-70bf-45f0-a672-48025fa035ba")
	)
	(fp_poly
		(pts
			(xy 1.204064 -13.945399) (xy 0.459996 -13.530661) (xy -0.252178 -13.063282) (xy -1.010991 -12.483142)
			(xy -1.739012 -11.863524) (xy -2.45256 -11.226702) (xy -3.262576 -10.501985) (xy -4.06771 -9.772059)
			(xy -4.858615 -9.026836) (xy -5.632118 -8.251884) (xy -6.376431 -7.448891) (xy -7.08608 -6.61567)
			(xy -7.755596 -5.750034) (xy -8.482313 -4.68779) (xy -9.129247 -3.575517) (xy -9.678854 -2.414655)
			(xy -10.113592 -1.206642) (xy -10.363623 -0.229259) (xy -10.529587 0.765848) (xy -10.587465 1.085725)
			(xy -10.65051 1.370462) (xy -10.780734 1.616959) (xy -11.121282 1.962157) (xy -11.353309 2.147676)
			(xy -11.909864 2.579174) (xy -12.531412 3.104017) (xy -13.141314 3.642675) (xy -14.01878 4.400768)
			(xy -14.172775 4.533057) (xy -13.313913 6.551541) (xy -13.308233 6.563941) (xy -13.123638 6.92531)
			(xy -12.907885 7.269142) (xy -12.199257 8.452198) (xy -12.182204 8.478558) (xy -11.531762 9.346422)
			(xy -10.820013 10.16476) (xy -10.784873 10.20507) (xy -9.778361 11.179309) (xy -8.803523 11.960753)
			(xy -7.969412 12.536535) (xy -7.385082 12.893792) (xy -7.131195 13.017155) (xy -5.393469 13.855495)
			(xy -4.824785 14.074293) (xy -3.196708 14.537629) (xy -1.878213 14.76733) (xy -1.012345 14.86319)
			(xy -1.012345 12.997154) (xy -1.359094 12.437499) (xy -2.001361 11.907622) (xy -2.702165 11.441177)
			(xy -3.374395 10.804233) (xy -3.902774 10.039093) (xy -4.291732 9.191185) (xy -4.597589 8.080399)
			(xy -4.665842 6.951135) (xy -4.418339 5.848754) (xy -4.219901 5.532494) (xy -3.869018 5.022447) (xy -3.424827 4.245766)
			(xy -3.17242 3.399807) (xy -3.18844 2.441726) (xy -3.19624 1.135863) (xy -3.29184 0.946727) (xy -3.481492 0.851127)
			(xy -3.651508 0.865597) (xy -3.805503 0.942597) (xy -4.051483 1.183409) (xy -4.779087 1.880008) (xy -5.76094 2.275849)
			(xy -6.82134 2.117719) (xy -7.079722 1.888276) (xy -7.185659 1.563231) (xy -7.054918 1.221133) (xy -6.805837 0.945698)
			(xy -6.346134 0.416674) (xy -5.950592 -0.162245) (xy -5.428143 -1.191123) (xy -5.029718 -2.274778)
			(xy -4.710691 -3.179338) (xy -4.110753 -3.904764) (xy -3.294369 -4.386996) (xy -2.326007 -4.561976)
			(xy -1.281044 -4.356346) (xy -0.420651 -3.794607) (xy 0.172163 -2.959487) (xy 0.414394 -1.933713)
			(xy 0.452477 -1.196805) (xy 0.454184 -0.574623) (xy 0.308456 0.281656) (xy 0.262466 0.534353) (xy 0.160147 1.202013)
			(xy 0.110537 1.881558) (xy 0.134307 2.416926) (xy 0.211307 2.93524) (xy 0.396825 3.613235) (xy 0.572008 4.04525)
			(xy 0.749258 4.390965) (xy 0.967333 4.824531) (xy 1.201944 5.207453) (xy 1.609154 5.734553) (xy 1.934716 6.062698)
			(xy 2.688158 6.592898) (xy 3.147562 6.790302) (xy 3.575442 6.910708) (xy 4.229666 7.011477) (xy 5.013597 7.015577)
			(xy 5.59289 6.944777) (xy 6.13601 6.823337) (xy 6.780415 6.61043) (xy 7.351439 6.354115) (xy 8.257844 5.797043)
			(xy 8.834553 5.305084) (xy 9.302225 4.799171) (xy 9.564224 4.461207) (xy 9.876867 3.988368) (xy 10.170905 3.443182)
			(xy 10.402933 2.904713) (xy 10.563646 2.423089) (xy 10.663899 2.121299) (xy 10.789989 1.602984) (xy 10.833399 1.172519)
			(xy 10.844249 0.47127) (xy 10.232215 0.214033) (xy 9.695482 -0.176752) (xy 9.13492 -0.847232) (xy 8.682624 -1.603022)
			(xy 8.244469 -2.392031) (xy 7.806868 -3.18148) (xy 7.363842 -3.967735) (xy 6.814164 -4.898512) (xy 6.219725 -5.800699)
			(xy 5.568457 -6.6415) (xy 4.844099 -7.419721) (xy 4.057007 -8.103963) (xy 3.184769 -8.672358) (xy 2.124805 -9.116614)
			(xy 0.998339 -9.343118) (xy 0.800418 -9.359138) (xy 0.775467 -10.178114) (xy 0.828838 -10.99573)
			(xy 0.957542 -11.852727) (xy 1.097555 -12.708287) (xy 1.204009 -13.945421) (xy 1.204064 -13.945399)
		)
		(stroke
			(width 0)
			(type solid)
		)
		(fill solid)
		(layer "B.Mask")
		(uuid "0409ed64-faa8-4d3b-b105-bba605d918ce")
	)
	(fp_poly
		(pts
			(xy 0.011373 -19.850982) (xy -0.963222 -19.827042) (xy -1.935469 -19.755311) (xy -2.903024 -19.635961)
			(xy -3.863559 -19.469281) (xy -4.814757 -19.255671) (xy -5.754329 -18.995646) (xy -6.680011 -18.689832)
			(xy -7.589573 -18.338967) (xy -8.480823 -17.943895) (xy -9.351614 -17.505569) (xy -10.19985 -17.025043)
			(xy -11.023486 -16.503476) (xy -11.820539 -15.942124) (xy -12.589087 -15.34234) (xy -13.327281 -14.705568)
			(xy -14.033341 -14.033342) (xy -14.705567 -13.327282) (xy -15.342339 -12.589088) (xy -15.942123 -11.82054)
			(xy -16.503475 -11.023487) (xy -17.025042 -10.199851) (xy -17.505567 -9.351615) (xy -17.943894 -8.480824)
			(xy -18.338966 -7.589573) (xy -18.689831 -6.680012) (xy -18.995644 -5.75433) (xy -19.255669 -4.814758)
			(xy -19.469279 -3.863559) (xy -19.63596 -2.903025) (xy -19.755309 -1.935469) (xy -19.82704 -0.963223)
			(xy -19.85098 0.011372) (xy -19.827065 0.985984) (xy -19.755357 1.958248) (xy -19.636028 2.925823)
			(xy -19.469367 3.886377) (xy -19.255775 4.837596) (xy -18.995766 5.777189) (xy -18.689967 6.702892)
			(xy -18.339114 7.612476) (xy -17.944052 8.503748) (xy -17.505734 9.374562) (xy -17.025216 10.22282)
			(xy -16.503654 11.046479) (xy -15.942306 11.843553) (xy -15.342523 12.612124) (xy -14.705751 13.350339)
			(xy -14.033523 14.056419) (xy -13.32746 14.728665) (xy -12.589262 15.365457) (xy -11.820707 15.965259)
			(xy -11.023647 16.526628) (xy -10.200002 17.048212) (xy -9.351756 17.528752) (xy -8.480954 17.967093)
			(xy -7.589692 18.362177) (xy -6.680117 18.713054) (xy -5.754422 19.018877) (xy -4.814836 19.278911)
			(xy -3.863622 19.492528) (xy -2.903072 19.659214) (xy -1.935501 19.778567) (xy -0.963238 19.850301)
			(xy 0.011373 19.874241) (xy 0.011373 14.898834) (xy -0.719121 14.880903) (xy -1.447854 14.827149)
			(xy -2.173073 14.737703) (xy -2.893029 14.61278) (xy -3.605988 14.452681) (xy -4.310232 14.257791)
			(xy -5.004066 14.02858) (xy -5.685816 13.765601) (xy -6.353842 13.469486) (xy -7.006533 13.140949)
			(xy -7.642318 12.780782) (xy -8.259664 12.389852) (xy -8.857085 11.969102) (xy -9.43314 11.519544)
			(xy -9.986443 11.042262) (xy -10.51566 10.538405) (xy -11.019517 10.009188) (xy -11.496799 9.455885)
			(xy -11.946357 8.879829) (xy -12.367108 8.282409) (xy -12.758037 7.665063) (xy -13.118204 7.029278)
			(xy -13.446741 6.376587) (xy -13.742856 5.708561) (xy -14.005836 5.02681) (xy -14.235046 4.332977)
			(xy -14.429936 3.628733) (xy -14.590036 2.915774) (xy -14.714959 2.195818) (xy -14.804405 1.470599)
			(xy -14.858159 0.741865) (xy -14.87609 0.011372) (xy -14.858159 -0.719122) (xy -14.804405 -1.447855)
			(xy -14.714959 -2.173074) (xy -14.590036 -2.89303) (xy -14.429937 -3.605989) (xy -14.235047 -4.310233)
			(xy -14.005836 -5.004067) (xy -13.742856 -5.685817) (xy -13.446741 -6.353843) (xy -13.118205 -7.006535)
			(xy -12.758038 -7.642319) (xy -12.367108 -8.259665) (xy -11.946357 -8.857086) (xy -11.496799 -9.433142)
			(xy -11.019517 -9.986444) (xy -10.515661 -10.515662) (xy -9.986443 -11.019518) (xy -9.433141 -11.4968)
			(xy -8.857085 -11.946358) (xy -8.259664 -12.367109) (xy -7.642318 -12.758039) (xy -7.006534 -13.118206)
			(xy -6.353842 -13.446743) (xy -5.685817 -13.742857) (xy -5.004066 -14.005837) (xy -4.310232 -14.235048)
			(xy -3.605988 -14.429938) (xy -2.893029 -14.590037) (xy -2.173073 -14.71496) (xy -1.447855 -14.804407)
			(xy -0.719121 -14.85816) (xy 0.011373 -14.876091) (xy 0.741866 -14.85816) (xy 1.4706 -14.804407)
			(xy 2.195819 -14.71496) (xy 2.915775 -14.590037) (xy 3.628734 -14.429938) (xy 4.332978 -14.235048)
			(xy 5.026811 -14.005837) (xy 5.708562 -13.742857) (xy 6.376588 -13.446743) (xy 7.029279 -13.118206)
			(xy 7.665064 -12.758039) (xy 8.28241 -12.367109) (xy 8.879831 -11.946358) (xy 9.455886 -11.4968)
			(xy 10.009189 -11.019518) (xy 10.538406 -10.515662) (xy 11.042263 -9.986444) (xy 11.519545 -9.433142)
			(xy 11.969103 -8.857086) (xy 12.389854 -8.259665) (xy 12.780783 -7.642319) (xy 13.14095 -7.006535)
			(xy 13.469487 -6.353843) (xy 13.765602 -5.685817) (xy 14.028582 -5.004067) (xy 14.257792 -4.310233)
			(xy 14.452682 -3.605989) (xy 14.612782 -2.89303) (xy 14.737705 -2.173074) (xy 14.827151 -1.447855)
			(xy 14.880904 -0.719122) (xy 14.898836 0.011372) (xy 14.880904 0.741865) (xy 14.827151 1.470599)
			(xy 14.737705 2.195818) (xy 14.612781 2.915774) (xy 14.452682 3.628733) (xy 14.257792 4.332977) (xy 14.028581 5.02681)
			(xy 13.765602 5.708561) (xy 13.469487 6.376587) (xy 13.14095 7.029278) (xy 12.780783 7.665063) (xy 12.389853 8.282409)
			(xy 11.969103 8.879829) (xy 11.519545 9.455885) (xy 11.042263 10.009188) (xy 10.538406 10.538405)
			(xy 10.009189 11.042262) (xy 9.455886 11.519544) (xy 8.87983 11.969102) (xy 8.28241 12.389852) (xy 7.665064 12.780782)
			(xy 7.029279 13.140949) (xy 6.376588 13.469486) (xy 5.708562 13.765601) (xy 5.026811 14.02858) (xy 4.332978 14.257791)
			(xy 3.628733 14.452681) (xy 2.915774 14.61278) (xy 2.195819 14.737703) (xy 1.4706 14.827149) (xy 0.741866 14.880903)
			(xy 0.011373 14.898834) (xy 0.011373 19.874241) (xy 0.986001 19.850325) (xy 1.958281 19.778615) (xy 2.925871 19.659283)
			(xy 3.886441 19.492616) (xy 4.837675 19.279017) (xy 5.777283 19.018999) (xy 6.703 18.71319) (xy 7.612596 18.362326)
			(xy 8.503881 17.967252) (xy 9.374706 17.52892) (xy 10.222974 17.048386) (xy 11.046641 16.526808)
			(xy 11.843723 15.965442) (xy 12.6123 15.365641) (xy 13.350519 14.72885) (xy 14.056603 14.056602)
			(xy 14.728851 13.350518) (xy 15.365642 12.612299) (xy 15.965443 11.843722) (xy 16.526809 11.04664)
			(xy 17.048387 10.222973) (xy 17.528921 9.374705) (xy 17.967253 8.50388) (xy 18.362327 7.612595) (xy 18.713191 6.702999)
			(xy 19.019001 5.777282) (xy 19.279018 4.837674) (xy 19.492617 3.88644) (xy 19.659284 2.92587) (xy 19.778616 1.95828)
			(xy 19.850327 0.986) (xy 19.874243 0.011372) (xy 19.850302 -0.963239) (xy 19.778569 -1.935502) (xy 19.659215 -2.903073)
			(xy 19.492529 -3.863623) (xy 19.278912 -4.814837) (xy 19.018879 -5.754423) (xy 18.713056 -6.680119)
			(xy 18.362179 -7.589693) (xy 17.967095 -8.480955) (xy 17.528754 -9.351758) (xy 17.048213 -10.200003)
			(xy 16.52663 -11.023648) (xy 15.965261 -11.820708) (xy 15.365458 -12.589263) (xy 14.728667 -13.327462)
			(xy 14.056421 -14.033525) (xy 13.35034 -14.705752) (xy 12.612125 -15.342525) (xy 11.843555 -15.942307)
			(xy 11.04648 -16.503656) (xy 10.222822 -17.025218) (xy 9.374564 -17.505736) (xy 8.503749 -17.944054)
			(xy 7.612477 -18.339116) (xy 6.702893 -18.689969) (xy 5.77719 -18.995768) (xy 4.837597 -19.255777)
			(xy 3.886378 -19.469369) (xy 2.925824 -19.63603) (xy 1.958249 -19.755359) (xy 0.985985 -19.827067)
			(xy 0.011373 -19.850982)
		)
		(stroke
			(width 0.074672)
			(type solid)
		)
		(fill solid)
		(layer "B.Mask")
		(uuid "614f4487-b2da-4fce-b278-b41e4e5f243d")
	)
	(fp_poly
		(pts
			(xy 1.204064 -13.945399) (xy 0.459996 -13.530661) (xy -0.252178 -13.063282) (xy -1.010991 -12.483142)
			(xy -1.739012 -11.863524) (xy -2.45256 -11.226702) (xy -3.262576 -10.501985) (xy -4.06771 -9.772059)
			(xy -4.858615 -9.026836) (xy -5.632118 -8.251884) (xy -6.376431 -7.448891) (xy -7.08608 -6.61567)
			(xy -7.755596 -5.750034) (xy -8.482313 -4.68779) (xy -9.129247 -3.575517) (xy -9.678854 -2.414655)
			(xy -10.113592 -1.206642) (xy -10.363623 -0.229259) (xy -10.529587 0.765848) (xy -10.587465 1.085725)
			(xy -10.65051 1.370462) (xy -10.780734 1.616959) (xy -11.121282 1.962157) (xy -11.353309 2.147676)
			(xy -11.909864 2.579174) (xy -12.531412 3.104017) (xy -13.141314 3.642675) (xy -14.01878 4.400768)
			(xy -14.172775 4.533057) (xy -13.313913 6.551541) (xy -13.308233 6.563941) (xy -13.123638 6.92531)
			(xy -12.907885 7.269142) (xy -12.199257 8.452198) (xy -12.182204 8.478558) (xy -11.531762 9.346422)
			(xy -10.820013 10.16476) (xy -10.784873 10.20507) (xy -9.778361 11.179309) (xy -8.803523 11.960753)
			(xy -7.969412 12.536535) (xy -7.385082 12.893792) (xy -7.131195 13.017155) (xy -5.393469 13.855495)
			(xy -4.824785 14.074293) (xy -3.196708 14.537629) (xy -1.878213 14.76733) (xy -1.012345 14.86319)
			(xy -1.012345 12.997154) (xy -1.359094 12.437499) (xy -2.001361 11.907622) (xy -2.702165 11.441177)
			(xy -3.374395 10.804233) (xy -3.902774 10.039093) (xy -4.291732 9.191185) (xy -4.597589 8.080399)
			(xy -4.665842 6.951135) (xy -4.418339 5.848754) (xy -4.219901 5.532494) (xy -3.869018 5.022447) (xy -3.424827 4.245766)
			(xy -3.17242 3.399807) (xy -3.18844 2.441726) (xy -3.19624 1.135863) (xy -3.29184 0.946727) (xy -3.481492 0.851127)
			(xy -3.651508 0.865597) (xy -3.805503 0.942597) (xy -4.051483 1.183409) (xy -4.779087 1.880008) (xy -5.76094 2.275849)
			(xy -6.82134 2.117719) (xy -7.079722 1.888276) (xy -7.185659 1.563231) (xy -7.054918 1.221133) (xy -6.805837 0.945698)
			(xy -6.346134 0.416674) (xy -5.950592 -0.162245) (xy -5.428143 -1.191123) (xy -5.029718 -2.274778)
			(xy -4.710691 -3.179338) (xy -4.110753 -3.904764) (xy -3.294369 -4.386996) (xy -2.326007 -4.561976)
			(xy -1.281044 -4.356346) (xy -0.420651 -3.794607) (xy 0.172163 -2.959487) (xy 0.414394 -1.933713)
			(xy 0.452477 -1.196805) (xy 0.454184 -0.574623) (xy 0.308456 0.281656) (xy 0.262466 0.534353) (xy 0.160147 1.202013)
			(xy 0.110537 1.881558) (xy 0.134307 2.416926) (xy 0.211307 2.93524) (xy 0.396825 3.613235) (xy 0.572008 4.04525)
			(xy 0.749258 4.390965) (xy 0.967333 4.824531) (xy 1.201944 5.207453) (xy 1.609154 5.734553) (xy 1.934716 6.062698)
			(xy 2.688158 6.592898) (xy 3.147562 6.790302) (xy 3.575442 6.910708) (xy 4.229666 7.011477) (xy 5.013597 7.015577)
			(xy 5.59289 6.944777) (xy 6.13601 6.823337) (xy 6.780415 6.61043) (xy 7.351439 6.354115) (xy 8.257844 5.797043)
			(xy 8.834553 5.305084) (xy 9.302225 4.799171) (xy 9.564224 4.461207) (xy 9.876867 3.988368) (xy 10.170905 3.443182)
			(xy 10.402933 2.904713) (xy 10.563646 2.423089) (xy 10.663899 2.121299) (xy 10.789989 1.602984) (xy 10.833399 1.172519)
			(xy 10.844249 0.47127) (xy 10.232215 0.214033) (xy 9.695482 -0.176752) (xy 9.13492 -0.847232) (xy 8.682624 -1.603022)
			(xy 8.244469 -2.392031) (xy 7.806868 -3.18148) (xy 7.363842 -3.967735) (xy 6.814164 -4.898512) (xy 6.219725 -5.800699)
			(xy 5.568457 -6.6415) (xy 4.844099 -7.419721) (xy 4.057007 -8.103963) (xy 3.184769 -8.672358) (xy 2.124805 -9.116614)
			(xy 0.998339 -9.343118) (xy 0.800418 -9.359138) (xy 0.775467 -10.178114) (xy 0.828838 -10.99573)
			(xy 0.957542 -11.852727) (xy 1.097555 -12.708287) (xy 1.204009 -13.945421) (xy 1.204064 -13.945399)
		)
		(stroke
			(width 0)
			(type solid)
		)
		(fill solid)
		(layer "F.Mask")
		(uuid "686cde2a-1253-4840-9e58-06f74fde3a96")
	)
	(fp_poly
		(pts
			(xy 0.011373 -19.850982) (xy -0.963222 -19.827042) (xy -1.935469 -19.755311) (xy -2.903024 -19.635961)
			(xy -3.863559 -19.469281) (xy -4.814757 -19.255671) (xy -5.754329 -18.995646) (xy -6.680011 -18.689832)
			(xy -7.589573 -18.338967) (xy -8.480823 -17.943895) (xy -9.351614 -17.505569) (xy -10.19985 -17.025043)
			(xy -11.023486 -16.503476) (xy -11.820539 -15.942124) (xy -12.589087 -15.34234) (xy -13.327281 -14.705568)
			(xy -14.033341 -14.033342) (xy -14.705567 -13.327282) (xy -15.342339 -12.589088) (xy -15.942123 -11.82054)
			(xy -16.503475 -11.023487) (xy -17.025042 -10.199851) (xy -17.505567 -9.351615) (xy -17.943894 -8.480824)
			(xy -18.338966 -7.589573) (xy -18.689831 -6.680012) (xy -18.995644 -5.75433) (xy -19.255669 -4.814758)
			(xy -19.469279 -3.863559) (xy -19.63596 -2.903025) (xy -19.755309 -1.935469) (xy -19.82704 -0.963223)
			(xy -19.85098 0.011372) (xy -19.827065 0.985984) (xy -19.755357 1.958248) (xy -19.636028 2.925823)
			(xy -19.469367 3.886377) (xy -19.255775 4.837596) (xy -18.995766 5.777189) (xy -18.689967 6.702892)
			(xy -18.339114 7.612476) (xy -17.944052 8.503748) (xy -17.505734 9.374562) (xy -17.025216 10.22282)
			(xy -16.503654 11.046479) (xy -15.942306 11.843553) (xy -15.342523 12.612124) (xy -14.705751 13.350339)
			(xy -14.033523 14.056419) (xy -13.32746 14.728665) (xy -12.589262 15.365457) (xy -11.820707 15.965259)
			(xy -11.023647 16.526628) (xy -10.200002 17.048212) (xy -9.351756 17.528752) (xy -8.480954 17.967093)
			(xy -7.589692 18.362177) (xy -6.680117 18.713054) (xy -5.754422 19.018877) (xy -4.814836 19.278911)
			(xy -3.863622 19.492528) (xy -2.903072 19.659214) (xy -1.935501 19.778567) (xy -0.963238 19.850301)
			(xy 0.011373 19.874241) (xy 0.011373 14.898834) (xy -0.719121 14.880903) (xy -1.447854 14.827149)
			(xy -2.173073 14.737703) (xy -2.893029 14.61278) (xy -3.605988 14.452681) (xy -4.310232 14.257791)
			(xy -5.004066 14.02858) (xy -5.685816 13.765601) (xy -6.353842 13.469486) (xy -7.006533 13.140949)
			(xy -7.642318 12.780782) (xy -8.259664 12.389852) (xy -8.857085 11.969102) (xy -9.43314 11.519544)
			(xy -9.986443 11.042262) (xy -10.51566 10.538405) (xy -11.019517 10.009188) (xy -11.496799 9.455885)
			(xy -11.946357 8.879829) (xy -12.367108 8.282409) (xy -12.758037 7.665063) (xy -13.118204 7.029278)
			(xy -13.446741 6.376587) (xy -13.742856 5.708561) (xy -14.005836 5.02681) (xy -14.235046 4.332977)
			(xy -14.429936 3.628733) (xy -14.590036 2.915774) (xy -14.714959 2.195818) (xy -14.804405 1.470599)
			(xy -14.858159 0.741865) (xy -14.87609 0.011372) (xy -14.858159 -0.719122) (xy -14.804405 -1.447855)
			(xy -14.714959 -2.173074) (xy -14.590036 -2.89303) (xy -14.429937 -3.605989) (xy -14.235047 -4.310233)
			(xy -14.005836 -5.004067) (xy -13.742856 -5.685817) (xy -13.446741 -6.353843) (xy -13.118205 -7.006535)
			(xy -12.758038 -7.642319) (xy -12.367108 -8.259665) (xy -11.946357 -8.857086) (xy -11.496799 -9.433142)
			(xy -11.019517 -9.986444) (xy -10.515661 -10.515662) (xy -9.986443 -11.019518) (xy -9.433141 -11.4968)
			(xy -8.857085 -11.946358) (xy -8.259664 -12.367109) (xy -7.642318 -12.758039) (xy -7.006534 -13.118206)
			(xy -6.353842 -13.446743) (xy -5.685817 -13.742857) (xy -5.004066 -14.005837) (xy -4.310232 -14.235048)
			(xy -3.605988 -14.429938) (xy -2.893029 -14.590037) (xy -2.173073 -14.71496) (xy -1.447855 -14.804407)
			(xy -0.719121 -14.85816) (xy 0.011373 -14.876091) (xy 0.741866 -14.85816) (xy 1.4706 -14.804407)
			(xy 2.195819 -14.71496) (xy 2.915775 -14.590037) (xy 3.628734 -14.429938) (xy 4.332978 -14.235048)
			(xy 5.026811 -14.005837) (xy 5.708562 -13.742857) (xy 6.376588 -13.446743) (xy 7.029279 -13.118206)
			(xy 7.665064 -12.758039) (xy 8.28241 -12.367109) (xy 8.879831 -11.946358) (xy 9.455886 -11.4968)
			(xy 10.009189 -11.019518) (xy 10.538406 -10.515662) (xy 11.042263 -9.986444) (xy 11.519545 -9.433142)
			(xy 11.969103 -8.857086) (xy 12.389854 -8.259665) (xy 12.780783 -7.642319) (xy 13.14095 -7.006535)
			(xy 13.469487 -6.353843) (xy 13.765602 -5.685817) (xy 14.028582 -5.004067) (xy 14.257792 -4.310233)
			(xy 14.452682 -3.605989) (xy 14.612782 -2.89303) (xy 14.737705 -2.173074) (xy 14.827151 -1.447855)
			(xy 14.880904 -0.719122) (xy 14.898836 0.011372) (xy 14.880904 0.741865) (xy 14.827151 1.470599)
			(xy 14.737705 2.195818) (xy 14.612781 2.915774) (xy 14.452682 3.628733) (xy 14.257792 4.332977) (xy 14.028581 5.02681)
			(xy 13.765602 5.708561) (xy 13.469487 6.376587) (xy 13.14095 7.029278) (xy 12.780783 7.665063) (xy 12.389853 8.282409)
			(xy 11.969103 8.879829) (xy 11.519545 9.455885) (xy 11.042263 10.009188) (xy 10.538406 10.538405)
			(xy 10.009189 11.042262) (xy 9.455886 11.519544) (xy 8.87983 11.969102) (xy 8.28241 12.389852) (xy 7.665064 12.780782)
			(xy 7.029279 13.140949) (xy 6.376588 13.469486) (xy 5.708562 13.765601) (xy 5.026811 14.02858) (xy 4.332978 14.257791)
			(xy 3.628733 14.452681) (xy 2.915774 14.61278) (xy 2.195819 14.737703) (xy 1.4706 14.827149) (xy 0.741866 14.880903)
			(xy 0.011373 14.898834) (xy 0.011373 19.874241) (xy 0.986001 19.850325) (xy 1.958281 19.778615) (xy 2.925871 19.659283)
			(xy 3.886441 19.492616) (xy 4.837675 19.279017) (xy 5.777283 19.018999) (xy 6.703 18.71319) (xy 7.612596 18.362326)
			(xy 8.503881 17.967252) (xy 9.374706 17.52892) (xy 10.222974 17.048386) (xy 11.046641 16.526808)
			(xy 11.843723 15.965442) (xy 12.6123 15.365641) (xy 13.350519 14.72885) (xy 14.056603 14.056602)
			(xy 14.728851 13.350518) (xy 15.365642 12.612299) (xy 15.965443 11.843722) (xy 16.526809 11.04664)
			(xy 17.048387 10.222973) (xy 17.528921 9.374705) (xy 17.967253 8.50388) (xy 18.362327 7.612595) (xy 18.713191 6.702999)
			(xy 19.019001 5.777282) (xy 19.279018 4.837674) (xy 19.492617 3.88644) (xy 19.659284 2.92587) (xy 19.778616 1.95828)
			(xy 19.850327 0.986) (xy 19.874243 0.011372) (xy 19.850302 -0.963239) (xy 19.778569 -1.935502) (xy 19.659215 -2.903073)
			(xy 19.492529 -3.863623) (xy 19.278912 -4.814837) (xy 19.018879 -5.754423) (xy 18.713056 -6.680119)
			(xy 18.362179 -7.589693) (xy 17.967095 -8.480955) (xy 17.528754 -9.351758) (xy 17.048213 -10.200003)
			(xy 16.52663 -11.023648) (xy 15.965261 -11.820708) (xy 15.365458 -12.589263) (xy 14.728667 -13.327462)
			(xy 14.056421 -14.033525) (xy 13.35034 -14.705752) (xy 12.612125 -15.342525) (xy 11.843555 -15.942307)
			(xy 11.04648 -16.503656) (xy 10.222822 -17.025218) (xy 9.374564 -17.505736) (xy 8.503749 -17.944054)
			(xy 7.612477 -18.339116) (xy 6.702893 -18.689969) (xy 5.77719 -18.995768) (xy 4.837597 -19.255777)
			(xy 3.886378 -19.469369) (xy 2.925824 -19.63603) (xy 1.958249 -19.755359) (xy 0.985985 -19.827067)
			(xy 0.011373 -19.850982)
		)
		(stroke
			(width 0.074672)
			(type solid)
		)
		(fill solid)
		(layer "F.Mask")
		(uuid "aab1d7f6-e4b7-4862-b81c-0b842bbf359c")
	)
	(fp_circle
		(center 0 0)
		(end 20 0)
		(stroke
			(width 0.12)
			(type default)
		)
		(fill none)
		(layer "Edge.Cuts")
		(uuid "dedb7711-b934-4961-ba10-274551970d64")
	)
	(pad "" smd custom
		(at 0.011372 -14.876091)
		(size 0.075 0.075)
		(layers "F.Cu")
		(zone_connect 0)
		(thermal_bridge_angle 90)
		(options
			(clearance outline)
			(anchor circle)
		)
		(primitives
			(gr_poly
				(pts
					(xy 0 0) (xy -1.05455 0.038146) (xy -2.103748 0.150894) (xy -2.127518 0.153991) (xy -3.168773 0.341784)
					(xy -4.194059 0.603059) (xy -5.200761 0.93841) (xy -6.181019 1.344615) (xy -6.186697 1.347197)
					(xy -7.121277 1.81547) (xy -8.020694 2.34817) (xy -8.073404 2.382276) (xy -8.910846 2.965351) (xy -9.706379 3.604424)
					(xy -9.785961 3.67367) (xy -10.524107 4.363345) (xy -11.213781 5.101491) (xy -11.283027 5.181073)
					(xy -11.9221 5.976606) (xy -12.505175 6.814048) (xy -12.539281 6.866757) (xy -13.071981 7.766174)
					(xy -13.540254 8.700754) (xy -13.542836 8.706433) (xy -13.949042 9.68669) (xy -14.284394 10.693391)
					(xy -14.545668 11.718677) (xy -14.733461 12.759932) (xy -14.736557 12.783703) (xy -14.849307 13.832901)
					(xy -14.887453 14.88745) (xy -14.849353 15.934987) (xy -14.73759 16.977245) (xy -14.730871 17.028921)
					(xy -14.546723 18.04447) (xy -14.292655 19.044819) (xy -14.269918 19.1213) (xy -14.167598 19.395186)
					(xy -14.030138 19.276846) (xy -13.152673 18.518754) (xy -12.542771 17.980096) (xy -11.921224 17.455252)
					(xy -11.364669 17.023754) (xy -11.132642 16.838235) (xy -10.792093 16.493037) (xy -10.661869 16.246541)
					(xy -10.598824 15.961803) (xy -10.540946 15.641926) (xy -10.374982 14.646819) (xy -10.124951 13.669436)
					(xy -9.690213 12.461423) (xy -9.140606 11.300561) (xy -8.493672 10.188289) (xy -7.766955 9.126046)
					(xy -7.097438 8.260409) (xy -6.387789 7.427187) (xy -5.643478 6.624194) (xy -4.869975 5.849242)
					(xy -4.079069 5.104019) (xy -3.273935 4.374093) (xy -2.46392 3.649376) (xy -1.750371 3.012554)
					(xy -1.02235 2.392936) (xy -0.263537 1.812796) (xy 0.448637 1.345416) (xy 1.192705 0.93068) (xy 1.086251 2.167814)
					(xy 0.946237 3.023374) (xy 0.817534 3.88037) (xy 0.764162 4.697985) (xy 0.789111 5.516963) (xy 0.987032 5.532983)
					(xy 2.113498 5.759487) (xy 3.173462 6.203743) (xy 4.045701 6.772139) (xy 4.832793 7.45638) (xy 5.557151 8.234602)
					(xy 6.208419 9.075402) (xy 6.802858 9.97759) (xy 7.352536 10.908366) (xy 7.795562 11.694621) (xy 8.233163 12.484069)
					(xy 8.671318 13.273079) (xy 9.123614 14.028868) (xy 9.684177 14.699348) (xy 10.220909 15.090134)
					(xy 10.832943 15.347371) (xy 10.822087 16.04862) (xy 10.778678 16.479084) (xy 10.652587 16.997398)
					(xy 10.552335 17.299189) (xy 10.391621 17.780813) (xy 10.159594 18.319282) (xy 9.865555 18.864468)
					(xy 9.552913 19.337308) (xy 9.290914 19.675271) (xy 8.823242 20.181185) (xy 8.246533 20.673144)
					(xy 7.340129 21.230215) (xy 6.769104 21.486531) (xy 6.124699 21.699437) (xy 5.581579 21.820877)
					(xy 5.002286 21.891674) (xy 4.218355 21.887537) (xy 3.564131 21.786768) (xy 3.136251 21.666362)
					(xy 2.676847 21.468958) (xy 1.923405 20.938758) (xy 1.597843 20.610612) (xy 1.190633 20.083514)
					(xy 0.956022 19.700591) (xy 0.737947 19.267025) (xy 0.560697 18.92131) (xy 0.385514 18.489296)
					(xy 0.199995 17.811301) (xy 0.122997 17.292986) (xy 0.099227 16.757618) (xy 0.148836 16.078073)
					(xy 0.251155 15.410413) (xy 0.297147 15.157716) (xy 0.442875 14.301437) (xy 0.441167 13.679255)
					(xy 0.403084 12.942347) (xy 0.160854 11.916573) (xy -0.43196 11.081453) (xy -1.292352 10.519714)
					(xy -2.337317 10.314083) (xy -3.305679 10.489063) (xy -4.122063 10.971295) (xy -4.722002 11.696721)
					(xy -5.041029 12.601283) (xy -5.439454 13.684938) (xy -5.961903 14.713815) (xy -6.357444 15.292734)
					(xy -6.817147 15.821758) (xy -7.066228 16.097193) (xy -7.196969 16.439291) (xy -7.091032 16.764336)
					(xy -6.83265 16.993779) (xy -5.77225 17.151909) (xy -4.790398 16.756068) (xy -4.062794 16.059469)
					(xy -3.816813 15.818658) (xy -3.662818 15.741659) (xy -3.492802 15.72719) (xy -3.30315 15.822791)
					(xy -3.207549 16.011927) (xy -3.199801 17.317791) (xy -3.183782 18.275871) (xy -3.436188 19.121831)
					(xy -3.88038 19.898512) (xy -4.231264 20.408558) (xy -4.429701 20.724817) (xy -4.677204 21.827199)
					(xy -4.608952 22.956462) (xy -4.303093 24.067249) (xy -3.914136 24.915157) (xy -3.385757 25.680297)
					(xy -2.713526 26.317241) (xy -2.357478 26.554222) (xy -2.357478 13.692186) (xy -2.451342 13.685542)
					(xy -2.542559 13.66583) (xy -2.618689 13.638386) (xy -2.677719 13.609291) (xy -2.74092 13.569244)
					(xy -2.808772 13.513495) (xy -2.873659 13.443073) (xy -2.920922 13.375431) (xy -2.962357 13.295649)
					(xy -2.981706 13.245713) (xy -2.998171 13.189258) (xy -3.012212 13.111481) (xy -3.016876 13.032795)
					(xy -3.011146 12.945021) (xy -3.001531 12.890289) (xy -2.984459 12.827582) (xy -2.963072 12.771044)
					(xy -2.929113 12.703432) (xy -2.882973 12.633952) (xy -2.814629 12.557114) (xy -2.754542 12.505817)
					(xy -2.681947 12.458123) (xy -2.614676 12.424938) (xy -2.557737 12.40385) (xy -2.451571 12.379549)
					(xy -2.400064 12.374234) (xy -2.357484 12.37288) (xy -2.357478 12.372887) (xy -2.278967 12.377513)
					(xy -2.231622 12.384885) (xy -2.147563 12.407009) (xy -2.061331 12.442984) (xy -1.965692 12.501874)
					(xy -1.912706 12.545508) (xy -1.841875 12.621254) (xy -1.808753 12.666566) (xy -1.767833 12.736876)
					(xy -1.738035 12.805814) (xy -1.715234 12.882321) (xy -1.698087 13.032794) (xy -1.718103 13.194567)
					(xy -1.735148 13.251191) (xy -1.787967 13.365269) (xy -1.828918 13.42702) (xy -1.923608 13.529286)
					(xy -2.002411 13.588469) (xy -2.075363 13.628916) (xy -2.167502 13.664378) (xy -2.252213 13.683812)
					(xy -2.357478 13.692186) (xy -2.357478 26.554222) (xy -2.012722 26.783686) (xy -1.370456 27.313563)
					(xy -1.023707 27.873218) (xy -1.023567 28.787465) (xy -1.023707 29.701531) (xy 0.000003 29.774911)
					(xy 1.05532 29.73708) (xy 2.1053 29.624532) (xy 2.127004 29.62195) (xy 3.16974 29.433268) (xy 4.19513 29.171267)
					(xy 5.199315 28.837081) (xy 6.178437 28.431842) (xy 6.189808 28.426677) (xy 7.123044 27.959088)
					(xy 8.02122 27.427254) (xy 8.073931 27.393148) (xy 8.911373 26.810073) (xy 9.706906 26.171001)
					(xy 9.786489 26.101754) (xy 10.524633 25.41208) (xy 11.214307 24.673935) (xy 11.283555 24.594353)
					(xy 11.922627 23.79882) (xy 12.505701 22.961377) (xy 12.539808 22.908668) (xy 13.071641 22.010491)
					(xy 13.539231 21.077255) (xy 13.544396 21.065885) (xy 13.949635 20.086762) (xy 14.283821 19.082577)
					(xy 14.545822 18.057188) (xy 14.734504 17.014452) (xy 14.737086 16.992749) (xy 14.849632 15.942768)
					(xy 14.887465 14.88745) (xy 14.879718 14.560338) (xy 14.868861 14.143827) (xy 14.829587 13.610525)
					(xy 14.815118 13.420874) (xy 14.657497 12.280477) (xy 14.413292 11.159809) (xy 14.084345 10.063637)
					(xy 13.672494 8.996728) (xy 13.179581 7.963851) (xy 12.607446 6.969772) (xy 11.957928 6.019258)
					(xy 11.543999 5.489058) (xy 11.508343 5.443066) (xy 11.505247 5.439969) (xy 11.04171 4.902534)
					(xy 11.030854 4.889614) (xy 11.030352 4.889113) (xy 10.527024 4.360464) (xy 9.999408 3.857652)
					(xy 9.997853 3.856649) (xy 9.965297 3.828744) (xy 9.448016 3.38226) (xy 9.44492 3.379677) (xy 9.401511 3.346087)
					(xy 8.868728 2.930092) (xy 7.859031 2.243532) (xy 6.800092 1.643887) (xy 5.697561 1.133499) (xy 4.557086 0.714706)
					(xy 3.384315 0.38985) (xy 2.184897 0.161269) (xy 1.466595 0.072902) (xy 1.337404 0.063086) (xy 0.733823 0.018128)
					(xy 0.730727 0.018128) (xy 0.000023 0.000041) (xy 0 0)
				)
				(width 0.075)
				(fill yes)
			)
		)
		(uuid "71cb33b1-551f-4c22-af98-34d5c6b714ec")
	)
	(pad "" smd custom
		(at 0.011372 -14.876091)
		(size 0.075 0.075)
		(layers "B.Cu")
		(zone_connect 0)
		(thermal_bridge_angle 90)
		(options
			(clearance outline)
			(anchor circle)
		)
		(primitives
			(gr_poly
				(pts
					(xy 0 0) (xy -1.05455 0.038146) (xy -2.103748 0.150894) (xy -2.127518 0.153991) (xy -3.168773 0.341784)
					(xy -4.194059 0.603059) (xy -5.200761 0.93841) (xy -6.181019 1.344615) (xy -6.186697 1.347197)
					(xy -7.121277 1.81547) (xy -8.020694 2.34817) (xy -8.073404 2.382276) (xy -8.910846 2.965351) (xy -9.706379 3.604424)
					(xy -9.785961 3.67367) (xy -10.524107 4.363345) (xy -11.213781 5.101491) (xy -11.283027 5.181073)
					(xy -11.9221 5.976606) (xy -12.505175 6.814048) (xy -12.539281 6.866757) (xy -13.071981 7.766174)
					(xy -13.540254 8.700754) (xy -13.542836 8.706433) (xy -13.949042 9.68669) (xy -14.284394 10.693391)
					(xy -14.545668 11.718677) (xy -14.733461 12.759932) (xy -14.736557 12.783703) (xy -14.849307 13.832901)
					(xy -14.887453 14.88745) (xy -14.849353 15.934987) (xy -14.73759 16.977245) (xy -14.730871 17.028921)
					(xy -14.546723 18.04447) (xy -14.292655 19.044819) (xy -14.269918 19.1213) (xy -14.167598 19.395186)
					(xy -14.030138 19.276846) (xy -13.152673 18.518754) (xy -12.542771 17.980096) (xy -11.921224 17.455252)
					(xy -11.364669 17.023754) (xy -11.132642 16.838235) (xy -10.792093 16.493037) (xy -10.661869 16.246541)
					(xy -10.598824 15.961803) (xy -10.540946 15.641926) (xy -10.374982 14.646819) (xy -10.124951 13.669436)
					(xy -9.690213 12.461423) (xy -9.140606 11.300561) (xy -8.493672 10.188289) (xy -7.766955 9.126046)
					(xy -7.097438 8.260409) (xy -6.387789 7.427187) (xy -5.643478 6.624194) (xy -4.869975 5.849242)
					(xy -4.079069 5.104019) (xy -3.273935 4.374093) (xy -2.46392 3.649376) (xy -1.750371 3.012554)
					(xy -1.02235 2.392936) (xy -0.263537 1.812796) (xy 0.448637 1.345416) (xy 1.192705 0.93068) (xy 1.086251 2.167814)
					(xy 0.946237 3.023374) (xy 0.817534 3.88037) (xy 0.764162 4.697985) (xy 0.789111 5.516963) (xy 0.987032 5.532983)
					(xy 2.113498 5.759487) (xy 3.173462 6.203743) (xy 4.045701 6.772139) (xy 4.832793 7.45638) (xy 5.557151 8.234602)
					(xy 6.208419 9.075402) (xy 6.802858 9.97759) (xy 7.352536 10.908366) (xy 7.795562 11.694621) (xy 8.233163 12.484069)
					(xy 8.671318 13.273079) (xy 9.123614 14.028868) (xy 9.684177 14.699348) (xy 10.220909 15.090134)
					(xy 10.832943 15.347371) (xy 10.822087 16.04862) (xy 10.778678 16.479084) (xy 10.652587 16.997398)
					(xy 10.552335 17.299189) (xy 10.391621 17.780813) (xy 10.159594 18.319282) (xy 9.865555 18.864468)
					(xy 9.552913 19.337308) (xy 9.290914 19.675271) (xy 8.823242 20.181185) (xy 8.246533 20.673144)
					(xy 7.340129 21.230215) (xy 6.769104 21.486531) (xy 6.124699 21.699437) (xy 5.581579 21.820877)
					(xy 5.002286 21.891674) (xy 4.218355 21.887537) (xy 3.564131 21.786768) (xy 3.136251 21.666362)
					(xy 2.676847 21.468958) (xy 1.923405 20.938758) (xy 1.597843 20.610612) (xy 1.190633 20.083514)
					(xy 0.956022 19.700591) (xy 0.737947 19.267025) (xy 0.560697 18.92131) (xy 0.385514 18.489296)
					(xy 0.199995 17.811301) (xy 0.122997 17.292986) (xy 0.099227 16.757618) (xy 0.148836 16.078073)
					(xy 0.251155 15.410413) (xy 0.297147 15.157716) (xy 0.442875 14.301437) (xy 0.441167 13.679255)
					(xy 0.403084 12.942347) (xy 0.160854 11.916573) (xy -0.43196 11.081453) (xy -1.292352 10.519714)
					(xy -2.337317 10.314083) (xy -3.305679 10.489063) (xy -4.122063 10.971295) (xy -4.722002 11.696721)
					(xy -5.041029 12.601283) (xy -5.439454 13.684938) (xy -5.961903 14.713815) (xy -6.357444 15.292734)
					(xy -6.817147 15.821758) (xy -7.066228 16.097193) (xy -7.196969 16.439291) (xy -7.091032 16.764336)
					(xy -6.83265 16.993779) (xy -5.77225 17.151909) (xy -4.790398 16.756068) (xy -4.062794 16.059469)
					(xy -3.816813 15.818658) (xy -3.662818 15.741659) (xy -3.492802 15.72719) (xy -3.30315 15.822791)
					(xy -3.207549 16.011927) (xy -3.199801 17.317791) (xy -3.183782 18.275871) (xy -3.436188 19.121831)
					(xy -3.88038 19.898512) (xy -4.231264 20.408558) (xy -4.429701 20.724817) (xy -4.677204 21.827199)
					(xy -4.608952 22.956462) (xy -4.303093 24.067249) (xy -3.914136 24.915157) (xy -3.385757 25.680297)
					(xy -2.713526 26.317241) (xy -2.357478 26.554222) (xy -2.357478 13.692186) (xy -2.451342 13.685542)
					(xy -2.542559 13.66583) (xy -2.618689 13.638386) (xy -2.677719 13.609291) (xy -2.74092 13.569244)
					(xy -2.808772 13.513495) (xy -2.873659 13.443073) (xy -2.920922 13.375431) (xy -2.962357 13.295649)
					(xy -2.981706 13.245713) (xy -2.998171 13.189258) (xy -3.012212 13.111481) (xy -3.016876 13.032795)
					(xy -3.011146 12.945021) (xy -3.001531 12.890289) (xy -2.984459 12.827582) (xy -2.963072 12.771044)
					(xy -2.929113 12.703432) (xy -2.882973 12.633952) (xy -2.814629 12.557114) (xy -2.754542 12.505817)
					(xy -2.681947 12.458123) (xy -2.614676 12.424938) (xy -2.557737 12.40385) (xy -2.451571 12.379549)
					(xy -2.400064 12.374234) (xy -2.357484 12.37288) (xy -2.357478 12.372887) (xy -2.278967 12.377513)
					(xy -2.231622 12.384885) (xy -2.147563 12.407009) (xy -2.061331 12.442984) (xy -1.965692 12.501874)
					(xy -1.912706 12.545508) (xy -1.841875 12.621254) (xy -1.808753 12.666566) (xy -1.767833 12.736876)
					(xy -1.738035 12.805814) (xy -1.715234 12.882321) (xy -1.698087 13.032794) (xy -1.718103 13.194567)
					(xy -1.735148 13.251191) (xy -1.787967 13.365269) (xy -1.828918 13.42702) (xy -1.923608 13.529286)
					(xy -2.002411 13.588469) (xy -2.075363 13.628916) (xy -2.167502 13.664378) (xy -2.252213 13.683812)
					(xy -2.357478 13.692186) (xy -2.357478 26.554222) (xy -2.012722 26.783686) (xy -1.370456 27.313563)
					(xy -1.023707 27.873218) (xy -1.023567 28.787465) (xy -1.023707 29.701531) (xy 0.000003 29.774911)
					(xy 1.05532 29.73708) (xy 2.1053 29.624532) (xy 2.127004 29.62195) (xy 3.16974 29.433268) (xy 4.19513 29.171267)
					(xy 5.199315 28.837081) (xy 6.178437 28.431842) (xy 6.189808 28.426677) (xy 7.123044 27.959088)
					(xy 8.02122 27.427254) (xy 8.073931 27.393148) (xy 8.911373 26.810073) (xy 9.706906 26.171001)
					(xy 9.786489 26.101754) (xy 10.524633 25.41208) (xy 11.214307 24.673935) (xy 11.283555 24.594353)
					(xy 11.922627 23.79882) (xy 12.505701 22.961377) (xy 12.539808 22.908668) (xy 13.071641 22.010491)
					(xy 13.539231 21.077255) (xy 13.544396 21.065885) (xy 13.949635 20.086762) (xy 14.283821 19.082577)
					(xy 14.545822 18.057188) (xy 14.734504 17.014452) (xy 14.737086 16.992749) (xy 14.849632 15.942768)
					(xy 14.887465 14.88745) (xy 14.879718 14.560338) (xy 14.868861 14.143827) (xy 14.829587 13.610525)
					(xy 14.815118 13.420874) (xy 14.657497 12.280477) (xy 14.413292 11.159809) (xy 14.084345 10.063637)
					(xy 13.672494 8.996728) (xy 13.179581 7.963851) (xy 12.607446 6.969772) (xy 11.957928 6.019258)
					(xy 11.543999 5.489058) (xy 11.508343 5.443066) (xy 11.505247 5.439969) (xy 11.04171 4.902534)
					(xy 11.030854 4.889614) (xy 11.030352 4.889113) (xy 10.527024 4.360464) (xy 9.999408 3.857652)
					(xy 9.997853 3.856649) (xy 9.965297 3.828744) (xy 9.448016 3.38226) (xy 9.44492 3.379677) (xy 9.401511 3.346087)
					(xy 8.868728 2.930092) (xy 7.859031 2.243532) (xy 6.800092 1.643887) (xy 5.697561 1.133499) (xy 4.557086 0.714706)
					(xy 3.384315 0.38985) (xy 2.184897 0.161269) (xy 1.466595 0.072902) (xy 1.337404 0.063086) (xy 0.733823 0.018128)
					(xy 0.730727 0.018128) (xy 0.000023 0.000041) (xy 0 0)
				)
				(width 0.075)
				(fill yes)
			)
		)
		(uuid "811b20d8-9cb2-4325-84aa-d0633426e75a")
	)
)
