(footprint "OLED-SSD1306"
	(version 20240108)
	(generator "pcbnew")
	(generator_version "8.0")
	(layer "F.Cu")
	(descr "0.91-inch OLED Display SSD1306 128×32 I2C Module")
	(tags "oled ssd1306 0.91 128x32")
	(property "Reference" "REF**"
		(at 2.5 0 90)
		(layer "F.SilkS")
		(uuid "f2b54470-c210-48e0-af04-601bc8f080b6")
		(effects
			(font
				(size 1 1)
				(thickness 0.15)
			)
		)
	)
	(property "Value" "OLED-SSD1306"
		(at 19 0 0)
		(layer "F.Fab")
		(uuid "d53e0302-0db9-4055-a945-e949bb69a01a")
		(effects
			(font
				(size 1 1)
				(thickness 0.15)
			)
		)
	)
	(property "Footprint" ""
		(at 0 0 0)
		(layer "F.Fab")
		(hide yes)
		(uuid "92755ea4-b147-40d5-9c2d-836ce3c05b69")
		(effects
			(font
				(size 1.27 1.27)
				(thickness 0.15)
			)
		)
	)
	(property "Datasheet" ""
		(at 0 0 0)
		(layer "F.Fab")
		(hide yes)
		(uuid "1775402d-dd82-4c59-8ce5-b08c98fdaa54")
		(effects
			(font
				(size 1.27 1.27)
				(thickness 0.15)
			)
		)
	)
	(property "Description" ""
		(at 0 0 0)
		(layer "F.Fab")
		(hide yes)
		(uuid "482d7462-a89c-4793-8a4b-f4c361af612f")
		(effects
			(font
				(size 1.27 1.27)
				(thickness 0.15)
			)
		)
	)
	(attr through_hole)
	(fp_line
		(start -1.27 -5.08)
		(end 1.27 -5.08)
		(stroke
			(width 0.12)
			(type default)
		)
		(layer "F.SilkS")
		(uuid "dd7c848b-7c22-4c25-9b61-0ba3be9eb929")
	)
	(fp_line
		(start 1.27 -5.08)
		(end 1.27 5.08)
		(stroke
			(width 0.12)
			(type default)
		)
		(layer "F.SilkS")
		(uuid "5e494652-a50c-473c-992d-16e9e2ef3811")
	)
	(fp_line
		(start 1.27 5.08)
		(end -1.27 5.08)
		(stroke
			(width 0.12)
			(type default)
		)
		(layer "F.SilkS")
		(uuid "7337c951-f2bf-44bc-bc91-2aba06212b87")
	)
	(fp_rect
		(start -1.27 -6)
		(end 36.73 6)
		(stroke
			(width 0.12)
			(type default)
		)
		(fill none)
		(layer "F.SilkS")
		(uuid "69463d9e-8b0e-4fb7-adc7-a3e17bd64708")
	)
	(fp_line
		(start -1.8 -5.6)
		(end 1.75 -5.6)
		(stroke
			(width 0.05)
			(type solid)
		)
		(layer "F.CrtYd")
		(uuid "7fbbaabf-f9c9-4c65-84ac-eb48bbb94306")
	)
	(fp_line
		(start -1.8 5.6)
		(end -1.8 -5.6)
		(stroke
			(width 0.05)
			(type solid)
		)
		(layer "F.CrtYd")
		(uuid "59f28584-bc37-4ee4-9d8d-83313332dd22")
	)
	(fp_line
		(start 1.75 -5.6)
		(end 1.75 5.6)
		(stroke
			(width 0.05)
			(type solid)
		)
		(layer "F.CrtYd")
		(uuid "63d51db6-ac13-4c8e-a47e-37785e50651f")
	)
	(fp_line
		(start 1.75 5.6)
		(end -1.8 5.6)
		(stroke
			(width 0.05)
			(type solid)
		)
		(layer "F.CrtYd")
		(uuid "f7f34377-dc94-4e23-abc2-c9ec3682eb39")
	)
	(fp_text user "${REFERENCE}"
		(at 19 0 180)
		(layer "F.Fab")
		(uuid "12818457-a928-4a58-a768-32818fc42d8d")
		(effects
			(font
				(size 1 1)
				(thickness 0.15)
			)
		)
	)
	(pad "1" thru_hole rect
		(at 0 3.81)
		(size 1.7 1.7)
		(drill 1)
		(layers "*.Cu" "*.Mask")
		(remove_unused_layers no)
		(uuid "2e08a263-3e07-43ef-b8ac-536cb45b6165")
	)
	(pad "2" thru_hole oval
		(at 0 1.27)
		(size 1.7 1.7)
		(drill 1)
		(layers "*.Cu" "*.Mask")
		(remove_unused_layers no)
		(uuid "21d635ce-212a-436e-8900-6f95ebc71c55")
	)
	(pad "3" thru_hole oval
		(at 0 -1.27)
		(size 1.7 1.7)
		(drill 1)
		(layers "*.Cu" "*.Mask")
		(remove_unused_layers no)
		(uuid "4eed0372-d89a-4fec-bea1-b5660297ac7d")
	)
	(pad "4" thru_hole oval
		(at 0 -3.81)
		(size 1.7 1.7)
		(drill 1)
		(layers "*.Cu" "*.Mask")
		(remove_unused_layers no)
		(uuid "1f92a149-11c2-4b9c-9f4d-d30f134bf31d")
	)
	(model "${KICAD6_3DMODEL_DIR}/Connector_PinSocket_2.54mm.3dshapes/PinSocket_1x04_P2.54mm_Vertical.wrl"
		(offset
			(xyz 0 -3.81 0)
		)
		(scale
			(xyz 1 1 1)
		)
		(rotate
			(xyz 0 0 -180)
		)
	)
	(model "${KIPRJMOD}/kicad-library/3D/components.3dshapes/OLED-0.91-128x32.stp"
		(offset
			(xyz 17.55 0 9.75)
		)
		(scale
			(xyz 1 1 1)
		)
		(rotate
			(xyz 0 0 0)
		)
	)
)
