(footprint "Everlight_ITR9608-F"
	(version 20240108)
	(generator "pcbnew")
	(generator_version "8.0")
	(layer "F.Cu")
	(descr "Fork-type photointerrupter (https://everlighteurope.com/index.php?controller=attachment&id_attachment=5389)")
	(tags "Photointerrupter infrared LED")
	(property "Reference" "REF**"
		(at 0 0 180)
		(layer "F.SilkS")
		(uuid "f806185f-4e80-499e-ae24-59b8e7dab5a0")
		(effects
			(font
				(size 1 1)
				(thickness 0.15)
			)
		)
	)
	(property "Value" "Everlight_ITR9608-F"
		(at 0 4.5 0)
		(layer "F.Fab")
		(uuid "1140ded1-478a-46e3-a57f-d6dfa84d3d6e")
		(effects
			(font
				(size 1 1)
				(thickness 0.15)
			)
		)
	)
	(property "Footprint" ""
		(at 0 0 0)
		(layer "F.Fab")
		(hide yes)
		(uuid "86d1152c-1fd4-4c35-b412-fa68026720da")
		(effects
			(font
				(size 1.27 1.27)
				(thickness 0.15)
			)
		)
	)
	(property "Datasheet" ""
		(at 0 0 0)
		(layer "F.Fab")
		(hide yes)
		(uuid "52745890-6c46-43e8-aec7-fc431e2db317")
		(effects
			(font
				(size 1.27 1.27)
				(thickness 0.15)
			)
		)
	)
	(property "Description" ""
		(at 0 0 0)
		(layer "F.Fab")
		(hide yes)
		(uuid "0e456a43-12c0-48af-82ea-ad8232e7e931")
		(effects
			(font
				(size 1.27 1.27)
				(thickness 0.15)
			)
		)
	)
	(attr through_hole)
	(fp_line
		(start -6.88 -3.38)
		(end -6.88 -1.5)
		(stroke
			(width 0.12)
			(type solid)
		)
		(layer "F.SilkS")
		(uuid "fde509a4-f254-4a52-87fb-d3e5341c1b19")
	)
	(fp_line
		(start -6.88 -3.38)
		(end -5 -3.38)
		(stroke
			(width 0.12)
			(type solid)
		)
		(layer "F.SilkS")
		(uuid "1a612da1-38b2-4c08-91ad-65d89acdfd86")
	)
	(fp_line
		(start -6.62 -3.12)
		(end 6.62 -3.12)
		(stroke
			(width 0.12)
			(type solid)
		)
		(layer "F.SilkS")
		(uuid "4cf5a4f7-5cd0-48be-ae00-b66c50f4118e")
	)
	(fp_line
		(start -6.62 3.12)
		(end -6.62 -3.12)
		(stroke
			(width 0.12)
			(type solid)
		)
		(layer "F.SilkS")
		(uuid "2f8d5270-8d16-4fb3-b969-75484fe33950")
	)
	(fp_line
		(start -3.7 -0.5)
		(end -3.2 0.5)
		(stroke
			(width 0.12)
			(type solid)
		)
		(layer "F.SilkS")
		(uuid "d8f44f33-c1f1-46b8-a486-8777c2a77c98")
	)
	(fp_line
		(start -3.2 -0.5)
		(end -3.2 -1.5)
		(stroke
			(width 0.12)
			(type solid)
		)
		(layer "F.SilkS")
		(uuid "86e8648b-9083-47a0-b776-c12481e72b21")
	)
	(fp_line
		(start -3.2 0.5)
		(end -3.2 1.5)
		(stroke
			(width 0.12)
			(type solid)
		)
		(layer "F.SilkS")
		(uuid "0bcc70ca-3d42-43a8-ad0d-ae4656fd210e")
	)
	(fp_line
		(start -3.2 0.5)
		(end -2.7 -0.5)
		(stroke
			(width 0.12)
			(type solid)
		)
		(layer "F.SilkS")
		(uuid "87b2e310-4b62-443f-8a8a-991ce2039a5f")
	)
	(fp_line
		(start -2.7 -0.5)
		(end -3.7 -0.5)
		(stroke
			(width 0.12)
			(type solid)
		)
		(layer "F.SilkS")
		(uuid "b036b992-ca1d-491f-8ae3-5354acf0c963")
	)
	(fp_line
		(start -2.7 0.5)
		(end -3.7 0.5)
		(stroke
			(width 0.12)
			(type solid)
		)
		(layer "F.SilkS")
		(uuid "c2832a83-0ee9-44f2-9765-75c6d3fcf42d")
	)
	(fp_line
		(start -2.38 3.1)
		(end -2.38 -3.12)
		(stroke
			(width 0.12)
			(type solid)
		)
		(layer "F.SilkS")
		(uuid "3156fcad-e3cb-41b6-80c4-69f7b31d6379")
	)
	(fp_line
		(start 2.38 3.1)
		(end 2.38 -3.12)
		(stroke
			(width 0.12)
			(type solid)
		)
		(layer "F.SilkS")
		(uuid "ae963032-ff83-4ad5-bf60-192b2228d66a")
	)
	(fp_line
		(start 6.62 -3.12)
		(end 6.62 3.12)
		(stroke
			(width 0.12)
			(type solid)
		)
		(layer "F.SilkS")
		(uuid "3278ab69-f34a-4bf0-8774-685ecd150056")
	)
	(fp_line
		(start 6.62 3.12)
		(end -6.62 3.12)
		(stroke
			(width 0.12)
			(type solid)
		)
		(layer "F.SilkS")
		(uuid "31cbb4e1-301b-41e3-84aa-8889ec650a31")
	)
	(fp_circle
		(center 3.25 1.27)
		(end 3.55 1.27)
		(stroke
			(width 0.12)
			(type solid)
		)
		(fill solid)
		(layer "F.SilkS")
		(uuid "a78766ff-756c-4a91-a157-a3fb8e502469")
	)
	(fp_line
		(start -6.75 -3.25)
		(end 6.75 -3.25)
		(stroke
			(width 0.05)
			(type solid)
		)
		(layer "F.CrtYd")
		(uuid "4cf5a4f7-5cd0-48be-ae00-b66c50f4119e")
	)
	(fp_line
		(start -6.75 3.25)
		(end -6.75 -3.25)
		(stroke
			(width 0.05)
			(type solid)
		)
		(layer "F.CrtYd")
		(uuid "2f8d5270-8d16-4fb3-b969-75484fe33960")
	)
	(fp_line
		(start 6.75 -3.25)
		(end 6.75 3.25)
		(stroke
			(width 0.05)
			(type solid)
		)
		(layer "F.CrtYd")
		(uuid "3278ab69-f34a-4bf0-8774-685ecd150066")
	)
	(fp_line
		(start 6.75 3.25)
		(end -6.75 3.25)
		(stroke
			(width 0.05)
			(type solid)
		)
		(layer "F.CrtYd")
		(uuid "31cbb4e1-301b-41e3-84aa-8889ec650a41")
	)
	(fp_line
		(start -6.5 -2)
		(end -5.5 -3)
		(stroke
			(width 0.1)
			(type solid)
		)
		(layer "F.Fab")
		(uuid "4c1a692d-3932-4bd6-bf66-31be7866c06d")
	)
	(fp_line
		(start -6.5 3)
		(end -6.5 -2)
		(stroke
			(width 0.1)
			(type solid)
		)
		(layer "F.Fab")
		(uuid "2f8d5270-8d16-4fb3-b969-75484fe33940")
	)
	(fp_line
		(start -5.5 -3)
		(end 6.5 -3)
		(stroke
			(width 0.1)
			(type solid)
		)
		(layer "F.Fab")
		(uuid "4cf5a4f7-5cd0-48be-ae00-b66c50f4117e")
	)
	(fp_line
		(start -3.7 -0.5)
		(end -3.2 0.5)
		(stroke
			(width 0.1)
			(type solid)
		)
		(layer "F.Fab")
		(uuid "d8f44f33-c1f1-46b8-a486-8767c2a77c98")
	)
	(fp_line
		(start -3.2 -0.5)
		(end -3.2 -1.5)
		(stroke
			(width 0.1)
			(type solid)
		)
		(layer "F.Fab")
		(uuid "86e8648b-9083-47a0-b776-c11481e72b21")
	)
	(fp_line
		(start -3.2 0.5)
		(end -3.2 1.5)
		(stroke
			(width 0.1)
			(type solid)
		)
		(layer "F.Fab")
		(uuid "0bcc70ca-3d42-43a8-ad0d-ae4656ed210e")
	)
	(fp_line
		(start -3.2 0.5)
		(end -2.7 -0.5)
		(stroke
			(width 0.1)
			(type solid)
		)
		(layer "F.Fab")
		(uuid "87b2e310-4b62-443f-8a8a-990ce2039a5f")
	)
	(fp_line
		(start -2.7 -0.5)
		(end -3.7 -0.5)
		(stroke
			(width 0.1)
			(type solid)
		)
		(layer "F.Fab")
		(uuid "b036b992-ca1d-491f-8ae3-5344acf0c963")
	)
	(fp_line
		(start -2.7 0.5)
		(end -3.7 0.5)
		(stroke
			(width 0.1)
			(type solid)
		)
		(layer "F.Fab")
		(uuid "c2832a83-0ee9-44f2-9765-75b6d3fcf42d")
	)
	(fp_line
		(start -2.5 -3)
		(end -2.5 3)
		(stroke
			(width 0.1)
			(type solid)
		)
		(layer "F.Fab")
		(uuid "6f176ce3-114d-4804-b08d-bfff5991ede3")
	)
	(fp_line
		(start 2.5 -3)
		(end 2.5 3)
		(stroke
			(width 0.1)
			(type solid)
		)
		(layer "F.Fab")
		(uuid "5549bc7e-120d-463e-a2a2-cd01870a451d")
	)
	(fp_line
		(start 6.5 -3)
		(end 6.5 3)
		(stroke
			(width 0.1)
			(type solid)
		)
		(layer "F.Fab")
		(uuid "3278ab69-f34a-4bf0-8774-685ecd150046")
	)
	(fp_line
		(start 6.5 3)
		(end -6.5 3)
		(stroke
			(width 0.1)
			(type solid)
		)
		(layer "F.Fab")
		(uuid "31cbb4e1-301b-41e3-84aa-8889ec650a31")
	)
	(fp_text user "${REFERENCE}"
		(at 0 0 180)
		(layer "F.Fab")
		(uuid "8beaeb21-9d00-4bff-b7e0-c03af4c291e4")
		(effects
			(font
				(size 1 1)
				(thickness 0.15)
			)
		)
	)
	(pad "1" thru_hole roundrect
		(at -5 -1.27 90)
		(size 1.5 2)
		(drill 0.8)
		(layers "*.Cu" "*.Mask")
		(remove_unused_layers no)
		(roundrect_rratio 0.227)
		(uuid "7a426202-b7c7-4d3c-84a0-2fe4f627f7b5")
	)
	(pad "2" thru_hole oval
		(at -5 1.27 90)
		(size 1.5 2)
		(drill 0.8)
		(layers "*.Cu" "*.Mask")
		(remove_unused_layers no)
		(uuid "a5893954-f48f-4fca-8725-699a6344cdb1")
	)
	(pad "3" thru_hole oval
		(at 5 1.27 90)
		(size 1.5 2)
		(drill 0.8)
		(layers "*.Cu" "*.Mask")
		(remove_unused_layers no)
		(uuid "e8a63a6b-a3d7-4d9f-9310-5c9ab498e5d4")
	)
	(pad "4" thru_hole oval
		(at 5 -1.27 90)
		(size 1.5 2)
		(drill 0.8)
		(layers "*.Cu" "*.Mask")
		(remove_unused_layers no)
		(uuid "3bf26d1f-7328-40ae-aa59-add06202edf0")
	)
	(model "${KIPRJMOD}/kicad-library/3D/components.3dshapes/ITR9608.STEP"
		(offset
			(xyz 0 0 0)
		)
		(scale
			(xyz 1 1 1)
		)
		(rotate
			(xyz -90 0 0)
		)
	)
)
