(footprint "Pololu-DRV8835"
	(version 20240108)
	(generator "pcbnew")
	(generator_version "8.0")
	(layer "F.Cu")
	(property "Reference" "REF**"
		(at 0 3.81 0)
		(unlocked yes)
		(layer "F.SilkS")
		(uuid "76c493b5-b928-403c-809a-1265f514d954")
		(effects
			(font
				(size 1 1)
				(thickness 0.15)
			)
		)
	)
	(property "Value" "Pololu-DRV8835"
		(at 2 0 90)
		(unlocked yes)
		(layer "F.Fab")
		(uuid "917cbecd-fc0b-4924-8f09-7cfa8168eeb2")
		(effects
			(font
				(size 1 1)
				(thickness 0.15)
			)
		)
	)
	(property "Footprint" ""
		(at 0 0 0)
		(layer "F.Fab")
		(hide yes)
		(uuid "0cf6edfd-3ef2-48b5-b44a-0a00c1e8667c")
		(effects
			(font
				(size 1.27 1.27)
				(thickness 0.15)
			)
		)
	)
	(property "Datasheet" ""
		(at 0 0 0)
		(layer "F.Fab")
		(hide yes)
		(uuid "282e1177-08bf-468d-941d-d2b24a307cc1")
		(effects
			(font
				(size 1.27 1.27)
				(thickness 0.15)
			)
		)
	)
	(property "Description" ""
		(at 0 0 0)
		(layer "F.Fab")
		(hide yes)
		(uuid "c0fc7867-d977-4ef9-9e89-7e8344e9d850")
		(effects
			(font
				(size 1.27 1.27)
				(thickness 0.15)
			)
		)
	)
	(attr through_hole)
	(fp_rect
		(start -5.08 -8.89)
		(end 5.08 8.89)
		(stroke
			(width 0.127)
			(type default)
		)
		(fill none)
		(layer "F.SilkS")
		(uuid "43cd759e-b51e-45ac-8689-6f14b4e30a23")
	)
	(fp_rect
		(start -0.762 0.254)
		(end 0.762 2.286)
		(stroke
			(width 0.127)
			(type solid)
		)
		(fill solid)
		(layer "F.SilkS")
		(uuid "e47d0cbf-e8bf-4ec8-b791-caa56b844fc6")
	)
	(fp_circle
		(center -5.7 -7.62)
		(end -5.6 -7.62)
		(stroke
			(width 0.2)
			(type default)
		)
		(fill none)
		(layer "F.SilkS")
		(uuid "0737998c-ef2b-4908-a02c-a1da51dbf4c8")
	)
	(fp_rect
		(start -5.08 -8.89)
		(end -2.54 8.89)
		(stroke
			(width 0.05)
			(type default)
		)
		(fill none)
		(layer "F.CrtYd")
		(uuid "87d9baac-c730-45e1-b6ec-7845022bbaf1")
	)
	(fp_rect
		(start 2.54 -8.89)
		(end 5.08 8.89)
		(stroke
			(width 0.05)
			(type default)
		)
		(fill none)
		(layer "F.CrtYd")
		(uuid "1f60a017-54e3-4b3b-a741-93c31b30616b")
	)
	(fp_text user "DRV8835"
		(at -1.27 -5.08 90)
		(layer "F.SilkS")
		(uuid "b938b015-51b5-414d-bcfe-93b2518f4cb3")
		(effects
			(font
				(size 1 1)
				(thickness 0.15)
			)
		)
	)
	(fp_text user "${REFERENCE}"
		(at -1.5 -4.5 90)
		(unlocked yes)
		(layer "F.Fab")
		(uuid "ad87a374-425b-4bdd-84e3-ea778101840c")
		(effects
			(font
				(size 1 1)
				(thickness 0.15)
			)
		)
	)
	(pad "1" thru_hole rect
		(at -3.81 -7.62)
		(size 1.65 1.65)
		(drill 1.1)
		(layers "*.Cu" "*.Mask")
		(remove_unused_layers no)
		(uuid "effd33a9-f76a-49f9-bda3-faf3d66d459a")
	)
	(pad "2" thru_hole circle
		(at -3.81 -5.08)
		(size 1.65 1.65)
		(drill 1.1)
		(layers "*.Cu" "*.Mask")
		(remove_unused_layers no)
		(uuid "9f871168-3615-4774-add8-ea9697e97ef4")
	)
	(pad "3" thru_hole circle
		(at -3.81 -2.54)
		(size 1.65 1.65)
		(drill 1.1)
		(layers "*.Cu" "*.Mask")
		(remove_unused_layers no)
		(uuid "a1aefb67-dbb1-4869-8836-b2d1369835ad")
	)
	(pad "4" thru_hole circle
		(at -3.81 0)
		(size 1.65 1.65)
		(drill 1.1)
		(layers "*.Cu" "*.Mask")
		(remove_unused_layers no)
		(uuid "233d04b1-3ba6-47ee-abab-f7d0d1a8779d")
	)
	(pad "5" thru_hole circle
		(at -3.81 2.54)
		(size 1.65 1.65)
		(drill 1.1)
		(layers "*.Cu" "*.Mask")
		(remove_unused_layers no)
		(uuid "53b27aa8-89e2-44e3-972c-c2696d1e0526")
	)
	(pad "6" thru_hole circle
		(at -3.81 5.08)
		(size 1.65 1.65)
		(drill 1.1)
		(layers "*.Cu" "*.Mask")
		(remove_unused_layers no)
		(uuid "37b2a483-b5c8-4cef-9bab-ac13d3400cc4")
	)
	(pad "7" thru_hole circle
		(at -3.81 7.62)
		(size 1.65 1.65)
		(drill 1.1)
		(layers "*.Cu" "*.Mask")
		(remove_unused_layers no)
		(uuid "64dfe4ad-1852-4223-ad46-61992c5595c1")
	)
	(pad "8" thru_hole circle
		(at 3.81 7.62)
		(size 1.65 1.65)
		(drill 1.1)
		(layers "*.Cu" "*.Mask")
		(remove_unused_layers no)
		(uuid "2e55d1a9-06b1-4d13-8835-30d705a13200")
	)
	(pad "9" thru_hole circle
		(at 3.81 5.08)
		(size 1.65 1.65)
		(drill 1.1)
		(layers "*.Cu" "*.Mask")
		(remove_unused_layers no)
		(uuid "77efb880-87f5-40a5-bc0b-2f3a0d7b7344")
	)
	(pad "10" thru_hole circle
		(at 3.81 2.54)
		(size 1.65 1.65)
		(drill 1.1)
		(layers "*.Cu" "*.Mask")
		(remove_unused_layers no)
		(uuid "3120b93c-e695-48a5-a24c-a379efd933e3")
	)
	(pad "11" thru_hole circle
		(at 3.81 0)
		(size 1.65 1.65)
		(drill 1.1)
		(layers "*.Cu" "*.Mask")
		(remove_unused_layers no)
		(uuid "1bee3307-34d5-4079-bba1-c06969468cad")
	)
	(pad "12" thru_hole circle
		(at 3.81 -2.54)
		(size 1.65 1.65)
		(drill 1.1)
		(layers "*.Cu" "*.Mask")
		(remove_unused_layers no)
		(uuid "fe286b83-97fb-4491-908f-2fda12f073b6")
	)
	(pad "13" thru_hole circle
		(at 3.81 -5.08)
		(size 1.65 1.65)
		(drill 1.1)
		(layers "*.Cu" "*.Mask")
		(remove_unused_layers no)
		(uuid "9d771a6e-659a-445e-9b72-a437443820f0")
	)
	(pad "14" thru_hole rect
		(at 3.81 -7.62)
		(size 1.65 1.65)
		(drill 1.1)
		(layers "*.Cu" "*.Mask")
		(remove_unused_layers no)
		(uuid "d9337107-ee22-4036-8607-0c7e80b7b695")
	)
	(model ":KICAD7_3DMODEL_DIR:Connector_PinSocket_2.54mm.3dshapes/PinSocket_1x07_P2.54mm_Vertical.step"
		(offset
			(xyz -3.81 7.62 0)
		)
		(scale
			(xyz 1 1 1)
		)
		(rotate
			(xyz 0 0 0)
		)
	)
	(model ":KICAD7_3DMODEL_DIR:Connector_PinSocket_2.54mm.3dshapes/PinSocket_1x07_P2.54mm_Vertical.step"
		(offset
			(xyz 3.81 7.62 0)
		)
		(scale
			(xyz 1 1 1)
		)
		(rotate
			(xyz 0 0 0)
		)
	)
	(model ":KICAD7_3DMODEL_DIR:Connector_PinHeader_2.54mm.3dshapes/PinHeader_1x07_P2.54mm_Vertical.step"
		(offset
			(xyz -3.81 7.62 9.7)
		)
		(scale
			(xyz 1 1 1)
		)
		(rotate
			(xyz 0 -180 0)
		)
	)
	(model ":KICAD7_3DMODEL_DIR:Connector_PinHeader_2.54mm.3dshapes/PinHeader_1x07_P2.54mm_Vertical.step"
		(offset
			(xyz 3.81 7.62 9.7)
		)
		(scale
			(xyz 1 1 1)
		)
		(rotate
			(xyz 0 -180 0)
		)
	)
	(model "${KIPRJMOD}/kicad-library/3D/components.3dshapes/DRV8835-dual-motor-driver-carrier.step"
		(offset
			(xyz -5.08 -8.89 9.7)
		)
		(scale
			(xyz 1 1 1)
		)
		(rotate
			(xyz 0 0 0)
		)
	)
)
