(footprint "WE-691321100002"
	(version 20240108)
	(generator "pcbnew")
	(generator_version "8.0")
	(layer "F.Cu")
	(descr "<b>WR-TBL Serie 3211 - 3.50 mm Vertical PCB Header<br></b>Max Height = 9.2mm , Pitch 3.5mm , 2pins")
	(property "Reference" "REF**"
		(at 0 -5.835 0)
		(layer "F.SilkS")
		(uuid "e487bfac-2558-4ef4-8f97-6c55520dd47f")
		(effects
			(font
				(size 1 1)
				(thickness 0.15)
			)
		)
	)
	(property "Value" "691321100002"
		(at 4.12 4.365 0)
		(layer "F.Fab")
		(uuid "66e08d73-844c-4219-a865-735ec5051f61")
		(effects
			(font
				(size 1 1)
				(thickness 0.15)
			)
		)
	)
	(property "Footprint" ""
		(at 0 0 0)
		(layer "F.Fab")
		(hide yes)
		(uuid "ffc5fea9-7715-476e-b6df-0610130dae30")
		(effects
			(font
				(size 1.27 1.27)
				(thickness 0.15)
			)
		)
	)
	(property "Datasheet" ""
		(at 0 0 0)
		(layer "F.Fab")
		(hide yes)
		(uuid "2da16487-a152-4361-a402-06a00bc26d25")
		(effects
			(font
				(size 1.27 1.27)
				(thickness 0.15)
			)
		)
	)
	(property "Description" ""
		(at 0 0 0)
		(layer "F.Fab")
		(hide yes)
		(uuid "5574e505-d508-4a0e-a75c-291473965df5")
		(effects
			(font
				(size 1.27 1.27)
				(thickness 0.15)
			)
		)
	)
	(attr through_hole)
	(fp_line
		(start -4.3 -4.5)
		(end 4.3 -4.5)
		(stroke
			(width 0.2)
			(type solid)
		)
		(layer "F.SilkS")
		(uuid "ccd07baa-9cb8-47c8-a5d0-9090eb5b4694")
	)
	(fp_line
		(start -4.3 2.9)
		(end -4.3 -4.5)
		(stroke
			(width 0.2)
			(type solid)
		)
		(layer "F.SilkS")
		(uuid "f2680400-74be-4c9f-85a5-30b87810bffb")
	)
	(fp_line
		(start 4.3 -4.5)
		(end 4.3 2.9)
		(stroke
			(width 0.2)
			(type solid)
		)
		(layer "F.SilkS")
		(uuid "9d77c5bf-cbc0-4319-96a0-c8a7a5b668e0")
	)
	(fp_line
		(start 4.3 2.9)
		(end -4.3 2.9)
		(stroke
			(width 0.2)
			(type solid)
		)
		(layer "F.SilkS")
		(uuid "c5fd8dd8-ae61-4584-ab10-47fdfbf41cc5")
	)
	(fp_circle
		(center -3 -1.6)
		(end -2.9 -1.6)
		(stroke
			(width 0.4)
			(type solid)
		)
		(fill none)
		(layer "F.SilkS")
		(uuid "39b5c0eb-2de7-4fbf-8f2a-de0929a1b500")
	)
	(fp_poly
		(pts
			(xy -4.5 -4.7) (xy 4.5 -4.7) (xy 4.5 3.1) (xy -4.5 3.1)
		)
		(stroke
			(width 0.1)
			(type solid)
		)
		(fill none)
		(layer "F.CrtYd")
		(uuid "058bc755-087f-4316-91ed-798ce74d5609")
	)
	(fp_line
		(start -4.2 -4.4)
		(end -4.2 2.8)
		(stroke
			(width 0.1)
			(type solid)
		)
		(layer "F.Fab")
		(uuid "2c72f3c8-962a-49c9-b07a-1c3fe5252b9c")
	)
	(fp_line
		(start -4.2 2.8)
		(end 4.2 2.8)
		(stroke
			(width 0.1)
			(type solid)
		)
		(layer "F.Fab")
		(uuid "f2400553-94e8-48e0-a01b-dc4ec88feb76")
	)
	(fp_line
		(start 4.2 -4.4)
		(end -4.2 -4.4)
		(stroke
			(width 0.1)
			(type solid)
		)
		(layer "F.Fab")
		(uuid "f263eda0-bc1a-461b-8a16-f346838f02fb")
	)
	(fp_line
		(start 4.2 2.8)
		(end 4.2 -4.4)
		(stroke
			(width 0.1)
			(type solid)
		)
		(layer "F.Fab")
		(uuid "df38984b-a35c-4ff8-ae5a-ed29d983ea74")
	)
	(pad "1" thru_hole circle
		(at -1.75 0)
		(size 2.1 2.1)
		(drill 1.4)
		(layers "*.Cu" "*.Mask")
		(remove_unused_layers no)
		(solder_mask_margin 0.102)
		(uuid "c687d38e-77e3-4fb8-a76d-b987a076968c")
	)
	(pad "2" thru_hole circle
		(at 1.75 0)
		(size 2.1 2.1)
		(drill 1.4)
		(layers "*.Cu" "*.Mask")
		(remove_unused_layers no)
		(solder_mask_margin 0.102)
		(uuid "6be930a2-1e55-48e6-83d8-df6e420c0edb")
	)
	(model "${KIPRJMOD}/kicad-library/3D/connectors.3dshapes/WE-691321100002.stp"
		(offset
			(xyz 0 0.8 4.75)
		)
		(scale
			(xyz 1 1 1)
		)
		(rotate
			(xyz 0 0 0)
		)
	)
)
