{
  "flight mode": false,
  "main thread frequency": 0.2,
  "reaction wheel enabled": true,
  "reaction wheel enable pin": 5,
  "reaction wheel speed control pin": 13,
  "reaction wheel speed feedback ADC channel": 1,
  "reaction wheel speed feedback ADC device": 1,
  "reaction wheel current feedback ADC channel": 0,
  "reaction wheel current feedback ADC device": 1,
  "reaction wheel ramp": [
    {
      "delta time": 10,
      "target duty cycle": 150
    },
    {
      "delta time": 10,
      "target duty cycle": 140
    },
    {
      "delta time": 10,
      "target duty cycle": 130
    },
    {
      "delta time": 10,
      "target duty cycle": 120
    },
    {
      "delta time": 10,
      "target duty cycle": 105
    },
    {
      "delta time": 10,
      "target duty cycle": 90
    },
    {
      "delta time": 10,
      "target duty cycle": 70
    },
    {
      "delta time": 10,
      "target duty cycle": 50
    },
    {
      "delta time": 10,
      "target duty cycle": 20
    },
    {
      "delta time": 10,
      "target duty cycle": 5
    },
    {
      "delta time": 10,
      "target duty cycle": 100
    },
    {
      "delta time": 10,
      "target duty cycle": 180
    },
    {
      "delta time": 10,
      "target duty cycle": 160
    },
    {
      "delta time": 110,
      "target duty cycle": 150
    },
    {
      "delta time": 10,
      "target duty cycle": 140
    },
    {
      "delta time": 10,
      "target duty cycle": 130
    },
    {
      "delta time": 10,
      "target duty cycle": 120
    },
    {
      "delta time": 10,
      "target duty cycle": 105
    },
    {
      "delta time": 10,
      "target duty cycle": 90
    },
    {
      "delta time": 10,
      "target duty cycle": 70
    },
    {
      "delta time": 10,
      "target duty cycle": 50
    },
    {
      "delta time": 10,
      "target duty cycle": 20
    },
    {
      "delta time": 10,
      "target duty cycle": 5
    },
    {
      "delta time": 10,
      "target duty cycle": 100
    },
    {
      "delta time": 10,
      "target duty cycle": 180
    },
    {
      "delta time": 10,
      "target duty cycle": 160
    },
    {
      "delta time": 10,
      "target duty cycle": 255
    },
    {
      "delta time": 10,
      "target duty cycle": 0
    }
  ],
  "reaction wheel max speed": 3500.0,
  "reaction wheel speed control pin frequency": 100,
  "reaction wheel thread frequency": 0.01,
  "video system enabled": true,
  "video FPS": 30,
  "video resolution": {
    "width": 1024,
    "height": 768
  },
  "video chunk length": 5.0,
  "RXS SODS pin": 27,
  "RXS SOE pin": 17,
  "RXS LO pin": 18,
  "RXS LO pin pull up": true,
  "RXS SODS pin pull up": true,
  "RXS SOE pin pull up": true,
  "RXS LO pin debounce time": 0.2,
  "RXS SODS pin debounce time": 0.2,
  "RXS SOE pin debounce time": 0.2,
  "continuity ADC device": 0,
  "continuity ADC channel": 0,
  "continuity comparing resistance": 56.0,
  "continuity current limiting resistance": 680.0,
  "continuity log path": "/home/pi/logs/Continuity_Check.log",
  "continuity thread frequency": 0.1,
  "CPU temperature check interval": 0.05,
  "CPU sensor enabled": true,
  "GoPro enabled": true,
  "GoPro trigger pin": 4,
  "GoPro activation press duration": 0.5,
  "GoPro deactivation press duration": 3.0,
  "morse blink enabled": false,
  "morse blink pin": 21,
  "heartbeat send interval": 1.0,
  "telemetry send interval": 1.0,
  "enable verbose logging": true
}