<?xml version="1.0" encoding="UTF-8" standalone="no"?>
<svg
   xmlns="http://www.w3.org/2000/svg"
   viewBox="0 0 81.9 71.52"
   version="1.1">
  <rect
     style="fill:#ff9830;fill-opacity:1;stroke-width:1.08729"
     id="rect37"
     width="10"
     height="52.654186"
     x="35.950001"
     y="9.8243074" />
  <path
     id="rect39"
     style="fill:#ff9830;fill-opacity:1;stroke:none;stroke-width:1.01902"
     d="m 25.209745,5.7600002 30.766551,0 c 0,0 5.408083,-0.045896 5.473705,3.9999999 C 61.517974,13.950827 56.333277,13.76 56.333277,13.76 l -31.242526,0 c 0,0 -4.661484,0.06265 -4.64075,-3.9999999 0.02093,-4.100781 4.759744,-3.9999999 4.759744,-3.9999999 z" />
  <path
     id="rect39-14"
     style="fill:#ff9830;fill-opacity:1;stroke:none;stroke-width:1.01902"
     d="m 25.209814,57.760221 h 30.766551 c 0,0 5.408083,-0.0459 5.473705,4 0.06797,4.190826 -5.116724,3.999999 -5.116724,3.999999 H 25.09082 c 0,0 -4.661485,0.06265 -4.640751,-3.999999 0.02093,-4.100781 4.759745,-4 4.759745,-4 z" />
</svg>
