[gd_scene load_steps=6 format=2]

[ext_resource path="res://ThePlayer.tscn" type="PackedScene" id=1]
[ext_resource path="res://disturbance.png" type="Texture" id=2]
[ext_resource path="res://DaveMan.png" type="Texture" id=3]
[ext_resource path="res://ba51c647924cf1fb58aaefface7f2c2023a55f83.png" type="Texture" id=4]
[ext_resource path="res://icon.png" type="Texture" id=5]

[node name="Node" type="Node"]

[node name="ColorRect" type="ColorRect" parent="."]
margin_left = -555.0
margin_top = -326.0
margin_right = -1.0
margin_bottom = 4.0
color = Color( 0.0823529, 0.0823529, 0.0823529, 1 )
__meta__ = {
"_edit_use_anchors_": false
}

[node name="ColorRect" type="ColorRect" parent="ColorRect"]
margin_left = 555.0
margin_right = 1077.0
margin_bottom = 330.0
__meta__ = {
"_edit_use_anchors_": false
}

[node name="ColorRect2" type="ColorRect" parent="ColorRect"]
margin_top = 329.0
margin_right = 565.0
margin_bottom = 638.0
color = Color( 0, 0.439216, 1, 1 )
__meta__ = {
"_edit_use_anchors_": false
}

[node name="ColorRect" type="ColorRect" parent="ColorRect/ColorRect2"]
margin_left = 553.186
margin_top = -0.814514
margin_right = 1076.19
margin_bottom = 308.185
color = Color( 0.117647, 0.603922, 0, 1 )
__meta__ = {
"_edit_use_anchors_": false
}

[node name="Player" parent="." instance=ExtResource( 1 )]
speed = 225
SneakSpeed = 125

[node name="Camera2D" type="Camera2D" parent="Player"]
current = true
drag_margin_h_enabled = true
drag_margin_v_enabled = true
smoothing_enabled = true
drag_margin_left = 0.35
drag_margin_top = 0.35
drag_margin_right = 0.35
drag_margin_bottom = 0.35
editor_draw_drag_margin = true

[node name="disturbance" type="Sprite" parent="."]
position = Vector2( 509.167, 298.079 )
scale = Vector2( 0.443575, 0.443575 )
texture = ExtResource( 2 )

[node name="ba51c647924cf1fb58aaefface7f2c2023a55f83" type="Sprite" parent="."]
position = Vector2( -497.309, -311.944 )
texture = ExtResource( 4 )

[node name="icon" type="Sprite" parent="."]
position = Vector2( 515.099, -297.624 )
texture = ExtResource( 5 )

[node name="DaveMan" type="Sprite" parent="."]
position = Vector2( -514.493, 296.647 )
texture = ExtResource( 3 )
