[gd_scene load_steps=3 format=2]

[ext_resource path="res://Glarglon.png" type="Texture" id=1]
[ext_resource path="res://EnemyGlargon.gd" type="Script" id=2]

[node name="Area2D" type="Area2D"]
script = ExtResource( 2 )

[node name="Glarglon" type="Sprite" parent="."]
scale = Vector2( 0.5, 0.5 )
texture = ExtResource( 1 )
flip_h = true

[node name="CollisionPolygon2D" type="CollisionPolygon2D" parent="."]
scale = Vector2( 0.5, 0.5 )
polygon = PoolVector2Array( 42.5, 122, 77, 126.6, 77, 122.7, 91, 109.7, 91, 102.7, 95, 90.6, 95, 83.7, 90.4, 56, 87.3, 56, 70.1, 44.8, 76.1, 31.2, 95.9, 43, 101.6, 43, 136.4, 53, 148.8, 53, 189, 55.2, 189, 52.3, 198, 47.4, 198, 34, 194.4, 34, 180.4, 23, 176.7, 23, 129, 9.89999, 99, -7.4, 99, -8, 65, -34, 65, -35.2, 55.6, -49.3, 64.9, -48.3, 85.5, -32.3, 90, -34.5, 90, -36.2, 103.5, -48, 105.4, -48, 137, -54.8, 137, -57.4, 144, -64.3, 144, -71.7, 143.4, -72.3, 144, -72.7, 144, -74.6, 158.8, -92, 160.1, -92, 184, -105.7, 184, -110.4, 181.3, -124, 168.7, -124, 112, -116.6, -4, -127.4, -4, -124.1, -14, -117.1, -14, -113.8, -15.8, -108.4, -42, -115.2, -42, -111.1, -57, -101.1, -57, -95.8, -55.7, -79, -53.5, -79, -39.5, -51.9, -82, -50.2, -82, -51.7, -66, -73.7, -66, -100, -68.7, -100, -76.7, -114, -79.3, -114, -102, -121.5, -102, -116.6, -116.8, -100.2, -130, -102.4, -130, -104.2, -131.3, -119, -134.6, -119, -142, -124.9, -142, -128.8, -166, -124.3, -166, -121.9, -180, -110.9, -180, -107.6, -186, -91.7, -186, -79.5, -179, -71.5, -179, -70.5, -181.3, -60.5, -193, -57, -193, -50.3, -188.4, -48.4, -201, -38.8, -201, -29.2, -186.5, -36, -190.1, -21, -182.1, -21, -176, -28.7, -176, -28, -171.7, -28, -169, -27.1, -166.8, 25, -164, 25, -146, 48.4, -146, 54.5, -159.9, 100, -160.5, 100, -174, 112.2, -174, 117.7, -165.7, 126, -159, 126, -115, 125, -115, 122.6, -113.9, 123.7, -109, 121.7, -109, 118.8, -87.3, 66, -85.8, 66, -42.7, 62.3, -26.9, 67.9, 5.89999, 96.6, -2.89999, 107, -25, 107, -25, 111.4, -27.7, 129, -21, 129, 29, 128, 29, 124.7, 37.3, 116.7, 39.2, 122 )
