335547
542969
1000000
542969
1000000
1000000
469141
1000000
1000000
782031
1000000
469141
1000000
307422
416406
1000000
1000000
782031
1000000
542969
1000000
1000000
416406
469141
1000000
1000000
1000000
1000000
641406
1000000
1000000
641406
542969
1000000
1000000
1000000
1000000
1000000
1000000
282812
641406
416406
1000000
1000000
782031
1000000
1000000
542969
641406
1000000
370703
469141
1000000
641406
1000000
641406
416406
1000000
782031
335547
1000000
1000000
335547
1000000
244141
641406
1000000
1000000
469141
1000000
1000000
1000000
416406
1000000
641406
416406
416406
1000000
1000000
307422
1000000
1000000
1000000
1000000
307422
1000000
469141
1000000
1000000
1000000
1000000
1000000
1000000
1000000
1000000
782031
307422
1000000
1000000
416406
416406
1000000
1000000
1000000
1000000
1000000
1000000
1000000
1000000
1000000
1000000
1000000
1000000
469141
