1000000
1000000
1000000
1000000
1000000
1000000
1000000
1000000
1000000
1000000
1000000
1000000
1000000
1000000
1000000
1000000
1000000
1000000
1000000
1000000
1000000
1000000
1000000
1000000
1000000
1000000
1000000
1000000
1000000
1000000
1000000
1000000
640000
1000000
1000000
1000000
1000000
780488
283186
372093
1000000
1000000
1000000
1000000
1000000
1000000
1000000
542373
542373
157635
307692
1000000
1000000
640000
1000000
1000000
1000000
1000000
1000000
214765
139130
1000000
1000000
1000000
780488
780488
542373
1000000
372093
262295
415584
307692
1000000
1000000
1000000
336842
283186
780488
1000000
640000
1000000
283186
1000000
1000000
1000000
1000000
1000000
1000000
1000000
1000000
640000
780488
1000000
1000000
1000000
1000000
1000000
1000000
1000000
1000000
1000000
1000000
1000000
1000000
1000000
1000000
1000000
1000000
1000000
1000000
1000000
1000000
1000000
150943
