1000000
1000000
641406
1000000
1000000
1000000
1000000
542969
641406
1000000
782031
1000000
370703
416406
542969
1000000
416406
244141
469141
469141
641406
1000000
469141
1000000
1000000
261719
230078
261719
542969
1000000
469141
469141
469141
641406
216016
244141
416406
469141
282812
542969
201953
370703
416406
542969
416406
307422
216016
216016
145703
124609
1000000
1000000
641406
542969
335547
1000000
542969
261719
261719
307422
641406
1000000
1000000
1000000
1000000
782031
1000000
201953
542969
542969
1000000
1000000
1000000
1000000
1000000
1000000
1000000
416406
542969
1000000
782031
1000000
1000000
1000000
1000000
1000000
416406
1000000
1000000
1000000
1000000
1000000
1000000
1000000
1000000
1000000
469141
641406
1000000
1000000
1000000
1000000
1000000
542969
1000000
1000000
542969
1000000
1000000
641406
1000000
641406
542969
1000000
