641406
641406
1000000
641406
1000000
1000000
1000000
1000000
1000000
641406
1000000
1000000
1000000
1000000
1000000
1000000
1000000
1000000
1000000
1000000
1000000
641406
1000000
641406
641406
1000000
1000000
1000000
1000000
472656
1000000
1000000
1000000
1000000
1000000
1000000
1000000
1000000
1000000
1000000
1000000
1000000
1000000
1000000
1000000
1000000
1000000
1000000
1000000
1000000
310938
472656
1000000
1000000
1000000
1000000
1000000
1000000
1000000
1000000
1000000
205469
205469
416406
472656
1000000
1000000
1000000
1000000
1000000
310938
184375
205469
310938
282812
1000000
782031
1000000
1000000
782031
1000000
310938
156250
261719
247656
374219
1000000
1000000
641406
1000000
641406
1000000
339062
310938
641406
416406
1000000
1000000
472656
782031
641406
374219
226562
1000000
1000000
1000000
1000000
641406
339062
1000000
782031
1000000
1000000
1000000
