1000000
1000000
1000000
1000000
1000000
1000000
1000000
1000000
1000000
1000000
782031
1000000
1000000
1000000
1000000
1000000
1000000
1000000
542969
1000000
282812
191406
1000000
1000000
1000000
1000000
1000000
1000000
472656
205469
542969
472656
339062
1000000
1000000
1000000
1000000
782031
1000000
641406
641406
782031
782031
1000000
1000000
1000000
1000000
1000000
1000000
1000000
226562
1000000
1000000
782031
542969
472656
1000000
1000000
1000000
1000000
1000000
641406
310938
1000000
1000000
782031
1000000
1000000
1000000
1000000
1000000
1000000
226562
1000000
1000000
1000000
1000000
1000000
1000000
1000000
1000000
641406
782031
1000000
1000000
1000000
1000000
1000000
1000000
1000000
1000000
1000000
1000000
1000000
782031
1000000
1000000
1000000
1000000
1000000
1000000
641406
374219
1000000
1000000
1000000
1000000
641406
261719
1000000
1000000
1000000
472656
205469
