307691
542370
780483
639996
639996
372091
639996
999994
415582
780483
999994
780483
999994
470586
999994
262294
172972
542370
999994
999994
999994
999994
780483
372091
228571
191616
639996
542370
999994
999994
999994
999994
999994
372091
181818
542370
999994
999994
639996
999994
999994
999994
999994
415582
307691
172972
780483
542370
283185
542370
999994
999994
639996
999994
999994
999994
262294
283185
372091
262294
372091
999994
999994
372091
639996
999994
999994
780483
307691
283185
999994
999994
999994
999994
262294
470586
470586
415582
372091
372091
999994
999994
999994
999994
999994
336840
470586
336840
639996
336840
470586
372091
336840
542370
999994
336840
542370
307691
415582
470586
999994
999994
999994
542370
307691
415582
262294
999994
999994
542370
372091
639996
999994
999994
