335086
536258
816343
659733
599414
419653
666110
1028600
378394
775522
987073
823159
1014380
502862
994335
235018
178431
498752
1032757
1013160
1025802
985446
827552
411403
256409
161080
636668
496750
965423
1018298
1024470
1046744
982576
359137
178773
511317
962986
997564
612687
1016975
993709
1033261
1020020
396819
340917
203449
769231
521203
301434
506345
969985
950730
668688
1016479
1020510
1028066
258186
290059
336071
223747
388931
997103
1006517
398591
653468
1005352
1005914
760878
260773
276856
971452
990847
1035334
973388
218124
448724
449945
431774
377794
400481
1016425
990632
1031395
966691
952265
295845
492821
333028
606124
336945
435817
391723
331456
530472
980145
349869
528551
266456
377383
516775
1040851
1019964
976581
589287
335566
437271
257230
977218
959633
582630
367669
610233
980589
1007916
