465625
409375
325000
775000
381250
550000
409375
465625
409375
381250
550000
465625
296875
409375
296875
325000
1000000
1000000
465625
409375
381250
381250
1000000
296875
212500
775000
1000000
409375
465625
268750
1000000
1000000
634375
240625
634375
775000
465625
268750
775000
1000000
1000000
1000000
1000000
634375
240625
465625
1000000
296875
296875
296875
1000000
1000000
1000000
1000000
1000000
1000000
240625
465625
212500
240625
184375
1000000
634375
1000000
1000000
1000000
1000000
268750
212500
212500
1000000
775000
1000000
634375
1000000
1000000
1000000
268750
156250
212500
409375
409375
296875
1000000
465625
1000000
1000000
156250
156250
240625
268750
465625
550000
381250
1000000
1000000
184375
184375
240625
465625
268750
634375
775000
296875
240625
409375
381250
465625
775000
296875
325000
296875
634375
296875
