372093
470588
336842
372093
372093
372093
191617
214765
372093
228571
244275
336842
262295
283186
307692
470588
191617
780488
415584
415584
415584
1000000
214765
640000
283186
228571
470588
1000000
780488
1000000
542373
202532
1000000
336842
415584
415584
780488
1000000
1000000
1000000
1000000
542373
202532
470588
307692
244275
542373
1000000
1000000
1000000
1000000
640000
1000000
1000000
780488
307692
262295
307692
1000000
1000000
1000000
780488
640000
283186
1000000
1000000
1000000
336842
1000000
1000000
1000000
1000000
470588
202532
172973
1000000
1000000
1000000
1000000
1000000
780488
1000000
542373
202532
139130
164948
283186
640000
415584
372093
1000000
1000000
262295
191617
172973
191617
640000
283186
470588
470588
415584
336842
228571
336842
262295
262295
372093
415584
415584
372093
307692
336842
372093
1000000
