1000000
542373
470588
1000000
307692
336842
372093
640000
415584
1000000
415584
470588
640000
542373
640000
542373
1000000
1000000
1000000
1000000
542373
307692
415584
640000
307692
1000000
1000000
372093
1000000
336842
1000000
470588
372093
228571
1000000
1000000
336842
1000000
1000000
1000000
1000000
415584
415584
283186
470588
1000000
1000000
1000000
1000000
1000000
1000000
1000000
1000000
1000000
470588
415584
415584
470588
1000000
1000000
1000000
780488
1000000
1000000
1000000
470588
780488
336842
1000000
1000000
1000000
1000000
470588
542373
1000000
1000000
1000000
1000000
780488
1000000
780488
1000000
780488
1000000
1000000
1000000
1000000
542373
1000000
415584
1000000
1000000
1000000
1000000
1000000
1000000
470588
542373
244275
780488
336842
415584
1000000
640000
780488
415584
1000000
470588
336842
415584
470588
640000
780488
1000000
