470586
415582
336840
780483
372091
542370
415582
470586
415582
372091
542370
470586
307691
415582
283185
336840
999994
999994
470586
415582
372091
372091
999994
307691
202531
780483
999994
415582
470586
262294
999994
999994
639996
244274
639996
780483
470586
262294
780483
999994
999994
999994
999994
639996
244274
470586
999994
283185
283185
307691
999994
999994
999994
999994
999994
999994
228571
470586
202531
228571
172972
999994
639996
999994
999994
999994
999994
262294
202531
202531
999994
780483
999994
639996
999994
999994
999994
262294
150943
214764
415582
415582
307691
999994
470586
999994
999994
144796
150943
228571
262294
470586
542370
372091
999994
999994
181818
181818
228571
470586
262294
639996
780483
283185
244274
415582
372091
470586
780483
307691
336840
283185
639996
283185
