1027389
993881
1035853
1019730
959412
1047556
1026107
1028600
962805
995032
767563
1042670
1014380
1032270
994335
972718
1005452
956376
575133
1013160
308993
177069
1047063
1039305
1027832
969458
996666
954374
436015
220836
566846
517336
319423
987040
996949
968941
962986
778053
972685
656977
633711
813751
800509
981230
1033219
1030470
988742
978827
1018243
963969
198562
950730
1028686
796968
562886
498658
995885
1006868
963974
961447
1016834
637106
314214
1026493
1013465
785841
1005914
980389
953076
993665
971452
990847
263911
973388
955824
978132
979353
1016185
1005697
1028383
1016425
630635
811885
966691
952265
958999
1022229
996181
966121
1000098
965225
1019626
994609
988096
760634
1013022
986175
958759
961794
1046183
1040851
659967
348678
1046911
1027869
1021682
994930
617220
221933
1040254
995571
970230
451181
210453
