1000000
1000000
1000000
1000000
1000000
1000000
1000000
1000000
1000000
1000000
780488
1000000
1000000
1000000
1000000
1000000
1000000
1000000
542373
1000000
283186
191617
1000000
1000000
1000000
1000000
1000000
1000000
470588
202532
542373
470588
336842
1000000
1000000
1000000
1000000
780488
1000000
640000
640000
780488
780488
1000000
1000000
1000000
1000000
1000000
1000000
1000000
228571
1000000
1000000
780488
542373
470588
1000000
1000000
1000000
1000000
1000000
640000
307692
1000000
1000000
780488
1000000
1000000
1000000
1000000
1000000
1000000
228571
1000000
1000000
1000000
1000000
1000000
1000000
1000000
1000000
640000
780488
1000000
1000000
1000000
1000000
1000000
1000000
1000000
1000000
1000000
1000000
1000000
780488
1000000
1000000
1000000
1000000
1000000
1000000
640000
372093
1000000
1000000
1000000
1000000
640000
262295
1000000
1000000
1000000
470588
202532
