307692
542373
780488
640000
640000
372093
640000
1000000
415584
780488
1000000
780488
1000000
470588
1000000
262295
172973
542373
1000000
1000000
1000000
1000000
780488
372093
228571
191617
640000
542373
1000000
1000000
1000000
1000000
1000000
372093
181818
542373
1000000
1000000
640000
1000000
1000000
1000000
1000000
415584
307692
172973
780488
542373
283186
542373
1000000
1000000
640000
1000000
1000000
1000000
262295
283186
372093
262295
372093
1000000
1000000
372093
640000
1000000
1000000
780488
307692
283186
1000000
1000000
1000000
1000000
262295
470588
470588
415584
372093
372093
1000000
1000000
1000000
1000000
1000000
336842
470588
336842
640000
336842
470588
372093
336842
542373
1000000
336842
542373
307692
415584
470588
1000000
1000000
1000000
542373
307692
415584
262295
1000000
1000000
542373
372093
640000
1000000
1000000
