544052
1000908
1002082
779945
1000894
1001990
999879
999230
1000475
1001084
998161
998144
1000642
997830
997856
999139
467773
470444
470543
780475
998292
999379
1000134
1000194
999427
999671
640744
998928
1000564
998903
416019
1000053
999067
999210
541749
780911
998705
999012
1000961
467458
1000556
999987
998529
999178
999196
640492
639569
416698
371230
998400
639292
416311
370176
998267
998111
1002269
1001415
1000524
468787
218066
216352
1000455
468076
782338
782776
1001186
1000932
1001802
467178
337556
1000397
781149
1001253
998211
541268
1002337
284325
784138
998879
781685
999125
372794
1002100
783359
779812
467873
371629
999477
639509
1002226
541279
639489
1000291
640126
999123
415602
999725
1000493
1001571
999839
1000841
1001079
999775
998200
1001817
999424
1001923
999877
1000761
1001199
999757
998791
1001387
48976
