336842
542373
1000000
542373
1000000
1000000
470588
1000000
1000000
780488
1000000
470588
1000000
307692
415584
1000000
1000000
780488
1000000
542373
1000000
1000000
415584
470588
1000000
1000000
1000000
1000000
640000
1000000
1000000
640000
542373
1000000
1000000
1000000
1000000
1000000
1000000
283186
640000
415584
1000000
1000000
780488
1000000
1000000
542373
640000
1000000
372093
470588
1000000
640000
1000000
640000
415584
1000000
780488
336842
1000000
1000000
336842
1000000
244275
640000
1000000
1000000
470588
1000000
1000000
1000000
415584
1000000
640000
415584
415584
1000000
1000000
307692
1000000
1000000
1000000
1000000
307692
1000000
470588
1000000
1000000
1000000
1000000
1000000
1000000
1000000
1000000
780488
307692
1000000
1000000
415584
415584
1000000
1000000
1000000
1000000
1000000
1000000
1000000
1000000
1000000
1000000
1000000
1000000
470588
