542373
1000000
1000000
780488
1000000
1000000
1000000
1000000
1000000
1000000
1000000
1000000
1000000
1000000
1000000
1000000
470588
470588
470588
780488
1000000
1000000
1000000
1000000
1000000
1000000
640000
1000000
1000000
1000000
415584
1000000
1000000
1000000
542373
780488
1000000
1000000
1000000
470588
1000000
1000000
1000000
1000000
1000000
640000
640000
415584
372093
1000000
640000
415584
372093
1000000
1000000
1000000
1000000
1000000
470588
214765
214765
1000000
470588
780488
780488
1000000
1000000
1000000
470588
336842
1000000
780488
1000000
1000000
542373
1000000
283186
780488
1000000
780488
1000000
372093
1000000
780488
780488
470588
372093
1000000
640000
1000000
542373
640000
1000000
640000
1000000
415584
1000000
1000000
1000000
1000000
1000000
1000000
1000000
1000000
1000000
1000000
1000000
1000000
1000000
1000000
1000000
1000000
1000000
49005
