1027389
993881
1035853
1019730
959412
1047556
1026107
1028600
962805
995032
987073
1042670
1014380
1032270
994335
972718
1005452
956376
1032757
1013160
1025802
985446
827552
1039305
1027832
969458
996666
954374
965423
1018298
169272
383591
982576
987040
996949
968941
962986
997564
972685
389072
276900
206240
356867
981230
1033219
1030470
988742
978827
1018243
963969
750474
195010
186327
208101
491102
1028066
995885
1006868
963974
961447
1016834
777593
1006517
806983
296656
220122
342761
980389
953076
993665
611455
990847
1035334
973388
263521
350230
521729
1016185
1005697
1028383
1016425
990632
1031395
966691
952265
958999
437818
996181
966121
1000098
965225
1019626
994609
988096
980145
793511
986175
958759
961794
1046183
1040851
1019964
976581
1046911
1027869
1021682
994930
977218
959633
1040254
995571
970230
980589
1007916
