1000000
780488
1000000
780488
780488
415584
470588
780488
542373
1000000
1000000
470588
1000000
1000000
1000000
780488
228571
542373
640000
640000
780488
1000000
1000000
1000000
470588
307692
1000000
1000000
1000000
1000000
1000000
1000000
1000000
1000000
283186
640000
1000000
1000000
1000000
640000
1000000
1000000
1000000
1000000
1000000
372093
1000000
1000000
1000000
1000000
181818
372093
640000
780488
1000000
1000000
1000000
228571
1000000
640000
542373
244275
244275
415584
336842
1000000
1000000
1000000
1000000
1000000
150943
172973
372093
542373
542373
372093
780488
1000000
1000000
1000000
542373
415584
372093
283186
1000000
1000000
542373
1000000
1000000
1000000
780488
780488
780488
780488
1000000
1000000
1000000
1000000
1000000
1000000
1000000
470588
415584
1000000
1000000
1000000
1000000
1000000
307692
1000000
780488
1000000
1000000
139130
