999994
542370
470586
999994
307691
336840
372091
639996
415582
999994
415582
470586
639996
542370
639996
542370
999994
999994
999994
999994
542370
307691
415582
639996
307691
999994
999994
372091
999994
336840
999994
470586
372091
228571
999994
999994
336840
999994
999994
999994
999994
415582
415582
283185
470586
999994
999994
999994
999994
999994
999994
999994
999994
999994
470586
415582
415582
470586
999994
999994
999994
780483
999994
999994
999994
470586
780483
336840
999994
999994
999994
999994
470586
542370
999994
999994
999994
999994
780483
999994
780483
999994
780483
999994
999994
999994
999994
542370
999994
415582
999994
999994
999994
999994
999994
999994
470586
542370
244274
780483
336840
415582
999994
639996
780483
415582
999994
470586
336840
415582
470586
639996
780483
999994
