296875
775000
1000000
296875
381250
1000000
1000000
1000000
1000000
775000
1000000
775000
1000000
775000
1000000
1000000
1000000
1000000
1000000
634375
1000000
1000000
1000000
325000
550000
1000000
1000000
381250
1000000
1000000
296875
1000000
465625
296875
1000000
1000000
1000000
1000000
409375
465625
296875
268750
465625
634375
240625
1000000
1000000
1000000
1000000
1000000
1000000
409375
268750
296875
1000000
634375
240625
1000000
1000000
1000000
1000000
634375
1000000
1000000
296875
268750
296875
1000000
634375
775000
1000000
1000000
1000000
1000000
465625
775000
634375
1000000
1000000
550000
1000000
1000000
1000000
1000000
1000000
1000000
634375
1000000
1000000
1000000
1000000
1000000
1000000
1000000
1000000
1000000
634375
1000000
1000000
1000000
1000000
1000000
1000000
1000000
1000000
1000000
1000000
1000000
1000000
1000000
409375
1000000
1000000
212500
