339062
542969
1000000
542969
1000000
1000000
472656
1000000
1000000
782031
1000000
472656
1000000
310938
416406
1000000
1000000
782031
1000000
542969
1000000
1000000
416406
472656
1000000
1000000
1000000
1000000
641406
1000000
1000000
641406
542969
1000000
1000000
1000000
1000000
1000000
1000000
282812
641406
416406
1000000
1000000
782031
1000000
1000000
542969
641406
1000000
374219
472656
1000000
641406
1000000
641406
416406
1000000
782031
339062
1000000
1000000
339062
1000000
247656
641406
1000000
1000000
472656
1000000
1000000
1000000
416406
1000000
641406
416406
416406
1000000
1000000
310938
1000000
1000000
1000000
1000000
310938
1000000
472656
1000000
1000000
1000000
1000000
1000000
1000000
1000000
1000000
782031
310938
1000000
1000000
416406
416406
1000000
1000000
1000000
1000000
1000000
1000000
1000000
1000000
1000000
1000000
1000000
1000000
472656
