335547
244141
307422
307422
201953
542969
641406
282812
542969
282812
307422
416406
282812
641406
1000000
1000000
282812
469141
370703
416406
469141
1000000
1000000
1000000
1000000
216016
370703
201953
261719
1000000
1000000
1000000
1000000
1000000
244141
542969
1000000
641406
261719
1000000
641406
1000000
1000000
1000000
370703
370703
370703
370703
180859
261719
1000000
782031
641406
1000000
1000000
1000000
782031
282812
261719
282812
201953
542969
416406
1000000
1000000
1000000
1000000
335547
244141
163281
641406
1000000
469141
1000000
1000000
1000000
1000000
335547
201953
307422
201953
1000000
469141
163281
261719
1000000
1000000
307422
244141
307422
163281
230078
1000000
201953
173828
542969
641406
261719
244141
416406
641406
1000000
163281
307422
542969
230078
261719
641406
370703
1000000
335547
244141
282812
85938
