1027389
993881
506445
1019730
959412
687558
1026107
499192
602808
995032
987073
1042670
794869
1032270
366433
612720
288643
171146
672759
1013160
568178
293144
1047063
1039305
1027832
385046
211436
954374
605425
560675
1024470
686747
982576
987040
333796
141920
505362
468156
972685
1016975
993709
1033261
1020020
981230
1033219
402567
203512
241127
433832
963969
440577
950730
1028686
1016479
800999
1028066
995885
290059
336071
190024
1016834
997103
250797
666496
1013465
1005352
1005914
395977
953076
993665
215732
298544
318525
753877
955824
978132
979353
1016185
645699
1028383
245002
298330
314586
228991
289112
958999
1022229
466773
381710
1000098
272922
281926
256910
360193
450737
793511
986175
958759
377383
383030
348549
222502
447173
1046911
667871
661685
176754
239518
267330
510846
995571
970230
224870
1007916
