1000000
1000000
780488
1000000
1000000
640000
1000000
640000
542373
1000000
1000000
1000000
1000000
1000000
1000000
470588
262295
1000000
1000000
1000000
1000000
415584
1000000
1000000
1000000
307692
542373
780488
1000000
415584
1000000
1000000
1000000
1000000
336842
780488
542373
1000000
307692
1000000
1000000
1000000
1000000
780488
1000000
542373
780488
1000000
1000000
1000000
1000000
1000000
1000000
1000000
1000000
1000000
1000000
1000000
1000000
1000000
470588
640000
1000000
415584
1000000
1000000
640000
640000
1000000
1000000
780488
640000
1000000
1000000
1000000
1000000
1000000
780488
1000000
1000000
307692
470588
470588
640000
1000000
1000000
1000000
336842
1000000
780488
470588
372093
415584
780488
780488
1000000
1000000
640000
1000000
1000000
1000000
470588
1000000
1000000
640000
780488
470588
780488
780488
780488
372093
1000000
640000
1000000
