999994
999994
780483
999994
999994
639996
999994
639996
542370
999994
999994
999994
999994
999994
999994
470586
262294
999994
999994
999994
999994
415582
999994
999994
999994
307691
542370
780483
999994
415582
999994
999994
999994
999994
336840
780483
542370
999994
307691
999994
999994
999994
999994
780483
999994
542370
780483
999994
999994
999994
999994
999994
999994
999994
999994
999994
999994
999994
999994
999994
470586
639996
999994
415582
999994
999994
639996
639996
999994
999994
780483
639996
999994
999994
999994
999994
999994
780483
999994
999994
307691
470586
470586
639996
999994
999994
999994
336840
999994
780483
470586
372091
415582
780483
780483
999994
999994
639996
999994
999994
999994
470586
999994
999994
639996
780483
470586
780483
780483
780483
372091
999994
639996
999994
