1000000
1000000
1000000
1000000
1000000
1000000
1000000
1000000
1000000
1000000
1000000
1000000
1000000
1000000
775000
775000
1000000
1000000
1000000
1000000
1000000
550000
296875
296875
775000
1000000
1000000
1000000
1000000
1000000
1000000
775000
381250
634375
1000000
1000000
1000000
1000000
1000000
775000
1000000
296875
268750
296875
1000000
1000000
1000000
1000000
1000000
1000000
1000000
1000000
1000000
325000
465625
465625
1000000
1000000
1000000
1000000
1000000
1000000
1000000
775000
381250
381250
465625
1000000
1000000
1000000
1000000
465625
1000000
1000000
325000
325000
268750
1000000
1000000
1000000
1000000
634375
1000000
1000000
1000000
1000000
634375
1000000
1000000
1000000
1000000
1000000
1000000
1000000
1000000
1000000
1000000
1000000
1000000
1000000
1000000
550000
1000000
1000000
1000000
1000000
1000000
1000000
1000000
775000
1000000
1000000
1000000
1000000
