14
12
11
14
9
11
15
12
14
14
12
11
0
0
10
10
10
11
2
2
6
5
5
5
0
12
12
12
12
12
13
13
13
13
13
10
0
15
8
5
5
5
6
2
5
5
4
5
6
0
11
9
2
1
14
14
14
13
14
13
11
11
13
13
14
14
14
13
10
10
9
13
13
13
9
0
1
9
15
15
13
13
14
14
13
14
10
14
15
15
15
15
15
8
3
1
14
13
12
15
14
10
11
11
9
9
9
9
6
9
0
0
0
10
3
6
