75
32781
32795
32873
32950
33113
33295
33420
33476
33510
33478
33601
33543
33601
33357
33385
33765
33870
33890
34069
34136
34128
34092
33761
34018
34551
34536
34350
34279
34235
34225
34137
33877
33336
32927
33554
33661
33464
32932
32925
32937
156
417
1342
1827
2213
1876
1876
2191
2296
2311
1992
1645
1458
1390
1465
1564
1595
1472
1787
1599
1535
1510
1158
820
338
326
378
378
1136
1517
1540
1234
661
329
121
32853
33132
33143
32848
555
671
653
480
58
33322
33367
33076
33121
32885
375
421
400
333
238
131
252
303
422
1219
1373
1453
1510
1251
1166
1165
1313
1571
1528
1823
1908
1810
1838
1783
1951
2002
580