228
32870
32822
32876
32846
33134
33061
32894
32968
32826
33
33044
250
32827
383
32888
33570
32991
32914
32958
32844
125
305
635
33039
33304
16
240
72
171
929
592
296
544
411
33398
32901
254
603
141
32931
409
263
930
488
388
33161
5
407
106
60
33854
33169
32956
32837
168
487
157
33559
407
32957
33013
33493
33482
33112
33253
32782
174
241
977
383
88
34097
33868
33182
32977
32987
33197
32850
380
648
503
32981
33111
33201
33383
32815
409
32971
304
549
561
32835
32842
32864
32876
166
229
154
801
167
81
57
33046
33122
32849
223
260
32812
361
264
33339
142
32869
405
729
34190
