0
0
0
129
129
130
130
131
132
132
132
132
132
132
132
131
131
135
135
135
135
136
136
136
132
132
139
139
137
137
137
137
135
130
0
133
134
131
2
2
2
6
8
20
28
31
26
26
31
32
32
27
22
22
22
22
23
23
22
27
25
24
24
18
15
11
10
10
19
26
26
22
15
9
9
6
2
2
5
11
12
12
10
5
129
130
0
0
5
14
14
14
14
13
13
13
13
13
20
22
22
20
17
16
17
22
22
26
26
26
26
26
26
26
6
