Division,WeightClassKg,Place,Name,Team,BodyweightKg,Best3SquatKg,Best3BenchKg,Best3DeadliftKg,TotalKg,Equipment,Event,Sex
Boys,55.79,1,Reuben Esquivel,Corsicana,53.8,115.67,65.77,136.08,317.51,Single-ply,SBD,M
Boys,59.87,1,Issac Montemayor,Ennis,58.51,147.42,72.57,156.49,376.48,Single-ply,SBD,M
Boys,59.87,2,Edgar Carrera,Ennis,57.97,131.54,72.57,133.81,337.93,Single-ply,SBD,M
Boys,59.87,DQ,Justice Taylor,Brownsboro,59.87,,83.91,108.86,,Single-ply,SBD,M
Boys,67.13,1,Brent Mason,Brownsboro,65.09,156.49,72.57,124.74,353.8,Single-ply,SBD,M
Boys,67.13,2,Mark Vasquez,Ennis,66.22,108.86,79.38,138.35,326.59,Single-ply,SBD,M
Boys,67.13,3,Dakota Johnson,Brownsboro,66.9,124.74,65.77,127.01,317.51,Single-ply,SBD,M
Boys,67.13,4,Lakeem Christmas,Corsicana,66.95,104.33,63.5,145.15,312.98,Single-ply,SBD,M
Boys,74.84,1,Jason Washburn,Ennis,70.31,181.44,102.06,181.44,464.93,Single-ply,SBD,M
Boys,74.84,2,Rueben Gonzalez,Ennis,69.4,167.83,99.79,190.51,458.13,Single-ply,SBD,M
Boys,74.84,3,Chris Davis,Brownsboro,68.72,142.88,102.06,158.76,403.7,Single-ply,SBD,M
Boys,82.1,1,Eric Montemayor,Ennis,81.01,204.12,111.13,213.19,528.44,Single-ply,SBD,M
Boys,82.1,2,Landon Emmert,Ennis,78.83,197.31,111.13,208.65,517.1,Single-ply,SBD,M
Boys,82.1,3,Tristan Bussell,Brownsboro,76.57,170.1,88.45,174.63,433.18,Single-ply,SBD,M
Boys,82.1,4,Daryl White,Corsicana,81.01,113.4,90.72,136.08,340.19,Single-ply,SBD,M
Boys,82.1,5,Cody Tomlin,Corsicana,79.74,133.81,65.77,122.47,322.05,Single-ply,SBD,M
Boys,89.81,1,Aaron Chitwood,Brownsboro,83.82,204.12,113.4,208.65,526.17,Single-ply,SBD,M
Boys,89.81,2,Tristan Moore,Brownsboro,88.45,195.04,115.67,181.44,492.15,Single-ply,SBD,M
Boys,89.81,3,Lane Harrison,Brownsboro,84.37,156.49,90.72,188.24,435.45,Single-ply,SBD,M
Boys,89.81,4,Josh Seale,Brownsboro,85.87,149.69,111.13,161.03,421.84,Single-ply,SBD,M
Boys,89.81,5,Darius Watson,Corsicana,85.55,147.42,81.65,142.88,371.95,Single-ply,SBD,M
Boys,89.81,6,Ryan Mutina,Corsicana,83.01,136.08,86.18,136.08,358.34,Single-ply,SBD,M
Boys,89.81,7,Hector Gonzales,Brownsboro,88.09,142.88,74.84,124.74,342.46,Single-ply,SBD,M
Boys,89.81,DQ,Jesus Quiroz,Corsicana,89.72,,,124.74,,Single-ply,SBD,M
Boys,99.79,1,Jarrett Hall,Corsicana,94.53,158.76,111.13,204.12,474,Single-ply,SBD,M
Boys,99.79,2,Donovaon Hailey,Corsicana,98.34,147.42,106.59,172.37,426.38,Single-ply,SBD,M
Boys,99.79,3,Quienton Edmerson,Corsicana,92.8,142.88,74.84,149.69,367.41,Single-ply,SBD,M
Boys,99.79,4,Ty Tidwell,Corsicana,92.8,102.06,56.7,113.4,272.16,Single-ply,SBD,M
Boys,99.79,DQ,Jeremy Grant,Corsicana,96.16,174.63,,170.1,,Single-ply,SBD,M
Boys,99.79,DQ,Aaron DeLa Garcia,Brownsboro,99.11,181.44,127.01,,,Single-ply,SBD,M
Boys,109.77,1,Hayden Mahone,Ennis,104.33,215.46,111.13,195.04,521.63,Single-ply,SBD,M
Boys,109.77,2,Davis Bailes,Corsicana,109.23,163.29,106.59,163.29,433.18,Single-ply,SBD,M
Boys,109.77,3,Esteban Lopez,Corsicana,104.69,104.33,83.91,122.47,310.71,Single-ply,SBD,M
Boys,124.74,1,James Lockhart,Ennis,113.4,242.67,145.15,242.67,630.49,Single-ply,SBD,M
Boys,124.74,2,Isaiah Santos,Ennis,124.28,210.92,104.33,210.92,526.17,Single-ply,SBD,M
Boys,124.74,3,Drake Powell,Ennis,114.76,181.44,106.59,204.12,492.15,Single-ply,SBD,M
Boys,124.74,4,Luke Linebaugh,Corsicana,120.66,165.56,79.38,158.76,403.7,Single-ply,SBD,M
Boys,124.74,5,Alex Valencia,Corsicana,114.03,151.95,97.52,149.69,399.16,Single-ply,SBD,M
Boys,124.74,6,Zach Ramos,Brownsboro,113.67,161.03,117.93,111.13,390.09,Single-ply,SBD,M
Boys,124.74,7,John Seaton,Corsicana,111.31,104.33,79.38,142.88,326.59,Single-ply,SBD,M
Boys,124.74,DQ,Julio Campensano,Corsicana,112.85,111.13,,122.47,,Single-ply,SBD,M
Boys,124.74+,1,Montrel Newson,Ennis,161.03,285.76,138.35,226.8,650.91,Single-ply,SBD,M
Boys,124.74+,2,Daniel Ruiz,Corsicana,154.4,213.19,147.42,222.26,582.87,Single-ply,SBD,M
Boys,124.74+,3,Tristen Fritch,Brownsboro,158.44,226.8,140.61,192.78,560.19,Single-ply,SBD,M
Boys,124.74+,4,Juan Gomez,Brownsboro,127.19,238.14,131.54,188.24,557.92,Single-ply,SBD,M
Boys,124.74+,5,Chris Jones,Corsicana,132.63,195.04,115.67,213.19,523.9,Single-ply,SBD,M
Boys,124.74+,6,Trey Long,Corsicana,145.33,199.58,127.01,195.04,521.63,Single-ply,SBD,M
Boys,124.74+,DQ,Bruce Tekell,Ennis,127.91,222.26,122.47,,,Single-ply,SBD,M
