Place,Name,Division,WeightClassKg,BodyweightKg,Age,Best3SquatKg,Best3BenchKg,Best3DeadliftKg,TotalKg,Sex,Equipment,Deadlift4Kg,Bench4Kg,Event
1,Jenna Neeley,Juniors,60,59.69,23,182.5,92.5,157.5,432.5,F,Single-ply,,,SBD
1,Ren Yamashita,Open,52,51.17,21,165,95,142.5,402.5,F,Single-ply,,,SBD
1,Suzanne Hedman,Open,56,54.79,51,155,110,155,420,F,Single-ply,,,SBD
1,Jenna Neeley,Open,60,59.69,23,182.5,92.5,157.5,432.5,F,Single-ply,,,SBD
2,Zandra Cebuano,Open,60,59.87,28,120,57.5,150,327.5,F,Single-ply,,,SBD
3,Emily Jones,Open,60,59.42,27,97.5,55,142.5,295,F,Single-ply,,,SBD
4,Margie Rodgers,Open,60,59.96,25,95,57.5,92.5,245,F,Single-ply,,,SBD
5,Janie Ramirez,Open,60,58.69,33,55,60,87.5,202.5,F,Single-ply,,,SBD
DQ,Georgiann Puckett,Open,60,59.6,46,130,-90,,,F,Single-ply,,,SBD
1,Betsy Spann,Open,67.5,67.31,54,90,60,125,275,F,Single-ply,,,SBD
1,Liz Freel,Open,75,72.03,36,227.5,160,227.5,615,F,Single-ply,,,SBD
1,Nicki I'Anson,Open,90,89.09,45,175,132.5,162.5,470,F,Single-ply,,,SBD
2,Aura Sweeney,Open,90,88.63,31,202.5,112.5,145,460,F,Single-ply,,,SBD
1,Liz Freel,Submasters 35-39,75,72.03,36,227.5,160,227.5,615,F,Single-ply,,,SBD
1,Tass Jones,Masters,48,47.63,45,52.5,37.5,70,160,F,Single-ply,77.5,,SBD
1,Suzanne Hedman,Masters,56,54.79,51,155,110,155,420,F,Single-ply,,,SBD
DQ,Georgiann Puckett,Masters,60,59.6,46,130,-90,,,F,Single-ply,,,SBD
1,Gayle Arrowood,Masters,60,59.51,51,103,60,115,278,F,Single-ply,115.5,,SBD
1,Sabra Callahan,Masters,60,56.52,55,107.5,97.5,122.5,327.5,F,Single-ply,,,SBD
2,Tina Moreno,Masters,60,59.69,56,60,47.5,80,187.5,F,Single-ply,,,SBD
1,Martha King,Masters,67.5,65.77,48,80.5,42.5,105,228,F,Single-ply,,,SBD
1,Karen Parnow,Masters,67.5,65.41,53,105.5,78,122.5,306,F,Single-ply,,,SBD
2,Betsy Spann,Masters,67.5,67.31,54,90,60,125,275,F,Single-ply,,,SBD
DQ,Gia Blackwell,Masters,75,72.76,50,-187.5,92.5,165,,F,Single-ply,,,SBD
1,Zee Helmick,Masters,82.5,80.74,44,87.5,40,100,227.5,F,Single-ply,,,SBD
1,Nicki I'Anson,Masters,90,89.09,45,175,132.5,162.5,470,F,Single-ply,,,SBD
DQ,Josh Puckett,Juniors,82.5,81.47,18,-237.5,,,,M,Single-ply,,,SBD
1,Cameron Willis,Juniors,90,84.01,15,145,92.5,167.5,405,M,Single-ply,,,SBD
1,Vahe Shatakhyan,Juniors,90,88.99,23,207.5,155,265,627.5,M,Single-ply,,,SBD
1,Cole Hale,Juniors,100,92.71,19,185,120,190,495,M,Single-ply,,,SBD
1,Michael Nehme,Juniors,100,96.34,21,237.5,187.5,267.5,692.5,M,Single-ply,,,SBD
1,Brady Jones,Juniors,125,122.47,23,282.5,187.5,302.5,772.5,M,Single-ply,,,SBD
2,Kamuela Wassman,Juniors,125,123.01,23,255,195,285,735,M,Single-ply,,,SBD
3,Grant Hallock,Juniors,125,115.12,22,220,170,237.5,627.5,M,Single-ply,,,SBD
DQ,Dustin Gates,Juniors,125,116.12,22,-295,272.5,265,,M,Single-ply,,,SBD
1,Jonathan Bareng,Open,60,59.78,28,245,165,250,660,M,Single-ply,,,SBD
2,Keary Molinaro,Open,60,59.96,29,162.5,110,160,432.5,M,Single-ply,,,SBD
1,Scott Layman,Open,67.5,64.32,40,250,160,232.5,642.5,M,Single-ply,,,SBD
2,Carlito Bareng,Open,67.5,66.41,31,210,162.5,225,597.5,M,Single-ply,,,SBD
3,Reynaldo Desenganio,Open,67.5,66.22,28,150,150,232.5,532.5,M,Single-ply,,,SBD
4,Chris Loo,Open,67.5,64.59,30,172.5,97.5,182.5,452.5,M,Single-ply,,,SBD
1,Darren Matsumoto,Open,75,74.21,46,275,227.5,230,732.5,M,Single-ply,,,SBD
2,Matthew Reep,Open,75,74.39,37,192.5,190,220,602.5,M,Single-ply,,,SBD
3,Fulton White,Open,75,73.94,52,205,145,235,585,M,Single-ply,,,SBD
4,Joel Christner,Open,75,74.84,34,95,87.5,182.5,365,M,Single-ply,,,SBD
1,Brian Kiraly,Open,82.5,82.28,31,245,182.5,265,692.5,M,Single-ply,,,SBD
2,Damon Thurman,Open,82.5,81.56,26,192.5,165,215,572.5,M,Single-ply,,,SBD
3,LaGarian Smith,Open,82.5,81.28,26,192.5,152.5,222.5,567.5,M,Single-ply,,,SBD
DQ,Justin Pascual,Open,82.5,81.47,24,272.5,-182.5,242.5,,M,Single-ply,,,SBD
DQ,Josh Puckett,Open,82.5,81.47,18,-237.5,,,,M,Single-ply,,,SBD
1,Keith Kanemoto,Open,90,87.27,52,295,207.5,255,757.5,M,Single-ply,,,SBD
2,Nate Olaivar,Open,90,89.99,26,260,207.5,250,717.5,M,Single-ply,,,SBD
3,Vahe Shatakhyan,Open,90,88.99,23,207.5,155,265,627.5,M,Single-ply,,,SBD
4,Brian Bullman,Open,90,88.09,33,227.5,160,227.5,615,M,Single-ply,,,SBD
5,Se Won Kim,Open,90,85.09,32,195,150,200,545,M,Single-ply,,,SBD
6,Juan Mendoza,Open,90,87.54,26,137.5,122.5,200,460,M,Single-ply,,,SBD
7,Roosevelt Jones,Open,90,88.36,25,162.5,117.5,155,435,M,Single-ply,,,SBD
DQ,Matthew Vizcarra,Open,90,88.99,26,-237.5,,,,M,Single-ply,,,SBD
1,George Pessell,Open,100,98.97,52,290,210,310,810,M,Single-ply,,,SBD
2,Ben O'Brien,Open,100,99.34,32,277.5,237.5,292.5,807.5,M,Single-ply,,240,SBD
3,Victor Calia,Open,100,97.52,47,277.5,222.5,290,790,M,Single-ply,,,SBD
4,Robert South,Open,100,99.16,38,242.5,230,265,737.5,M,Single-ply,,,SBD
5,Michael Nehme,Open,100,96.34,21,237.5,187.5,267.5,692.5,M,Single-ply,,,SBD
6,Jonathan Haley,Open,100,99.52,27,237.5,145,272.5,655,M,Single-ply,,,SBD
7,Douglas Tice,Open,100,95.07,28,240,182.5,227.5,650,M,Single-ply,,,SBD
8,John DeLuca,Open,100,97.07,41,232.5,200,212.5,645,M,Single-ply,,,SBD
1,Mike Tronske,Open,110,107.68,47,305,227.5,320,852.5,M,Single-ply,,,SBD
2,Karl Davenport,Open,110,100.97,46,205,130,220,555,M,Single-ply,,,SBD
DQ,Chase Collins,Open,110,105.51,24,-237.5,242.5,200,,M,Single-ply,,,SBD
1,Paul Tabone,Open,125,122.38,32,272.5,217.5,272.5,762.5,M,Single-ply,,,SBD
2,Kamuela Wassman,Open,125,123.01,23,255,195,285,735,M,Single-ply,,,SBD
3,Mark Langston,Open,125,122.38,42,260,192.5,275,727.5,M,Single-ply,,,SBD
4,Ron Garcia,Open,125,114.67,48,205,182.5,200,587.5,M,Single-ply,,,SBD
1,David Douglas,Open,140,129,24,242.5,317.5,305,865,M,Single-ply,,,SBD
DQ,Scott Cartwright,Open,140+,151.14,41,457.5,-330,,,M,Single-ply,,,SBD
1,Matthew Reep,Submasters 35-39,75,74.39,37,192.5,190,220,602.5,M,Single-ply,,,SBD
1,Rudy Garcia,Submasters 35-39,82.5,80.92,36,217.5,170,205,592.5,M,Single-ply,,,SBD
2,Edwin Julien,Submasters 35-39,82.5,81.1,37,182.5,120,210,512.5,M,Single-ply,,,SBD
3,Luis Negrete,Submasters 35-39,82.5,81.19,38,142.5,107.5,182.5,432.5,M,Single-ply,,,SBD
1,Robert South,Submasters 35-39,100,99.16,38,242.5,230,265,737.5,M,Single-ply,,,SBD
1,Scott Richey,Masters,56,55.88,53,157.5,107.5,175,440,M,Single-ply,,,SBD
1,Scott Layman,Masters,67.5,64.32,40,250,160,232.5,642.5,M,Single-ply,,,SBD
1,Darren Matsumoto,Masters,75,74.21,46,275,227.5,230,732.5,M,Single-ply,,,SBD
1,Ron Scott,Masters,75,71.49,65,175,95,200,470,M,Single-ply,,,SBD
1,Henry Brownstein,Masters,75,74.39,71,132.5,92.5,160,385,M,Single-ply,,,SBD
1,Jose Hernandez,Masters,82.5,81.19,43,227.5,147.5,220,595,M,Single-ply,,,SBD
1,John Killin,Masters,82.5,82.01,62,185,107.5,200,492.5,M,Single-ply,,,SBD
1,Roy Taylor,Masters,82.5,82.42,71,145,70,195,410,M,Single-ply,,,SBD
1,Keith Kanemoto,Masters,90,87.27,52,295,207.5,255,757.5,M,Single-ply,,,SBD
1,Lothar Vallot,Masters,90,88.9,59,142.5,105,157.5,405,M,Single-ply,,,SBD
1,Bob Kinsey,Masters,90,87.82,69,137.5,85,160,382.5,M,Single-ply,,,SBD
1,Kevin Aubel,Masters,100,96.43,41,240,172.5,287.5,700,M,Single-ply,,,SBD
2,John DeLuca,Masters,100,97.07,41,232.5,200,212.5,645,M,Single-ply,,,SBD
3,Pete Richter,Masters,100,94.44,41,185,105,232.5,522.5,M,Single-ply,,,SBD
4,Gary Strassberg,Masters,100,94.8,42,112.5,100,180,392.5,M,Single-ply,,,SBD
1,Victor Calia,Masters,100,97.52,47,277.5,222.5,290,790,M,Single-ply,,,SBD
2,Jerry Tremblay,Masters,100,98.34,48,282.5,182.5,272.5,737.5,M,Single-ply,,,SBD
3,Jonathan Wiseman,Masters,100,98.34,46,275,172.5,255,702.5,M,Single-ply,,,SBD
1,George Pessell,Masters,100,98.97,52,290,210,310,810,M,Single-ply,,,SBD
2,Michael Womelsdorf,Masters,100,95.8,53,140,130,160,430,M,Single-ply,,,SBD
1,Michael Musto,Masters,100,98.7,56,265,197.5,265,727.5,M,Single-ply,,,SBD
1,Edwin Lewis,Masters,100,94.44,62,227.5,142.5,227.5,597.5,M,Single-ply,,,SBD
1,Howard Myers,Masters,100,94.53,65,215,160,277.5,652.5,M,Single-ply,,,SBD
DQ,Ken Carpenter,Masters,100,92.99,68,-205,,,,M,Single-ply,,,SBD
1,Mike Tronske,Masters,110,107.68,47,305,227.5,320,852.5,M,Single-ply,,,SBD
2,Karl Davenport,Masters,110,100.97,46,205,130,220,555,M,Single-ply,,,SBD
1,Wayne Jandoc,Masters,110,106.87,53,280,215,255,750,M,Single-ply,,,SBD
2,Brett Hallock,Masters,110,102.42,53,182.5,157.5,210,550,M,Single-ply,,,SBD
1,Todd Kezerian,Masters,110,108.14,55,212.5,172.5,200,585,M,Single-ply,,,SBD
1,Ron Pagal,Masters,110,103.6,65,205,160,215,580,M,Single-ply,,,SBD
1,Mark Langston,Masters,125,122.38,42,260,192.5,275,727.5,M,Single-ply,,,SBD
2,Toby Edison,Masters,125,121.65,41,215,185,220,620,M,Single-ply,,,SBD
1,Ron Garcia,Masters,125,114.67,48,205,182.5,200,587.5,M,Single-ply,,,SBD
1,Joe Dentice,Masters,125,117.03,52,212.5,182.5,245,640,M,Single-ply,,,SBD
1,Bill McEwen,Masters,125,119.29,57,185,122.5,185,492.5,M,Single-ply,,,SBD
2,Mike Grein,Masters,125,110.77,55,160,132.5,190,482.5,M,Single-ply,,,SBD
DQ,Scott Cartwright,Masters,140+,151.14,41,457.5,-330,,,M,Single-ply,,,SBD
1,Brian Meek,Masters,140,125.28,65,255,172.5,227.5,655,M,Single-ply,,,SBD
1,Emily Jones,Open USAF,60,59.42,27,97.5,55,142.5,295,F,Single-ply,,,SBD
2,Margie Rodgers,Open USMC,60,59.96,25,95,57.5,92.5,245,F,Single-ply,,,SBD
1,Cole Hale,Juniors USN,100,92.71,19,185,120,190,495,M,Single-ply,,,SBD
1,Keary Molinaro,Open USMC,60,59.96,29,162.5,110,160,432.5,M,Single-ply,,,SBD
1,Reynaldo Desenganio,Open USMC,67.5,66.22,28,150,150,232.5,532.5,M,Single-ply,,,SBD
1,Matthew Reep,Open USMC,75,74.39,37,192.5,190,220,602.5,M,Single-ply,,,SBD
2,Fulton White,Open USAF Vet,75,73.94,52,205,145,235,585,M,Single-ply,,,SBD
1,Brian Kiraly,Open USMC,82.5,82.28,31,245,182.5,265,692.5,M,Single-ply,,,SBD
2,Damon Thurman,Open USAF,82.5,81.56,26,192.5,165,215,572.5,M,Single-ply,,,SBD
3,LaGarian Smith,Open USMC,82.5,81.28,26,192.5,152.5,222.5,567.5,M,Single-ply,,,SBD
DQ,Justin Pascual,Open USN,82.5,81.47,24,272.5,-182.5,242.5,,M,Single-ply,,,SBD
1,Se Won Kim,Open USMC,90,85.09,32,195,150,200,545,M,Single-ply,,,SBD
2,Juan Mendoza,Open USMC,90,87.54,26,137.5,122.5,200,460,M,Single-ply,,,SBD
3,Roosevelt Jones,Open USMC,90,88.36,25,162.5,117.5,155,435,M,Single-ply,,,SBD
1,Ben O'Brien,Open USAF,100,99.34,32,277.5,237.5,292.5,807.5,M,Single-ply,,240,SBD
2,Jonathan Haley,Open USMC,100,99.52,27,237.5,145,272.5,655,M,Single-ply,,,SBD
3,Douglas Tice,Open USN,100,95.07,28,240,182.5,227.5,650,M,Single-ply,,,SBD
1,David Douglas,Open USMC,140,129,24,242.5,317.5,305,865,M,Single-ply,,,SBD
1,Rudy Garcia,Submasters USAF,82.5,80.92,36,217.5,170,205,592.5,M,Single-ply,,,SBD
2,Edwin Julien,Submasters USMC,82.5,81.1,37,182.5,120,210,512.5,M,Single-ply,,,SBD
1,Fulton White,Masters USAF Vet,75,73.94,52,205,145,235,585,M,Single-ply,,,SBD
1,Bob Kinsey,Masters USAF Vet,90,87.82,69,137.5,85,160,382.5,M,Single-ply,,,SBD
1,Toby Edison,Masters USAF,125,121.65,41,215,185,220,620,M,Single-ply,,,SBD
1,Gairett Pirkig,Open,100,99.7,29,350,280,280,910,M,Multi-ply,,,SBD
2,Alex Mohr,Open,100,96.43,23,347.5,220,300,867.5,M,Multi-ply,,,SBD
3,Travis Grenon,Open,100,96.8,21,310,220,265,795,M,Multi-ply,,,SBD
4,Stephen Bartlett,Open,100,98.07,26,302.5,227.5,255,785,M,Multi-ply,,,SBD
1,Ken Wheeler,Open,110,107.59,57,340,157.5,252.5,750,M,Multi-ply,,,SBD
DQ,JR Mancini,Open,110,106.5,32,332.5,-230,,,M,Multi-ply,,,SBD
1,Andreas Gallagher,Open,125,121.47,30,422.5,330,320,1072.5,M,Multi-ply,,,SBD
2,Dalen Randa,Open,125,116.94,44,365,182.5,302.5,850,M,Multi-ply,,,SBD
3,Jeremy Schraw,Open,125,118.66,23,320,175,272.5,767.5,M,Multi-ply,,,SBD
4,Rich Manley,Open,125,120.2,28,290,195,272.5,757.5,M,Multi-ply,,,SBD
1,Bill Newman,Open,140,136.98,27,410,292.5,322.5,1025,M,Multi-ply,,,SBD
2,Robert Lee,Open,140,134.26,34,365,295,250,910,M,Multi-ply,,,SBD
DQ,Mark Folweiler,Open,140+,182.71,20,370,-252.5,,,M,Multi-ply,,,SBD
1,Ken Wheeler,Masters,110,107.59,57,340,157.5,252.5,750,M,Multi-ply,,,SBD
1,Tony Rodenburg,Masters,125,118.12,54,155,125,230,510,M,Multi-ply,,,SBD
1,London Chow,Juniors,52,49.8,15,,40,,40,F,Single-ply,,,B
1,Shanrekia Bower,Submasters 35-39,90+,123.83,35,,150,,150,F,Single-ply,,,B
1,Gayle Arrowood,Masters,60,59.87,51,,58,,58,F,Single-ply,,,B
1,Trace Ryan,Masters,67.5,66.86,41,,65,,65,F,Single-ply,,,B
1,Karen Parnow,Masters,67.5,65.59,53,,77.5,,77.5,F,Single-ply,,78,B
1,Tracie Marquez,Masters,90,88.99,48,,67.5,,67.5,F,Single-ply,,,B
1,Garrett Fulbright,Juniors,67.5,67.4,19,,120,,120,M,Single-ply,,,B
1,Lester Dedrick,Juniors,140+,213.19,17,,185,,185,M,Single-ply,,,B
1,Matt Kinsell,Open,67.5,67.04,35,,160,,160,M,Single-ply,,,B
1,Anthony Fregoso,Open,90,86.82,34,,140,,140,M,Single-ply,,,B
1,Stacy Dedrick,Open,100,97.79,46,,230,,230,M,Single-ply,,,B
DQ,John Bostick,Open,100,99.61,40,,-222.5,,,M,Single-ply,,,B
1,Jim Chaaban,Open,110,108.59,43,,250,,250,M,Single-ply,,,B
1,Dennis Reneau,Open,125,111.58,40,,330,,330,M,Single-ply,,,B
DQ,Scott Hoekstra,Open,125,123.01,44,,-325,,,M,Single-ply,,,B
1,Alan Aerts,Open,140,125.55,55,,210,,210,M,Single-ply,,,B
1,Michael Bowden,Open,140+,148.78,49,,300,,300,M,Single-ply,,,B
DQ,Rich Lopez,Open,140+,156.4,40,,-295,,,M,Single-ply,,,B
1,Matt Kinsell,Submasters 35-39,67.5,67.04,35,,160,,160,M,Single-ply,,,B
1,Marc White,Submasters 35-39,110,106.41,39,,245,,245,M,Single-ply,,,B
1,Jim Merlino,Masters,75,70.4,73,,102.5,,102.5,M,Single-ply,,,B
1,Harry Packer,Masters,90,84.01,76,,70,,70,M,Single-ply,,,B
1,John Sanchez,Masters,90,87.09,64,,67.5,,67.5,M,Single-ply,,,B
1,Rudy Lozano,Masters,90,86,71,,175,,175,M,Single-ply,,,B
DQ,John Bostick,Masters,100,99.61,40,,-222.5,,,M,Single-ply,,,B
1,Stacy Dedrick,Masters,100,97.79,46,,230,,230,M,Single-ply,,,B
2,Hoddy Fritz,Masters,100,96.71,45,,175,,175,M,Single-ply,,,B
1,Jim Chaaban,Masters,110,108.59,43,,250,,250,M,Single-ply,,,B
1,Jeff Hunter,Masters,110,108.14,50,,242.5,,242.5,M,Single-ply,,,B
1,Bob Evans #1,Masters,110,109.59,64,,185,,185,M,Single-ply,,,B
1,Dennis Reneau,Masters,125,111.58,40,,330,,330,M,Single-ply,,,B
2,Gary Witcher,Masters,125,123.29,41,,200,,200,M,Single-ply,,,B
DQ,Scott Hoekstra,Masters,125,123.01,44,,-325,,,M,Single-ply,,,B
1,Alan Aerts,Masters,140,125.55,55,,210,,210,M,Single-ply,,,B
1,Ron Moormeister,Masters,140,126.19,64,,237.5,,237.5,M,Single-ply,,,B
DQ,Rich Lopez,Masters,140+,156.4,40,,-295,,,M,Single-ply,,,B
1,Mike Bowden,Masters,140+,148.78,49,,300,,300,M,Single-ply,,,B
1,Dennis Reneau,Open USMC Vet,125,111.58,40,,330,,330,M,Single-ply,,,B
1,David Douglas,Open USMC,140,131.72,24,,335,,335,M,Single-ply,,,B
1,Jim Chaaban,Masters USMC Vet,110,108.59,43,,250,,250,M,Single-ply,,,B
1,Ronald Cox,Masters Army,110,107.23,50,,150,,150,M,Single-ply,,,B
1,Bob Evans #1,Masters USN Vet,110,109.59,64,,185,,185,M,Single-ply,,,B
1,Dennis Reneau,Masters USMC Vet,125,111.58,40,,330,,330,M,Single-ply,,,B
1,Ron Moormeister,Masters Army Vet,140,126.19,64,,237.5,,237.5,M,Single-ply,,,B
DQ,Jade Mendelson,Juniors,90,87.54,14,,-130,,,F,Multi-ply,,,B
1,Maricelle Mendelson,Open,90+,105.41,38,,132.5,,132.5,F,Multi-ply,,,B
DQ,Chris Larson #1,Juniors,90,86.27,16,,-122.5,,,M,Multi-ply,,,B
1,Matthew Daisa,Open,75,73.57,34,,200,,200,M,Multi-ply,,,B
1,Clay Tawzer,Open,140+,159.66,28,,200,,200,M,Multi-ply,,,B
DQ,Scot Mendelson,Open,140,139.43,42,,-502.5,,,M,Multi-ply,,,B
1,Ken Tawzer,Masters,125,115.67,59,,195,,195,M,Multi-ply,,,B
1,Bonnie Aerts,Open,56,54.7,52,,,123,123,F,Single-ply,,,D
1,Anna Pearson,Open,60,59.6,29,,,120,120,F,Single-ply,,,D
1,Lynne Castellanos,Open,67.5,65.5,52,,,125,125,F,Single-ply,,,D
2,Betsy Spann,Open,67.5,67.4,54,,,125,125,F,Single-ply,,,D
1,Shanrekia Bower,Submasters 35-39,90+,123.83,35,,,215,215,F,Single-ply,,,D
1,Bonnie Aerts,Masters,56,54.7,52,,,123,123,F,Single-ply,,,D
1,Conny Marinos,Masters,60,58.6,43,,,92.5,92.5,F,Single-ply,,,D
1,Gayle Arrowood,Masters,60,59.87,51,,,115,115,F,Single-ply,,,D
1,Trace Ryan,Masters,67.5,66.86,41,,,130,130,F,Single-ply,,,D
1,Nancy Navarrette,Masters,67.5,62.96,49,,,100,100,F,Single-ply,,,D
1,Lynne Castellanos,Masters,67.5,65.5,52,,,125,125,F,Single-ply,,,D
2,Betsy Spann,Masters,67.5,66.41,54,,,125,125,F,Single-ply,,,D
3,Dagmar Nelson,Masters,67.5,64.95,50,,,100,100,F,Single-ply,,,D
1,Linda Adam,Masters,67.5,60.51,56,,,97.5,97.5,F,Single-ply,,,D
1,Tracie Marquez,Masters,90,88.99,48,,,122.5,122.5,F,Single-ply,,,D
1,Garrett Fulbright,Juniors,67.5,67.4,19,,,197.5,197.5,M,Single-ply,,,D
1,Jason Kelske,Open,90,89.27,29,,,295,295,M,Single-ply,,,D
2,Peter Tapia,Open,90,87.54,41,,,227.5,227.5,M,Single-ply,,,D
3,Anthony Fregoso,Open,90,86.82,34,,,202.5,202.5,M,Single-ply,,,D
1,John Bostick,Open,100,99.61,40,,,300,300,M,Single-ply,,,D
1,Marc White,Open,110,106.41,39,,,295,295,M,Single-ply,,,D
1,Marc White,Submasters 35-39,110,106.41,39,,,295,295,M,Single-ply,,,D
1,David Foster,Masters,90,88.63,42,,,250,250,M,Single-ply,,,D
2,Peter Tapia,Masters,90,87.54,41,,,227.5,227.5,M,Single-ply,,,D
1,John Sanchez,Masters,90,87.09,64,,,137.5,137.5,M,Single-ply,,,D
1,John Bostick,Masters,100,99.61,40,,,300,300,M,Single-ply,,,D
2,Gary Strassberg,Masters,100,95.07,42,,,187.5,187.5,M,Single-ply,,,D
1,Jonathan Dean,Masters,100,97.34,47,,,230,230,M,Single-ply,,,D
1,Jeff Hunter,Masters,110,108.14,50,,,217.5,217.5,M,Single-ply,,,D
1,Joe Dentice,Masters,125,117.84,52,,,237.5,237.5,M,Single-ply,,,D
1,Juan Mendoza,Open USMC,90,86.18,26,,,197.5,197.5,M,Single-ply,,,D
1,Jonathan Dean,Masters USMC Vet,100,97.34,47,,,230,230,M,Single-ply,,,D
