Division,WeightClassKg,Place,Name,Team,BodyweightKg,Best3SquatKg,Best3BenchKg,Best3DeadliftKg,TotalKg,Equipment,Event,Sex
Boys,51.71,1,Gordon Griesel,Fort Worth Boswell,51.35,104.33,61.23,111.13,276.69,Single-ply,SBD,M
Boys,55.79,1,Anthony Phimmasone,Fort Worth Boswell,55.79,140.61,83.91,165.56,390.09,Single-ply,SBD,M
Boys,55.79,2,Arian Queriman,White Settlement Brewer,55.11,147.42,65.77,142.88,356.07,Single-ply,SBD,M
Boys,55.79,3,Nate Sylakhom,Fort Worth Boswell,54.16,131.54,61.23,158.76,351.53,Single-ply,SBD,M
Boys,59.87,1,Jacob Densmore,Fort Worth Chisholm Trail,59.42,124.74,74.84,136.08,335.66,Single-ply,SBD,M
Boys,59.87,2,John Davis,White Settlement Brewer,58.33,122.47,65.77,122.47,310.71,Single-ply,SBD,M
Boys,67.13,1,Colt Edwards,Fort Worth Boswell,67.13,181.44,102.06,165.56,449.06,Single-ply,SBD,M
Boys,67.13,2,Richard Taylor,Fort Worth Boswell,66.77,145.15,113.4,170.1,428.64,Single-ply,SBD,M
Boys,67.13,3,Austin Lambert,White Settlement Brewer,64.95,156.49,86.18,170.1,412.77,Single-ply,SBD,M
Boys,67.13,4,Ethan Hudson,Fort Worth Boswell,66.13,142.88,97.52,149.69,390.09,Single-ply,SBD,M
Boys,67.13,DQ,Julian Hebrard,Fort Worth Paschal,60.51,,,,,Single-ply,SBD,M
Boys,74.84,1,Tyler Sarriera,White Settlement Brewer,73.89,156.49,117.93,176.9,451.32,Single-ply,SBD,M
Boys,74.84,2,Deon Lipscomb,Fort Worth Boswell,74.66,147.42,104.33,154.22,405.97,Single-ply,SBD,M
Boys,74.84,3,Cj Newton,Fort Worth Chisholm Trail,70.62,147.42,88.45,167.83,403.7,Single-ply,SBD,M
Boys,74.84,4,Carson Counts,Fort Worth Boswell,74.84,147.42,92.99,161.03,401.43,Single-ply,SBD,M
Boys,74.84,5,Cj Houston,White Settlement Brewer,70.31,142.88,102.06,147.42,392.36,Single-ply,SBD,M
Boys,74.84,6,Matthew Davis,Fort Worth Boswell,73.94,142.88,79.38,138.35,360.61,Single-ply,SBD,M
Boys,74.84,7,Jaden Fisher,Fort Worth Chisholm Trail,69.4,136.08,77.11,142.88,356.07,Single-ply,SBD,M
Boys,74.84,8,Gianni Roberts,Fort Worth Paschal,73.75,104.33,70.31,142.88,317.51,Single-ply,SBD,M
Boys,74.84,DQ,Zaiid Mares,White Settlement Brewer,73.03,117.93,,,,Single-ply,SBD,M
Boys,82.1,1,Dylan Allsbrooks,Fort Worth Boswell,81.92,174.63,129.27,185.97,489.88,Single-ply,SBD,M
Boys,82.1,2,Sean Parnell,Fort Worth Paschal,76.2,174.63,92.99,174.63,442.25,Single-ply,SBD,M
Boys,82.1,3,Jorge Alavarez,Fort Worth Boswell,76.48,156.49,104.33,172.37,433.18,Single-ply,SBD,M
Boys,82.1,4,Garrett Maile,Fort Worth Chisholm Trail,75.75,136.08,104.33,158.76,399.16,Single-ply,SBD,M
Boys,82.1,DQ,Jaden Morris,Fort Worth Paschal,76.66,102.06,68.04,,,Single-ply,SBD,M
Boys,82.1,DQ,Brandon Ramos,White Settlement Brewer,81.65,142.88,90.72,,,Single-ply,SBD,M
Boys,89.81,1,Joshua Mork,Fort Worth Boswell,89.63,231.33,165.56,247.21,644.1,Single-ply,SBD,M
Boys,89.81,2,Carson Cato,White Settlement Brewer,89.63,181.44,136.08,204.12,521.63,Single-ply,SBD,M
Boys,89.81,3,Colby Dear,White Settlement Brewer,85.37,181.44,111.13,204.12,496.68,Single-ply,SBD,M
Boys,89.81,4,Jovone Melendez,Fort Worth Boswell,86,181.44,117.93,197.31,496.68,Single-ply,SBD,M
Boys,89.81,5,Christian McClain,Fort Worth Chisholm Trail,89.36,158.76,117.93,190.51,467.2,Single-ply,SBD,M
Boys,89.81,6,James Webb,Fort Worth Chisholm Trail,89.36,181.44,92.99,190.51,464.93,Single-ply,SBD,M
Boys,89.81,7,Oscar Campos,Fort Worth Paschal,83.05,170.1,97.52,190.51,458.13,Single-ply,SBD,M
Boys,89.81,8,Josh Martinez,Fort Worth Boswell,83.82,181.44,106.59,167.83,455.86,Single-ply,SBD,M
Boys,89.81,9,De'marques Henry,White Settlement Brewer,87.36,156.49,108.86,158.76,424.11,Single-ply,SBD,M
Boys,89.81,10,Trent Lowry,Fort Worth Chisholm Trail,84.19,149.69,88.45,181.44,419.57,Single-ply,SBD,M
Boys,89.81,11,Parker Anderson,Fort Worth Boswell,84.37,149.69,83.91,167.83,401.43,Single-ply,SBD,M
Boys,89.81,DQ,Kody Clark,Fort Worth Chisholm Trail,86.64,129.27,,,,Single-ply,SBD,M
Boys,99.79,1,Gannon Slovacek,Fort Worth Boswell,97.16,188.24,138.35,208.65,535.24,Single-ply,SBD,M
Boys,99.79,2,Trent Hubbert,Fort Worth Boswell,96.62,174.63,102.06,195.04,471.74,Single-ply,SBD,M
Boys,99.79,3,Timothy Worley,White Settlement Brewer,97.7,174.63,102.06,172.37,449.06,Single-ply,SBD,M
Boys,99.79,4,Nathan Stamps,Fort Worth Paschal,94.71,163.29,86.18,188.24,437.72,Single-ply,SBD,M
Boys,99.79,5,Felix Rodriguez,Fort Worth Paschal,98.79,156.49,88.45,183.7,428.64,Single-ply,SBD,M
Boys,99.79,6,Jose Serrano,Fort Worth Chisholm Trail,93.89,149.69,108.86,161.03,419.57,Single-ply,SBD,M
Boys,99.79,7,Nick Rangel,Fort Worth Paschal,99.52,158.76,77.11,172.37,408.23,Single-ply,SBD,M
Boys,99.79,8,Danny Simmons,Fort Worth Chisholm Trail,95.25,149.69,97.52,156.49,403.7,Single-ply,SBD,M
Boys,99.79,9,Garrett Palmer,Fort Worth Boswell,93.8,145.15,102.06,154.22,401.43,Single-ply,SBD,M
Boys,109.77,1,Keondre Vassar,Fort Worth Boswell,104.42,244.94,154.22,231.33,630.49,Single-ply,SBD,M
Boys,109.77,2,Matthew Michaels,Fort Worth Boswell,107.23,195.04,122.47,181.44,498.95,Single-ply,SBD,M
Boys,109.77,3,Hayden Herfkens,Fort Worth Chisholm Trail,107.95,154.22,113.4,176.9,444.52,Single-ply,SBD,M
Boys,109.77,4,Junias Kasongo,Fort Worth Chisholm Trail,103.56,163.29,92.99,181.44,437.72,Single-ply,SBD,M
Boys,109.77,5,Wilson Crouch,Fort Worth Chisholm Trail,105.23,158.76,102.06,176.9,437.72,Single-ply,SBD,M
Boys,109.77,6,Gavin Greenfield,Fort Worth Chisholm Trail,104.55,174.63,90.72,165.56,430.91,Single-ply,SBD,M
Boys,109.77,7,Salih Hidic,Fort Worth Paschal,108,149.69,86.18,165.56,401.43,Single-ply,SBD,M
Boys,124.74,1,Isaac Vielma,White Settlement Brewer,123.97,244.94,142.88,217.72,605.55,Single-ply,SBD,M
Boys,124.74,2,Juan Garcia,Fort Worth Chisholm Trail,117.93,190.51,108.86,190.51,489.88,Single-ply,SBD,M
Boys,124.74,3,Edgar Ramirez,Fort Worth Paschal,111.31,183.7,97.52,183.7,464.93,Single-ply,SBD,M
Boys,124.74,4,Marco Moreno,Fort Worth Paschal,122.2,170.1,92.99,170.1,433.18,Single-ply,SBD,M
Boys,124.74,5,Braeden Wright,Fort Worth Boswell,115.39,151.95,86.18,190.51,428.64,Single-ply,SBD,M
Boys,124.74,6,Julian Campa,Fort Worth Boswell,122.83,149.69,90.72,158.76,399.16,Single-ply,SBD,M
Boys,124.74+,1,Ryan Morales,Fort Worth Boswell,131.72,204.12,136.08,192.78,532.97,Single-ply,SBD,M
Boys,124.74+,2,Aidan Tremaine,Fort Worth Boswell,136.08,181.44,117.93,210.92,510.29,Single-ply,SBD,M
Boys,124.74+,3,James Ybarra,Fort Worth Chisholm Trail,139.84,204.12,113.4,192.78,510.29,Single-ply,SBD,M
Boys,124.74+,4,Barry Gorman,Fort Worth Chisholm Trail,135.35,183.7,106.59,185.97,476.27,Single-ply,SBD,M
Boys,124.74+,5,Grisham Jennings,Fort Worth Paschal,126.46,129.27,77.11,147.42,353.8,Single-ply,SBD,M
Boys,124.74+,DQ,Nehemiah Redden,Fort Worth Paschal,166.29,117.93,61.23,,,Single-ply,SBD,M
