Division,WeightClassKg,Place,Name,Team,BodyweightKg,Best3SquatKg,Best3BenchKg,Best3DeadliftKg,TotalKg,Equipment,Event,Sex
Boys,51.71,1,Darrian Clark,Lorena,46.36,124.74,63.5,138.35,326.59,Single-ply,SBD,M
Boys,51.71,2,Cameron Sams,Lorena,51.26,117.93,68.04,108.86,294.84,Single-ply,SBD,M
Boys,51.71,3,Hunter Burkhalter,College Station A&M Cons,51.26,99.79,56.7,99.79,256.28,Single-ply,SBD,M
Boys,51.71,4,Tj Collins,Robinson,50.8,90.72,47.63,104.33,242.67,Single-ply,SBD,M
Boys,51.71,5,Haden Sechelski,Anderson-Shiro,50.98,79.38,56.7,102.06,238.14,Single-ply,SBD,M
Boys,55.79,1,Faison Stroup,Waco University,54.93,149.69,74.84,161.03,385.55,Single-ply,SBD,M
Boys,55.79,2,Elijah Lascurain,College Station A&M Cons,55.38,136.08,92.99,142.88,371.95,Single-ply,SBD,M
Boys,55.79,3,Levi Goudeau,Anderson-Shiro,55.16,133.81,77.11,124.74,335.66,Single-ply,SBD,M
Boys,55.79,4,Ryan Wisnoski,Anderson-Shiro,55.7,127.01,61.23,129.27,317.51,Single-ply,SBD,M
Boys,59.87,1,Michael Moore,Lorena,59.87,122.47,61.23,127.01,310.71,Single-ply,SBD,M
Boys,59.87,2,Caden Crenshaw,Lorena,57.79,117.93,54.43,136.08,308.44,Single-ply,SBD,M
Boys,59.87,3,Caleb Blanek,Lorena,58.97,113.4,68.04,115.67,297.1,Single-ply,SBD,M
Boys,59.87,4,Caleb Tolbert,Lorena,59.24,115.67,58.97,108.86,283.5,Single-ply,SBD,M
Boys,59.87,5,John Mann,Lorena,58.88,102.06,70.31,104.33,276.69,Single-ply,SBD,M
Boys,59.87,6,Nic Rodriguez,College Station A&M Cons,58.51,102.06,63.5,95.25,260.82,Single-ply,SBD,M
Boys,59.87,7,Elijah Hauswirth,College Station A&M Cons,59.87,102.06,56.7,92.99,251.74,Single-ply,SBD,M
Boys,59.87,DQ,Brylan Davis,College Station A&M Cons,58.97,,,,,Single-ply,SBD,M
Boys,67.13,1,Makye Kao,College Station A&M Cons,65.32,181.44,120.2,195.04,496.68,Single-ply,SBD,M
Boys,67.13,2,Alex Flores,Anderson-Shiro,66.86,176.9,106.59,190.51,474,Single-ply,SBD,M
Boys,67.13,3,Jaden Sanders,Waco University,65.86,142.88,92.99,149.69,385.55,Single-ply,SBD,M
Boys,67.13,4,Truman Jasperson,College Station A&M Cons,66.36,131.54,97.52,140.61,369.68,Single-ply,SBD,M
Boys,67.13,5,Diego Moya,College Station A&M Cons,61.23,140.61,79.38,147.42,367.41,Single-ply,SBD,M
Boys,67.13,6,Trey Stout,Robinson,60.92,138.35,79.38,131.54,349.27,Single-ply,SBD,M
Boys,67.13,7,Dakota Newton,College Station A&M Cons,63.5,131.54,83.91,127.01,342.46,Single-ply,SBD,M
Boys,67.13,8,Tucker Backhus,Anderson-Shiro,63.32,113.4,61.23,106.59,281.23,Single-ply,SBD,M
Boys,74.84,1,Sebastion Evans,Waco University,70.13,174.63,111.13,183.7,469.47,Single-ply,SBD,M
Boys,74.84,2,Seth Vela,Waco University,72.08,170.1,108.86,176.9,455.86,Single-ply,SBD,M
Boys,74.84,3,Dj May,College Station A&M Cons,71.21,181.44,92.99,165.56,439.98,Single-ply,SBD,M
Boys,74.84,4,Ben Smedshammer,Lorena,74.07,170.1,90.72,167.83,428.64,Single-ply,SBD,M
Boys,74.84,5,Chalon Pratt,Anderson-Shiro,71.03,163.29,99.79,154.22,417.3,Single-ply,SBD,M
Boys,74.84,6,Hunter Speasmaker,Robinson,71.21,154.22,102.06,151.95,408.23,Single-ply,SBD,M
Boys,74.84,7,Luke Fisher,Robinson,69.85,136.08,79.38,151.95,367.41,Single-ply,SBD,M
Boys,74.84,8,Bennett Huntchinson,College Station A&M Cons,72.57,136.08,79.38,136.08,351.53,Single-ply,SBD,M
Boys,74.84,9,Brandon Kendrick,Robinson,74.43,136.08,72.57,142.88,351.53,Single-ply,SBD,M
Boys,74.84,10,Tanner Lightsey,College Station A&M Cons,71.67,136.08,72.57,136.08,344.73,Single-ply,SBD,M
Boys,74.84,11,Nick Gabrielsen,Robinson,73.48,81.65,47.63,97.52,226.8,Single-ply,SBD,M
Boys,82.1,1,Logan Sauer,Robinson,80.83,195.04,117.93,185.97,498.95,Single-ply,SBD,M
Boys,82.1,2,Dj Offing,Anderson-Shiro,78.29,181.44,102.06,170.1,453.59,Single-ply,SBD,M
Boys,82.1,3,Antonio Cardenas,College Station A&M Cons,76.2,167.83,102.06,156.49,426.38,Single-ply,SBD,M
Boys,82.1,4,David Wagner,Robinson,77.7,147.42,83.91,174.63,405.97,Single-ply,SBD,M
Boys,82.1,5,Reed Michna,Lorena,77.29,158.76,83.91,156.49,399.16,Single-ply,SBD,M
Boys,82.1,6,Jaice Blancett,Lorena,81.19,136.08,83.91,145.15,365.14,Single-ply,SBD,M
Boys,82.1,DQ,Lyndon Williams,College Station A&M Cons,75.93,,,,,Single-ply,SBD,M
Boys,89.81,1,Cooper Wagenschein,Robinson,89.81,213.19,108.86,204.12,526.17,Single-ply,SBD,M
Boys,89.81,2,Josh Gunn,Robinson,88.99,190.51,129.27,190.51,510.29,Single-ply,SBD,M
Boys,89.81,3,Caden Yorek,Anderson-Shiro,87.27,195.04,111.13,161.03,467.2,Single-ply,SBD,M
Boys,89.81,4,ZhaVonte Griffin,Robinson,83.91,183.7,111.13,158.76,453.59,Single-ply,SBD,M
Boys,89.81,5,Tate Sehon,Robinson,89.4,174.63,104.33,174.63,453.59,Single-ply,SBD,M
Boys,89.81,6,Jer'Tavius Brown,College Station A&M Cons,84.37,185.97,102.06,158.76,446.79,Single-ply,SBD,M
Boys,89.81,7,Eduardo Chavez,Robinson,89.72,147.42,92.99,190.51,430.91,Single-ply,SBD,M
Boys,89.81,8,Christian Watters,College Station A&M Cons,83.51,140.61,92.99,117.93,351.53,Single-ply,SBD,M
Boys,89.81,9,John Mendez,Robinson,86.18,117.93,61.23,147.42,326.59,Single-ply,SBD,M
Boys,89.81,DQ,Daniel Walker,Robinson,89.81,,,,,Single-ply,SBD,M
Boys,99.79,1,AJ Robinson,Waco University,99.02,249.48,151.95,254.01,655.44,Single-ply,SBD,M
Boys,99.79,2,Chad Roebuck,Anderson-Shiro,90.99,240.4,147.42,204.12,591.94,Single-ply,SBD,M
Boys,99.79,3,Mario Sedillo,Robinson,98.61,201.85,124.74,204.12,530.7,Single-ply,SBD,M
Boys,99.79,4,Michael Gabrielsen,Robinson,96.16,190.51,102.06,197.31,489.88,Single-ply,SBD,M
Boys,99.79,5,Aiden Ware,Robinson,92.99,181.44,113.4,172.37,467.2,Single-ply,SBD,M
Boys,99.79,6,Jacob Brooks,College Station A&M Cons,93.89,170.1,90.72,174.63,435.45,Single-ply,SBD,M
Boys,99.79,7,Casey Diserens,Lorena,92.99,154.22,86.18,154.22,394.63,Single-ply,SBD,M
Boys,99.79,8,Hutton Scott,Lorena,95.25,149.69,86.18,142.88,378.75,Single-ply,SBD,M
Boys,99.79,9,Jordan Ahmed,College Station A&M Cons,90.72,97.52,90.72,136.08,324.32,Single-ply,SBD,M
Boys,99.79,DQ,Trevian Oliver,Robinson,95.25,231.33,,181.44,,Single-ply,SBD,M
Boys,99.79,DQ,Brady King,Robinson,93.44,226.8,,213.19,,Single-ply,SBD,M
Boys,109.77,1,Louis Alvarado,Waco University,107.64,213.19,124.74,190.51,528.44,Single-ply,SBD,M
Boys,109.77,2,Brady Haug,Robinson,106.14,192.78,113.4,192.78,498.95,Single-ply,SBD,M
Boys,109.77,3,Malik Ross,College Station A&M Cons,107.5,190.51,124.74,183.7,498.95,Single-ply,SBD,M
Boys,109.77,4,Klayton Sheffield,College Station A&M Cons,103.06,188.24,113.4,165.56,467.2,Single-ply,SBD,M
Boys,109.77,5,Camren Klawinsky,Anderson-Shiro,108.05,174.63,102.06,176.9,453.59,Single-ply,SBD,M
Boys,109.77,6,Mark Doyle,Lorena,108.95,167.83,97.52,167.83,433.18,Single-ply,SBD,M
Boys,109.77,7,Cody Thorne,Lorena,105.96,149.69,95.25,163.29,408.23,Single-ply,SBD,M
Boys,109.77,8,David Boozer,Lorena,103.1,163.29,68.04,163.29,394.63,Single-ply,SBD,M
Boys,109.77,9,Jordan Kisse,College Station A&M Cons,105.23,145.15,81.65,127.01,353.8,Single-ply,SBD,M
Boys,124.74,1,Daniel Wilde,Robinson,120.2,226.8,136.08,219.99,582.87,Single-ply,SBD,M
Boys,124.74,2,Camden Garner,Lorena,121.56,217.72,145.15,158.76,521.63,Single-ply,SBD,M
Boys,124.74,3,Felipe Gonzalez,Waco University,119.75,215.46,104.33,197.31,517.1,Single-ply,SBD,M
Boys,124.74,4,Blayre Fallon,Robinson,111.13,204.12,120.2,172.37,496.68,Single-ply,SBD,M
Boys,124.74,5,Kyle Greer,College Station A&M Cons,112.94,176.9,104.33,181.44,462.66,Single-ply,SBD,M
Boys,124.74,6,Timothy Chandler,College Station A&M Cons,114.31,136.08,72.57,145.15,353.8,Single-ply,SBD,M
Boys,124.74,DQ,Vernon Gilmore,Waco University,122.56,204.12,,,,Single-ply,SBD,M
Boys,124.74,DQ,Rojelio Leal,Robinson,115.67,,,,,Single-ply,SBD,M
Boys,124.74+,1,Trace Snyder,Robinson,159.66,208.65,136.08,233.6,578.33,Single-ply,SBD,M
Boys,124.74+,2,Jacob Gallimore,Robinson,146.51,226.8,117.93,226.8,571.53,Single-ply,SBD,M
Boys,124.74+,3,Brandon Waggoner,College Station A&M Cons,127.05,204.12,136.08,204.12,544.31,Single-ply,SBD,M
Boys,124.74+,4,Estavan Trejo,Waco University,126.96,204.12,120.2,183.7,508.02,Single-ply,SBD,M
Boys,124.74+,5,Kendrick Palmer,College Station A&M Cons,144.7,122.47,81.65,158.76,362.87,Single-ply,SBD,M
Boys,124.74+,DQ,Isaac Franco,Waco University,136.98,,,,,Single-ply,SBD,M
