Division,WeightClassKg,Place,Name,Team,BodyweightKg,Best3SquatKg,Best3BenchKg,Best3DeadliftKg,TotalKg,Equipment,Event,Sex
Boys,51.71,1,Ashton Jaubert,Hurst Bell,51.71,58.97,40.82,72.57,172.37,Single-ply,SBD,M
Boys,55.79,1,Dan O'Brien,Dallas Jesuit,54.93,102.06,63.5,117.93,283.5,Single-ply,SBD,M
Boys,55.79,2,Azyyah Wallace,Irving MacArthur,51.8,92.99,56.7,120.2,269.89,Single-ply,SBD,M
Boys,59.87,1,Antwan Reeves,Cedar Hill,57.79,136.08,52.16,136.08,324.32,Single-ply,SBD,M
Boys,59.87,2,Promise Ogbanna,Cedar Hill,56.79,127.01,63.5,120.2,310.71,Single-ply,SBD,M
Boys,67.13,1,Tj Bah,Hurst Bell,66.13,170.1,86.18,197.31,453.59,Single-ply,SBD,M
Boys,67.13,2,Carlos Triplett,Hurst Bell,66.95,158.76,81.65,165.56,405.97,Single-ply,SBD,M
Boys,67.13,3,Jeremiah Devezin,Cedar Hill,63.32,147.42,83.91,158.76,390.09,Single-ply,SBD,M
Boys,67.13,4,Tre Howard,Irving MacArthur,65.59,142.88,79.38,142.88,365.14,Single-ply,SBD,M
Boys,74.84,1,Grant Delanoy,Dallas Jesuit,72.57,176.9,83.91,217.72,478.54,Single-ply,SBD,M
Boys,74.84,2,Kisi Moeakiola,Hurst Bell,74.39,174.63,120.2,165.56,460.4,Single-ply,SBD,M
Boys,74.84,3,William Courtney,Dallas Jesuit,71.8,158.76,92.99,204.12,455.86,Single-ply,SBD,M
Boys,74.84,4,Najeh Johnson,Hurst Bell,72.57,165.56,88.45,195.04,449.06,Single-ply,SBD,M
Boys,74.84,5,Nikko Solis,Hurst Bell,71.44,190.51,92.99,158.76,442.25,Single-ply,SBD,M
Boys,74.84,6,Elijah Figueroa,Irving MacArthur,74.84,142.88,92.99,165.56,401.43,Single-ply,SBD,M
Boys,82.1,1,Steven Jackson,Cedar Hill,80.06,204.12,113.4,217.72,535.24,Single-ply,SBD,M
Boys,82.1,2,Draven Myles,Cedar Hill,79.7,188.24,108.86,174.63,471.74,Single-ply,SBD,M
Boys,82.1,3,David Ritter,Dallas Jesuit,80.65,142.88,65.77,183.7,392.36,Single-ply,SBD,M
Boys,82.1,4,Joseph Buskmiller,Dallas Jesuit,79.88,136.08,74.84,172.37,383.29,Single-ply,SBD,M
Boys,89.81,1,Joel Kayoka,Hurst Bell,87.09,226.8,129.27,272.16,628.23,Single-ply,SBD,M
Boys,89.81,2,Beni Kabongo,Hurst Bell,86.64,179.17,124.74,215.46,519.36,Single-ply,SBD,M
Boys,89.81,3,Cheyenne Ayers,Hurst Bell,86.32,199.58,106.59,204.12,510.29,Single-ply,SBD,M
Boys,89.81,4,Keyshawn Watkins,Hurst Bell,85.28,192.78,111.13,204.12,508.02,Single-ply,SBD,M
Boys,89.81,5,Cauren Lynch,Irving MacArthur,89.22,174.63,102.06,219.99,496.68,Single-ply,SBD,M
Boys,89.81,6,Carl Penn-Ye,Cedar Hill,85.82,195.04,106.59,190.51,492.15,Single-ply,SBD,M
Boys,89.81,DQ,Josh Vakapuna,Hurst Bell,88.72,190.51,131.54,,,Single-ply,SBD,M
Boys,89.81,DQ,Daniel Sylvia,Irving MacArthur,83.46,183.7,,165.56,,Single-ply,SBD,M
Boys,99.79,1,Joseph Torres,Hurst Bell,99.29,233.6,172.37,210.92,616.89,Single-ply,SBD,M
Boys,99.79,2,Phillip Villalba,Dallas Jesuit,97.89,226.8,129.27,206.38,562.45,Single-ply,SBD,M
Boys,99.79,3,Mena Ragheb,Hurst Bell,99.65,208.65,111.13,204.12,523.9,Single-ply,SBD,M
Boys,99.79,4,Asa Suggs,Cedar Hill,90.36,199.58,83.91,174.63,458.13,Single-ply,SBD,M
Boys,99.79,5,Peter Lilomaiava,Hurst Bell,94.71,174.63,92.99,165.56,433.18,Single-ply,SBD,M
Boys,99.79,6,Jose Bardares,Irving MacArthur,91.04,142.88,88.45,170.1,401.43,Single-ply,SBD,M
Boys,109.77,1,Rashawn Johnson,Hurst Bell,109.13,215.46,117.93,195.04,528.44,Single-ply,SBD,M
Boys,109.77,2,Bavly BeBawy,Hurst Bell,108.95,190.51,106.59,181.44,478.54,Single-ply,SBD,M
Boys,109.77,3,Phillip Lotaire,Cedar Hill,107.32,147.42,92.99,170.1,410.5,Single-ply,SBD,M
Boys,109.77,DQ,Camron Sirleaf,Hurst Bell,109.23,,120.2,181.44,,Single-ply,SBD,M
Boys,124.74,1,Kenny Singleton,Irving MacArthur,114.08,224.53,133.81,219.99,578.33,Single-ply,SBD,M
Boys,124.74,2,Brandon Tran,Hurst Bell,121.47,238.14,117.93,204.12,560.19,Single-ply,SBD,M
Boys,124.74,3,Abel Garcia,Irving MacArthur,121.61,219.99,129.27,174.63,523.9,Single-ply,SBD,M
Boys,124.74,4,Ayomide Johnson,Cedar Hill,110,147.42,102.06,151.95,401.43,Single-ply,SBD,M
Boys,124.74,DQ,Ethan Lane,Dallas Jesuit,115.17,249.48,133.81,,,Single-ply,SBD,M
Boys,124.74+,1,Tofa Sanft,Hurst Bell,160.57,208.65,90.72,185.97,485.34,Single-ply,SBD,M
Boys,,NS,Chris Jones,Irving MacArthur,,,,,,Single-ply,SBD,M
Boys,,NS,Walter Isaac,Irving MacArthur,,,,,,Single-ply,SBD,M
Boys,,NS,Kenneth Peoples,Irving MacArthur,,,,,,Single-ply,SBD,M
