Division,WeightClassKg,Place,Name,Team,BodyweightKg,Best3SquatKg,Best3BenchKg,Best3DeadliftKg,TotalKg,Equipment,Event,Sex
Boys,51.71,1,David Vega,Freeport Brazosport,51.35,158.76,97.52,174.63,430.91,Single-ply,SBD,M
Boys,51.71,2,Kenny Nguyen,Dickinson,51.26,154.22,104.33,142.88,401.43,Single-ply,SBD,M
Boys,51.71,3,Kevin Angus,Port Neches-Groves,51.35,151.95,79.38,163.29,394.63,Single-ply,SBD,M
Boys,55.79,4,Randall Holland,Clute Brazoswood,51.89,149.69,92.99,149.69,392.36,Single-ply,SBD,M
Boys,51.71,5,Fidencio Cruz,Dickinson,51.17,158.76,72.57,154.22,385.55,Single-ply,SBD,M
Boys,55.79,6,Kyyle Hailey,Tomball,51.89,142.88,70.31,147.42,360.61,Single-ply,SBD,M
Boys,51.71,7,Adel Jebokji,Port Neches-Groves,51.53,122.47,72.57,163.29,358.34,Single-ply,SBD,M
Boys,51.71,8,Brandon Parish,Galveston Ball,50.26,138.35,74.84,129.27,342.46,Single-ply,SBD,M
Boys,51.71,9,Tyler Marcel,Conroe Oak Ridge,51.62,122.47,79.38,138.35,340.19,Single-ply,SBD,M
Boys,51.71,10,Patrick Herfurth,Orange Little Cypress-Mauriceville,47.54,108.86,52.16,147.42,308.44,Single-ply,SBD,M
Boys,55.79,1,Andrew Brooks,Houston Madison,55.52,195.04,104.33,181.44,480.81,Single-ply,SBD,M
Boys,55.79,2,Anthony Grimes,Katy Mayde Creek,55.79,154.22,92.99,174.63,421.84,Single-ply,SBD,M
Boys,55.79,3,Bryce Walker,Houston Madison,55.25,170.1,81.65,161.03,412.77,Single-ply,SBD,M
Boys,55.79,4,Daniel Moreno,Dayton,55.07,154.22,79.38,167.83,401.43,Single-ply,SBD,M
Boys,55.79,5,Jeremy Charles,Willis,55.16,142.88,92.99,156.49,392.36,Single-ply,SBD,M
Boys,55.79,6,Jamahl Johnson,Houston Cypress Woods,55.07,147.42,74.84,167.83,390.09,Single-ply,SBD,M
Boys,59.87,7,Merbin Valladares,Katy Mayde Creek,55.88,136.08,83.91,154.22,374.21,Single-ply,SBD,M
Boys,55.79,DQ,Jake Simpson,Houston Bellaire,55.79,,,,,Single-ply,SBD,M
Boys,55.79,DQ,Chaise Edwards,Montgomery,54.88,,,,,Single-ply,SBD,M
Boys,55.79,DQ,DeMarco Corner,Manvel,55.25,129.27,77.11,,,Single-ply,SBD,M
Boys,59.87,1,David Bollinger,Vidor,58.51,176.9,115.67,185.97,478.54,Single-ply,SBD,M
Boys,59.87,2,Eric Garza,Magnolia West,59.24,176.9,113.4,179.17,469.47,Single-ply,SBD,M
Boys,59.87,3,Max Baronaske,Tomball,58.51,161.03,120.2,170.1,451.32,Single-ply,SBD,M
Boys,59.87,4,Cody Viteritto,Alvin,58.88,163.29,115.67,172.37,451.32,Single-ply,SBD,M
Boys,59.87,5,Quentin Dodds,Dickinson,59.69,183.7,99.79,163.29,446.79,Single-ply,SBD,M
Boys,59.87,6,Daryl Palaganas,Channelview,59.24,158.76,106.59,176.9,442.25,Single-ply,SBD,M
Boys,59.87,7,Austin Alexander,Conroe Caney Creek,58.33,176.9,97.52,165.56,439.98,Single-ply,SBD,M
Boys,59.87,8,Caffery Penn,Conroe The Woodlands,58.6,149.69,90.72,174.63,415.04,Single-ply,SBD,M
Boys,67.13,9,Jonathan Nelson,Clute Brazoswood,60.06,149.69,83.91,181.44,415.04,Single-ply,SBD,M
Boys,59.87,DQ,Ja'Core Aldridge,La Marque,59.33,,120.2,,,Single-ply,SBD,M
Boys,67.13,1,Jared Wetuski,Montgomery,64.32,217.72,129.27,210.92,557.92,Single-ply,SBD,M
Boys,67.13,2,Nick Dockens,Orange Little Cypress-Mauriceville,66.59,226.8,113.4,208.65,548.85,Single-ply,SBD,M
Boys,67.13,3,Kevin Green,Katy Mayde Creek,66.41,217.72,120.2,206.38,544.31,Single-ply,SBD,M
Boys,67.13,4,Tyler Fuselier,Dayton,66.22,204.12,108.86,217.72,530.7,Single-ply,SBD,M
Boys,67.13,5,Jesse Trevino,Houston Chavez,65.95,192.78,115.67,208.65,517.1,Single-ply,SBD,M
Boys,74.84,6,Courtland Taylor,Bay City,67.22,199.58,113.4,197.31,510.29,Single-ply,SBD,M
Boys,67.13,7,Winston Pullin,Pasadena Memorial,66.41,181.44,97.52,195.04,474,Single-ply,SBD,M
Boys,67.13,8,Austin Powell,Vidor,66.5,176.9,102.06,185.97,464.93,Single-ply,SBD,M
Boys,67.13,9,Westley Potter,Livingston,65.86,174.63,106.59,,281.23,Single-ply,SB,M
Boys,74.84,10,John Calhoun,Texas City,67.31,165.56,,,165.56,Single-ply,S,M
Boys,67.13,DQ,Dillon Baker,Tomball,66.68,,,,,Single-ply,S,M
Boys,74.84,1,Jeremy McNeal,La Porte,74.84,219.99,163.29,215.46,598.74,Single-ply,SBD,M
Boys,74.84,2,Ronald Winston,Katy Mayde Creek,73.94,226.8,142.88,219.99,589.67,Single-ply,SBD,M
Boys,74.84,4,Nick Fields,Freeport Brazosport,71.3,217.72,120.2,226.8,564.72,Single-ply,SBD,M
Boys,74.84,5,John Le,Dickinson,74.21,240.4,108.86,208.65,557.92,Single-ply,SBD,M
Boys,74.84,6,Josh Salas,Katy Mayde Creek,72.57,210.92,97.52,224.53,532.97,Single-ply,SBD,M
Boys,74.84,7,Victor Tran,Dickinson,72.21,213.19,108.86,195.04,517.1,Single-ply,SBD,M
Boys,74.84,8,Colton Beardmore,Houston Cypress Woods,73.48,195.04,124.74,,319.78,Single-ply,SB,M
Boys,74.84,DQ,Johnathon Bradfield,Katy Mayde Creek,73.94,,,,,Single-ply,SB,M
Boys,74.84,DQ,Hugo Ceja,Port Neches-Groves,69.85,,,,,Single-ply,SB,M
Boys,82.1,1,Robert Johnson,Nederland,77.84,272.16,145.15,272.16,689.46,Single-ply,SBD,M
Boys,82.1,2,Justin Hicks,Channelview,80.2,242.67,151.95,242.67,637.3,Single-ply,SBD,M
Boys,82.1,3,Christian Andrews,Beaumont Ozen,78.83,226.8,147.42,226.8,601.01,Single-ply,SBD,M
Boys,82.1,4,Coleton Boudreaux,Orange Little Cypress-Mauriceville,80.74,247.21,142.88,208.65,598.74,Single-ply,SBD,M
Boys,82.1,5,Justin Eberly,Conroe Caney Creek,78.11,226.8,124.74,242.67,594.21,Single-ply,SBD,M
Boys,82.1,6,Will Glover,Houston Cypress Woods,76.93,247.21,127.01,204.12,578.33,Single-ply,SBD,M
Boys,82.1,7,Jamarcus Burks,Houston Madison,81.1,247.21,120.2,208.65,576.06,Single-ply,SBD,M
Boys,82.1,8,Joe Cantu,Conroe Oak Ridge,80.38,213.19,138.35,204.12,555.65,Single-ply,SBD,M
Boys,82.1,9,Blayne Elster,Livingston,80.83,222.26,108.86,213.19,544.31,Single-ply,SBD,M
Boys,82.1,10,Shyerome Harris,Magnolia,80.1,213.19,106.59,213.19,532.97,Single-ply,SBD,M
Boys,82.1,11,Joshua Bowie,Beaumont West Brook,82.01,217.72,129.27,,347,Single-ply,SB,M
Boys,89.81,1,Byron Wells,Dickinson,86.27,263.08,156.49,278.96,698.53,Single-ply,SBD,M
Boys,89.81,2,Jordan Glenn,Houston Bellaire,86.27,254.01,165.56,267.62,687.19,Single-ply,SBD,M
Boys,89.81,3,Dustin Hicks,Channelview,85.73,238.14,165.56,240.4,644.1,Single-ply,SBD,M
Boys,89.81,4,Chris Hall,Santa Fe,89.45,238.14,172.37,226.8,637.3,Single-ply,SBD,M
Boys,89.81,5,Daniel Wilkerson,Santa Fe,84.91,226.8,174.63,233.6,635.03,Single-ply,SBD,M
Boys,89.81,6,Joey Johnson,Magnolia West,88,217.72,149.69,215.46,582.87,Single-ply,SBD,M
Boys,89.81,DQ,Jonathon Fontenot,Orange Little Cypress-Mauriceville,87.45,,,,,Single-ply,SBD,M
Boys,89.81,DQ,Cesar Yepes,New Caney Porter,87.09,183.7,,,,Single-ply,SBD,M
Boys,89.81,DQ,Bruce Reyes,Beaumont West Brook,83.46,,,,,Single-ply,SBD,M
Boys,89.81,DQ,Anthony Breed,Beaumont Ozen,85.55,190.51,,,,Single-ply,SBD,M
Boys,99.79,1,Rodney Hall,Angleton,97.43,272.16,149.69,240.4,662.24,Single-ply,SBD,M
Boys,99.79,2,Terchan Newman,Beaumont West Brook,98.16,265.35,147.42,244.94,657.71,Single-ply,SBD,M
Boys,99.79,3,Donald Preston,Tomball,98.7,263.08,129.27,265.35,657.71,Single-ply,SBD,M
Boys,99.79,4,Oscar Ramirez,Katy Mayde Creek,97.98,258.55,163.29,226.8,648.64,Single-ply,SBD,M
Boys,99.79,5,Khristian Blaylock,Clute Brazoswood,90.54,240.4,149.69,244.94,635.03,Single-ply,SBD,M
Boys,99.79,6,Dylan Thompson,Houston Cypress Woods,97.61,226.8,170.1,235.87,632.76,Single-ply,SBD,M
Boys,99.79,7,Michael Hodges,Conroe The Woodlands,94.53,233.6,145.15,249.48,628.23,Single-ply,SBD,M
Boys,99.79,8,Savon Caldwell,Texas City,91.35,242.67,142.88,206.38,591.94,Single-ply,SBD,M
Boys,99.79,9,Mitchell Jennings,Orange Little Cypress-Mauriceville,98.7,226.8,158.76,195.04,580.6,Single-ply,SBD,M
Boys,99.79,DQ,Rickey Lunford,Clute Brazoswood,90.08,,,,,Single-ply,SBD,M
Boys,109.77,1,Aaron Ripkowski,Dayton,109.04,272.16,226.8,294.84,793.79,Single-ply,SBD,M
Boys,109.77,2,Allen Harris,Beaumont Central,104.42,249.48,174.63,283.5,707.6,Single-ply,SBD,M
Boys,109.77,3,Roderick Wiltz,Houston Madison,107.23,281.23,158.76,258.55,698.53,Single-ply,SBD,M
Boys,109.77,4,Justin Rice,Pasadena Dobie,108.68,272.16,142.88,274.42,689.46,Single-ply,SBD,M
Boys,109.77,5,Lorenzo Castaneda,Dickinson,108.5,272.16,154.22,254.01,680.39,Single-ply,SBD,M
Boys,109.77,6,Caleb Etheridge,New Caney,100.43,244.94,161.03,238.14,644.1,Single-ply,SBD,M
Boys,109.77,7,Simon Curiel,Manvel,107.05,231.33,129.27,256.28,616.89,Single-ply,SBD,M
Boys,109.77,8,Frankie Garcia,Conroe Woodlands College Park,108.95,215.46,129.27,226.8,571.53,Single-ply,SBD,M
Boys,109.77,9,Cameron Hodge,Katy Mayde Creek,104.78,208.65,149.69,204.12,562.45,Single-ply,SBD,M
Boys,109.77,DQ,Justin Latenaro,Conroe Oak Ridge,104.51,,,,,Single-ply,SBD,M
Boys,109.77,DQ,Darrian Lavergne,Pasadena Dobie,104.69,,,,,Single-ply,SBD,M
Boys,124.74,1,Cameron Allen,Orange Little Cypress-Mauriceville,123.38,319.78,185.97,283.5,789.25,Single-ply,SBD,M
Boys,124.74,2,Andrew Bletsch,Santa Fe,120.84,272.16,192.78,272.16,737.09,Single-ply,SBD,M
Boys,124.74,3,Nick Alvarez,Montgomery,117.66,281.23,204.12,240.4,725.75,Single-ply,SBD,M
Boys,124.74,3,Kaylon Melacon,Manvel,117.66,217.72,127.01,226.8,571.53,Single-ply,SBD,M
Boys,124.74,4,Glenn Salisbury,Conroe Caney Creek,118.21,276.69,192.78,233.6,703.07,Single-ply,SBD,M
Boys,124.74,5,Chris Rose,Houston Madison,122.74,272.16,149.69,226.8,648.64,Single-ply,SBD,M
Boys,124.74,6,Aaron Easley,Port Neches-Groves,120.11,276.69,156.49,208.65,641.83,Single-ply,SBD,M
Boys,124.74,7,Terran Alves,Houston Cypress Woods,120.56,242.67,156.49,238.14,637.3,Single-ply,SBD,M
Boys,124.74,8,Corey Lee,La Porte,121.02,242.67,147.42,226.8,616.89,Single-ply,SBD,M
Boys,124.74,DQ,Rj Earls,Clute Brazoswood,115.03,,,,,Single-ply,SBD,M
Boys,124.74,DQ,Eric Christ,Manvel,123.01,281.23,161.03,,,Single-ply,SBD,M
Boys,124.74+,1,Anthony Madrigal,Freeport Brazosport,140.25,285.76,192.78,249.48,728.02,Single-ply,SBD,M
Boys,124.74+,2,Tim Jenkins,Dickinson,130.54,299.37,165.56,260.82,725.75,Single-ply,SBD,M
Boys,124.74+,3,Mikal Fernandez,Houston Cypress Woods,138.35,340.19,151.95,233.6,725.75,Single-ply,SBD,M
Boys,124.74+,4,Darrian Wright,Dayton,126.1,272.16,158.76,256.28,687.19,Single-ply,SBD,M
Boys,124.74+,5,Travis Romero,Manvel,139.98,276.69,161.03,247.21,684.92,Single-ply,SBD,M
Boys,124.74+,6,Cody Britton,Conroe Caney Creek,140.34,272.16,151.95,233.6,657.71,Single-ply,SBD,M
Boys,124.74+,7,Charles Phillips,Houston Madison,141.88,267.62,181.44,195.04,644.1,Single-ply,SBD,M
Boys,124.74+,8,Maurice Morris,La Porte,165.29,233.6,158.76,244.94,637.3,Single-ply,SBD,M
Boys,124.74+,DQ,Josue Toledo,Channelview,130,,,,,Single-ply,SBD,M
Boys,124.74+,DQ,Nashon Edwards,Beaumont Ozen,155.67,251.74,,,,Single-ply,SBD,M
Boys,124.74+,DQ,Quentin Marsh,Dickinson,125.19,272.16,158.76,,,Single-ply,SBD,M
Boys,124.74+,DQ,Justin Smith,New Caney,129.73,260.82,,,,Single-ply,SBD,M
