Division,WeightClassKg,Place,Name,Team,BodyweightKg,Best3SquatKg,Best3BenchKg,Best3DeadliftKg,TotalKg,Equipment,Event,Sex
Boys,51.71,1,Antonio Ponce,Glen Rose,51.17,142.88,74.84,170.1,387.82,Single-ply,SBD,M
Boys,51.71,2,Jason Ayers,Lampasas,51.71,142.88,79.38,165.56,387.82,Single-ply,SBD,M
Boys,55.79,3,Jonathan Flores,Lampasas,51.89,124.74,86.18,163.29,374.21,Single-ply,SBD,M
Boys,51.71,4,Isaack Santillan,Clifton,51.26,129.27,72.57,133.81,335.66,Single-ply,SBD,M
Boys,51.71,5,Dallas Elmore,Graham,51.53,108.86,65.77,127.01,301.64,Single-ply,SBD,M
Boys,55.79,6,Jace Duncan,Mineral Wells,51.8,113.4,74.84,113.4,301.64,Single-ply,SBD,M
Boys,51.71,7,Mainglee Bou,Fort Worth Paschal,48.63,111.13,56.7,124.74,292.57,Single-ply,SBD,M
Boys,51.71,8,Cesar Montano,Stephenville,50.03,106.59,70.31,108.86,285.76,Single-ply,SBD,M
Boys,55.79,9,Zachary Tucker,Perrin-Whitt,51.89,111.13,54.43,111.13,276.69,Single-ply,SBD,M
Boys,51.71,10,Tristan Wilson,Graham,50.71,106.59,52.16,113.4,272.16,Single-ply,SBD,M
Boys,51.71,11,Brian Elliston,Brady,51.44,90.72,52.16,120.2,263.08,Single-ply,SBD,M
Boys,51.71,12,Brady Estes,Dublin,45,83.91,45.36,90.72,219.99,Single-ply,SBD,M
Boys,55.79,DQ,Jabril Clayborne,North Crowley,51.8,,,,,Single-ply,SBD,M
Boys,59.87,1,Ryan Stone,Graham,55.97,151.95,81.65,151.95,385.55,Single-ply,SBD,M
Boys,55.79,2,Cody Halcom,Glen Rose,55.61,138.35,72.57,158.76,369.68,Single-ply,SBD,M
Boys,55.79,3,Stanley Stevens,Ranger,54.98,145.15,77.11,136.08,358.34,Single-ply,SBD,M
Boys,55.79,4,Tye'Rus Jones,Brownwood,53.98,140.61,72.57,136.08,349.27,Single-ply,SBD,M
Boys,59.87,5,Dakota Cavazos,Lampasas,55.97,131.54,83.91,133.81,349.27,Single-ply,SBD,M
Boys,55.79,6,Dacion Brown,Fort Worth Arlington Heights,55.16,138.35,70.31,138.35,347,Single-ply,SBD,M
Boys,55.79,7,Robby Brewer,Clifton,55.34,145.15,74.84,108.86,328.85,Single-ply,SBD,M
Boys,55.79,8,Tanner Resecker,Glen Rose,54.52,117.93,77.11,127.01,322.05,Single-ply,SBD,M
Boys,55.79,9,Jacob Wooten,Wichita Falls Rider,53.61,115.67,56.7,136.08,308.44,Single-ply,SBD,M
Boys,55.79,DQ,Jacob Delfuente,Brady,55.34,129.27,,,,Single-ply,SBD,M
Boys,67.13,1,Geo Miranda,Graham,59.96,172.37,88.45,170.1,430.91,Single-ply,SBD,M
Boys,67.13,2,Daniel Rodriguez,Fort Worth Paschal,60.06,163.29,68.04,174.63,405.97,Single-ply,SBD,M
Boys,67.13,3,Tommy Jiminez,Gustine,59.96,149.69,86.18,163.29,399.16,Single-ply,SBD,M
Boys,59.87,4,Keith Ray,Stephenville,59.01,154.22,81.65,154.22,390.09,Single-ply,SBD,M
Boys,59.87,5,Emiliano Mar,Clifton,59.6,140.61,90.72,154.22,385.55,Single-ply,SBD,M
Boys,59.87,6,Anthony Montes,Lampasas,58.24,140.61,86.18,151.95,378.75,Single-ply,SBD,M
Boys,59.87,7,Jacob Hutchins,Graham,59.78,138.35,79.38,156.49,374.21,Single-ply,SBD,M
Boys,59.87,8,Justin O'Neal,Clifton,58.51,138.35,81.65,142.88,362.87,Single-ply,SBD,M
Boys,59.87,9,Daniel Rodriguez,Dublin,58.42,129.27,81.65,136.08,347,Single-ply,SBD,M
Boys,59.87,10,Chris Meredith,Mineral Wells,58.88,129.27,74.84,136.08,340.19,Single-ply,SBD,M
Boys,59.87,11,Joe Crockett,Cross Plains,57.15,136.08,61.23,131.54,328.85,Single-ply,SBD,M
Boys,59.87,12,José Cortés,Dublin,58.51,102.06,65.77,140.61,308.44,Single-ply,SBD,M
Boys,74.84,1,Oscar Orozco,Castleberry,67.22,188.24,106.59,226.8,521.63,Single-ply,SBD,M
Boys,67.13,2,Cesar Herrera,Glen Rose,64.05,195.04,111.13,204.12,510.29,Single-ply,SBD,M
Boys,67.13,3,Armando Aguilar,Gustine,67.04,188.24,113.4,204.12,505.76,Single-ply,SBD,M
Boys,67.13,4,Jayton Tammell,Santo,66.5,208.65,99.79,185.97,494.42,Single-ply,SBD,M
Boys,67.13,5,Dalton Zinck,Dublin,63.59,188.24,106.59,179.17,474,Single-ply,SBD,M
Boys,67.13,6,Hayden Dibble,North Crowley,61.33,192.78,83.91,188.24,464.93,Single-ply,SBD,M
Boys,67.13,7,David Watson,Seymour,60.69,183.7,97.52,181.44,462.66,Single-ply,SBD,M
Boys,67.13,8,Jared Holmes,Perrin-Whitt,60.42,147.42,90.72,176.9,415.04,Single-ply,SBD,M
Boys,67.13,9,Devon Hall,Seymour,60.96,149.69,79.38,167.83,396.89,Single-ply,SBD,M
Boys,67.13,10,Adrian Astello,Santo,67.13,158.76,74.84,151.95,385.55,Single-ply,SBD,M
Boys,67.13,11,Avery Rangel,Castleberry,65.68,127.01,83.91,154.22,365.14,Single-ply,SBD,M
Boys,74.84,12,Regi Lane,Bridgeport,67.31,136.08,72.57,154.22,362.87,Single-ply,SBD,M
Boys,67.13,13,James Henderson,Santo,62.41,147.42,70.31,142.88,360.61,Single-ply,SBD,M
Boys,67.13,14,Nakoda Mastin,Bridgeport,66.22,131.54,74.84,151.95,358.34,Single-ply,SBD,M
Boys,67.13,15,Adrian Perez,Castleberry,66.68,122.47,74.84,156.49,353.8,Single-ply,SBD,M
Boys,67.13,16,Nick Cedillo,Mineral Wells,66.86,120.2,83.91,131.54,335.66,Single-ply,SBD,M
Boys,67.13,17,Israel Vazquez,Dublin,65.68,127.01,68.04,136.08,331.12,Single-ply,SBD,M
Boys,67.13,18,Chance Goodgion,Brownwood,64.23,117.93,70.31,140.61,328.85,Single-ply,SBD,M
Boys,67.13,19,Marc Lopez,Gustine,64.86,86.18,83.91,113.4,283.5,Single-ply,SBD,M
Boys,67.13,DQ,Brazier Talley,Bridgeport,65.14,136.08,,,,Single-ply,SBD,M
Boys,67.13,DQ,Aj Hilbers,Seymour,65.05,145.15,,,,Single-ply,SBD,M
Boys,74.84,1,Miguel Anderson,Waco Midway,72.94,185.97,124.74,201.85,512.56,Single-ply,SBD,M
Boys,74.84,2,Aron Velasco,Graham,73.12,190.51,104.33,213.19,508.02,Single-ply,SBD,M
Boys,74.84,3,Treston Womack,Waco Midway,68.67,185.97,117.93,197.31,501.22,Single-ply,SBD,M
Boys,74.84,4,Bryan Ortiz,Castleberry,73.94,190.51,108.86,199.58,498.95,Single-ply,SBD,M
Boys,74.84,5,Daniel Chavez,Clifton,70.85,183.7,106.59,201.85,492.15,Single-ply,SBD,M
Boys,74.84,6,Jacob Riley,Dublin,71.49,165.56,92.99,222.26,480.81,Single-ply,SBD,M
Boys,74.84,7,Mark DeLeon,Brady,69.85,172.37,111.13,190.51,474,Single-ply,SBD,M
Boys,74.84,8,Nacho Rios,Comanche,73.21,174.63,115.67,181.44,471.74,Single-ply,SBD,M
Boys,74.84,9,Isaiah Guajardo,Fort Worth Paschal,70.4,165.56,97.52,174.63,437.72,Single-ply,SBD,M
Boys,74.84,10,Destin Montelongo,Santo,69.13,158.76,90.72,158.76,408.23,Single-ply,SBD,M
Boys,74.84,11,Noah Maston,Santo,72.94,163.29,86.18,156.49,405.97,Single-ply,SBD,M
Boys,74.84,12,Ryan Gaitan,Dublin,73.48,154.22,90.72,147.42,392.36,Single-ply,SBD,M
Boys,74.84,13,Jonathan McCombs,Lake Worth,73.21,138.35,83.91,136.08,358.34,Single-ply,SBD,M
Boys,74.84,14,Edgar Reyes,North Crowley,73.39,113.4,86.18,140.61,340.19,Single-ply,SBD,M
Boys,74.84,DQ,Michael Dias,Fort Worth Arlington Heights,72.3,,,,,Single-ply,SBD,M
Boys,74.84,DQ,Malik Jones,Tolar,71.85,113.4,,,,Single-ply,SBD,M
Boys,74.84,DQ,Tucker Birk,Santo,74.03,185.97,106.59,174.63,,Single-ply,SBD,M
Boys,82.1,1,Jeremy Rowe,Waco Midway,77.38,190.51,136.08,217.72,544.31,Single-ply,SBD,M
Boys,82.1,2,Grant Peters,Mineral Wells,77.02,206.38,124.74,195.04,526.17,Single-ply,SBD,M
Boys,82.1,3,Jace Hankins,Lampasas,80.74,190.51,115.67,210.92,517.1,Single-ply,SBD,M
Boys,82.1,4,Manuel Fierro,Lake Worth,81.37,192.78,127.01,183.7,503.49,Single-ply,SBD,M
Boys,82.1,5,Zach Gartman,Cross Plains,81.92,208.65,95.25,185.97,489.88,Single-ply,SBD,M
Boys,82.1,6,Stone Castillo,Glen Rose,79.83,174.63,115.67,185.97,476.27,Single-ply,SBD,M
Boys,82.1,7,Kully Reynolds,Glen Rose,76.11,181.44,97.52,192.78,471.74,Single-ply,SBD,M
Boys,82.1,8,Josh Lucas,Clifton,77.56,172.37,90.72,192.78,455.86,Single-ply,SBD,M
Boys,82.1,9,Gabriel Coronado,Dublin,80.01,183.7,88.45,181.44,453.59,Single-ply,SBD,M
Boys,89.81,10,Preston Smith,Midlothian,82.28,172.37,102.06,176.9,451.32,Single-ply,SBD,M
Boys,82.1,11,Tim Canders,Castleberry,79.29,154.22,83.91,197.31,435.45,Single-ply,SBD,M
Boys,82.1,12,Caleb Bubeniz,Santo,79.92,174.63,83.91,174.63,433.18,Single-ply,SBD,M
Boys,82.1,13,Emiliano Jimenez,Comanche,80.29,163.29,90.72,170.1,424.11,Single-ply,SBD,M
Boys,82.1,14,Hunter Whaley,Stephenville,76.75,136.08,86.18,129.27,351.53,Single-ply,SBD,M
Boys,82.1,DQ,Moses Garcia,Comanche,81.19,147.42,,,,Single-ply,SBD,M
Boys,82.1,DQ,Collin Schasteen,Clifton,80.29,176.9,115.67,163.29,,Single-ply,SBD,M
Boys,89.81,1,Eric Maldonado,Castleberry,89.27,244.94,161.03,267.62,673.58,Single-ply,SBD,M
Boys,89.81,2,Lio Garcia,Stephenville,86.45,192.78,138.35,226.8,557.92,Single-ply,SBD,M
Boys,89.81,3,Abel Barboza,Castleberry,88.54,226.8,127.01,201.85,555.65,Single-ply,SBD,M
Boys,89.81,4,Ragan Wood,Stephenville,85.96,229.06,127.01,197.31,553.38,Single-ply,SBD,M
Boys,89.81,5,Ty Cochrane,Tolar,84.37,199.58,111.13,235.87,546.58,Single-ply,SBD,M
Boys,89.81,6,Isaiah Regeon,Brady,87.63,215.46,131.54,195.04,542.04,Single-ply,SBD,M
Boys,89.81,7,Jesse Estrada,Brady,86.18,201.85,111.13,219.99,532.97,Single-ply,SBD,M
Boys,89.81,8,Jordan Larance,Clifton,88,217.72,113.4,199.58,530.7,Single-ply,SBD,M
Boys,89.81,9,Devonte Evetts,Brownwood,89.81,190.51,124.74,215.46,530.7,Single-ply,SBD,M
Boys,89.81,10,Cohen Cockburn,Lampasas,87.72,188.24,113.4,213.19,514.83,Single-ply,SBD,M
Boys,89.81,11,Drannon Brewer,Glen Rose,89.81,201.85,106.59,206.38,514.83,Single-ply,SBD,M
Boys,89.81,12,Jonathon Carrillo,Fort Worth Paschal,85.28,181.44,124.74,197.31,503.49,Single-ply,SBD,M
Boys,89.81,13,Clayton Hawkins,Graham,83.91,199.58,102.06,197.31,498.95,Single-ply,SBD,M
Boys,89.81,14,Shay Tompkins,Brownwood,84.1,192.78,97.52,197.31,487.61,Single-ply,SBD,M
Boys,89.81,15,Matthew Cherry,Midlothian,87.45,181.44,111.13,185.97,478.54,Single-ply,SBD,M
Boys,89.81,16,Mason Chapa,Castleberry,87.45,176.9,97.52,192.78,467.2,Single-ply,SBD,M
Boys,89.81,17,Lucas Ramsey,Perrin-Whitt,89.63,185.97,104.33,165.56,455.86,Single-ply,SBD,M
Boys,89.81,18,Jason Escobedo,Lake Worth,84.37,170.1,111.13,167.83,449.06,Single-ply,SBD,M
Boys,89.81,19,Rieken Douglas,Stephenville,88.54,181.44,92.99,174.63,449.06,Single-ply,SBD,M
Boys,89.81,20,Logan Ramsey,Perrin-Whitt,87.45,170.1,97.52,149.69,417.3,Single-ply,SBD,M
Boys,89.81,21,Nathan Martin,Stephenville,87.23,142.88,83.91,163.29,390.09,Single-ply,SBD,M
Boys,89.81,22,Michael Ivy,Santo,84.28,167.83,74.84,142.88,385.55,Single-ply,SBD,M
Boys,89.81,23,Cole Hall,Perrin-Whitt,85.73,136.08,77.11,145.15,358.34,Single-ply,SBD,M
Boys,89.81,DQ,Kody Wages,Millsap,82.55,,,,,Single-ply,SBD,M
Boys,89.81,DQ,Logan Trotter,Lampasas,89.27,158.76,,,,Single-ply,SBD,M
Boys,89.81,DQ,Edwin Allen,Fort Worth Paschal,83.55,165.56,102.06,,,Single-ply,SBD,M
Boys,89.81,DQ,Gordon Lewis,Tolar,84.64,,,,,Single-ply,SBD,M
Boys,89.81,DQ,Raylon Jones,Fort Worth Arlington Heights,88.27,190.51,124.74,204.12,,Single-ply,SBD,M
Boys,89.81,DQ,Kevin Bowie,Fort Worth Arlington Heights,89.81,213.19,142.88,204.12,,Single-ply,SBD,M
Boys,89.81,DQ,Chase Coleman,North Crowley,89.36,226.8,131.54,242.67,,Single-ply,SBD,M
Boys,99.79,1,Heath Nicholson,Glen Rose,96.43,260.82,136.08,272.16,669.05,Single-ply,SBD,M
Boys,99.79,2,Braxton Barrios,Glen Rose,96.43,249.48,145.15,219.99,614.62,Single-ply,SBD,M
Boys,99.79,3,Josh Brown,North Crowley,96.89,249.48,136.08,229.06,614.62,Single-ply,SBD,M
Boys,99.79,4,Johnny Morales,Mineral Wells,98.7,238.14,161.03,215.46,614.62,Single-ply,SBD,M
Boys,99.79,5,Miguel Barraza,Glen Rose,92.9,240.4,140.61,222.26,603.28,Single-ply,SBD,M
Boys,99.79,6,Aaron Platt,Tolar,97.7,215.46,161.03,222.26,598.74,Single-ply,SBD,M
Boys,99.79,7,Dalton Gilliam,Cross Plains,92.26,226.8,138.35,213.19,578.33,Single-ply,SBD,M
Boys,99.79,8,Cj Camarillo,Brady,96.16,222.26,154.22,192.78,569.26,Single-ply,SBD,M
Boys,109.77,9,Alfonso Duran,Graham,99.97,233.6,111.13,208.65,553.38,Single-ply,SBD,M
Boys,99.79,10,Adam Prado,Lampasas,98.79,215.46,145.15,190.51,551.11,Single-ply,SBD,M
Boys,99.79,11,Kolby Parks,Mineral Wells,92.71,208.65,131.54,188.24,528.44,Single-ply,SBD,M
Boys,99.79,12,Dylan Mihecoby,Wichita Falls Rider,97.52,192.78,117.93,199.58,510.29,Single-ply,SBD,M
Boys,99.79,13,Tyler Kindig,Wichita Falls Rider,90.72,199.58,117.93,185.97,503.49,Single-ply,SBD,M
Boys,99.79,14,Anthony Castillo,Castleberry,99.79,195.04,108.86,188.24,492.15,Single-ply,SBD,M
Boys,99.79,15,Conner Warmerdam,Stephenville,98.61,197.31,120.2,172.37,489.88,Single-ply,SBD,M
Boys,99.79,16,David Garcia,Mineral Wells,96.89,197.31,99.79,185.97,483.08,Single-ply,SBD,M
Boys,99.79,17,James Dorris,Santo,98.43,158.76,97.52,213.19,469.47,Single-ply,SBD,M
Boys,99.79,18,Nain Martinez,Cross Plains,93.98,176.9,106.59,172.37,455.86,Single-ply,SBD,M
Boys,99.79,19,Seth Alston,Santo,96.25,183.7,102.06,170.1,455.86,Single-ply,SBD,M
Boys,99.79,20,Ezekiel Kealoha,Fort Worth Arlington Heights,92.9,172.37,104.33,163.29,439.98,Single-ply,SBD,M
Boys,99.79,21,Jeremy Ansley,Lake Worth,91.35,154.22,86.18,158.76,399.16,Single-ply,SBD,M
Boys,99.79,22,Alex Winter,Bridgeport,92.53,142.88,70.31,161.03,374.21,Single-ply,SBD,M
Boys,99.79,23,Zane Drury,Stephenville,99.52,127.01,86.18,129.27,342.46,Single-ply,SBD,M
Boys,99.79,24,Michael Robinson,Millsap,95.53,120.2,72.57,120.2,312.98,Single-ply,SBD,M
Boys,99.79,DQ,Alonso Alvarado,Fort Worth Paschal,98.79,206.38,142.88,,,Single-ply,SBD,M
Boys,109.77,1,Ambrosio Rodriguez,Dublin,108.32,249.48,158.76,219.99,628.23,Single-ply,SBD,M
Boys,109.77,2,Austin Coker,Santo,105.51,244.94,138.35,226.8,610.08,Single-ply,SBD,M
Boys,109.77,3,Christopher Reyes,Fort Worth Paschal,108.23,242.67,142.88,219.99,605.55,Single-ply,SBD,M
Boys,109.77,4,Jacob Boyd,Mineral Wells,108.86,226.8,165.56,213.19,605.55,Single-ply,SBD,M
Boys,109.77,5,Guillermo Parham,Wichita Falls Rider,104.69,249.48,156.49,197.31,603.28,Single-ply,SBD,M
Boys,109.77,6,Jacob Martin,Stephenville,105.78,249.48,136.08,215.46,601.01,Single-ply,SBD,M
Boys,109.77,7,Tyler Jennings,Bridgeport,105.96,215.46,167.83,215.46,598.74,Single-ply,SBD,M
Boys,109.77,8,David Madore,Ranger,108.14,219.99,149.69,229.06,598.74,Single-ply,SBD,M
Boys,109.77,9,Federico Arvizu,Castleberry,104.14,229.06,124.74,226.8,580.6,Single-ply,SBD,M
Boys,109.77,10,Matt Willis,Glen Rose,107.14,226.8,124.74,219.99,571.53,Single-ply,SBD,M
Boys,109.77,11,Chance Pierce,Bridgeport,103.6,183.7,140.61,215.46,539.77,Single-ply,SBD,M
Boys,109.77,12,Ethan Price,Dublin,106.41,204.12,142.88,174.63,521.63,Single-ply,SBD,M
Boys,109.77,13,Austin Roadruck,Fort Worth Arlington Heights,102.33,208.65,113.4,172.37,494.42,Single-ply,SBD,M
Boys,109.77,14,Weston Conine,Comanche,103.87,181.44,131.54,181.44,494.42,Single-ply,SBD,M
Boys,109.77,15,Bronc Dillard,Cross Plains,108.32,195.04,113.4,183.7,492.15,Single-ply,SBD,M
Boys,109.77,16,David Palacios,Graham,103.24,197.31,102.06,190.51,489.88,Single-ply,SBD,M
Boys,109.77,17,Zach Thompson,Cross Plains,104.96,195.04,106.59,181.44,483.08,Single-ply,SBD,M
Boys,109.77,18,Justin Dominguez,Mineral Wells,104.78,181.44,120.2,170.1,471.74,Single-ply,SBD,M
Boys,109.77,19,Trace Coe,Mineral Wells,101.6,172.37,120.2,170.1,462.66,Single-ply,SBD,M
Boys,109.77,20,Alex Jimenez,Lake Worth,105.78,170.1,108.86,163.29,442.25,Single-ply,SBD,M
Boys,109.77,21,Steven Pena,North Crowley,103.42,165.56,83.91,174.63,424.11,Single-ply,SBD,M
Boys,109.77,DQ,Caul Smith,Lampasas,102.69,192.78,124.74,,,Single-ply,SBD,M
Boys,124.74,1,Bronson Burks,Bridgeport,124.28,251.74,142.88,265.35,659.98,Single-ply,SBD,M
Boys,124.74,2,Austin Northcutt,Stephenville,117.66,238.14,147.42,244.94,630.49,Single-ply,SBD,M
Boys,124.74,3,Zach Perry,Fort Worth Arlington Heights,119.29,226.8,136.08,204.12,566.99,Single-ply,SBD,M
Boys,124.74,4,Dylan Lopez,Fort Worth Paschal,124.01,192.78,115.67,188.24,496.68,Single-ply,SBD,M
Boys,124.74,5,Shawn Wheat,Bridgeport,115.67,174.63,117.93,197.31,489.88,Single-ply,SBD,M
Boys,124.74,6,Andrew Fry,Wichita Falls Rider,118.21,190.51,108.86,188.24,487.61,Single-ply,SBD,M
Boys,124.74,7,Eric Stonecheck,Bridgeport,123.83,131.54,108.86,181.44,421.84,Single-ply,SBD,M
Boys,124.74,8,Ryan Belew,Dublin,124.01,170.1,81.65,158.76,410.5,Single-ply,SBD,M
Boys,124.74,9,Donavan Moore,Gustine,110.13,99.79,92.99,158.76,351.53,Single-ply,SBD,M
Boys,124.74,DQ,Kolten Trevino,Lake Worth,113.58,,,,,Single-ply,SBD,M
Boys,124.74,DQ,Dillon Hinojosa,Lake Worth,111.13,,,,,Single-ply,SBD,M
Boys,124.74,DQ,Leo Garcia,Gustine,111.31,122.47,,,,Single-ply,SBD,M
Boys,124.74+,1,Jordan Allen,Clifton,159.48,306.17,167.83,226.8,700.8,Single-ply,SBD,M
Boys,124.74+,2,Taylor Hopkins,Graham,139.07,226.8,170.1,222.26,619.15,Single-ply,SBD,M
Boys,124.74+,3,Suraj Dhillon,Fort Worth Paschal,131.72,242.67,131.54,222.26,596.47,Single-ply,SBD,M
Boys,124.74+,4,Cameron Kennaley,Midlothian,133.81,229.06,131.54,226.8,587.4,Single-ply,SBD,M
Boys,124.74+,5,Chris Castillo,Graham,133.54,254.01,131.54,195.04,580.6,Single-ply,SBD,M
Boys,124.74+,6,Anthony Ortiz,Bridgeport,131.63,192.78,136.08,215.46,544.31,Single-ply,SBD,M
Boys,124.74+,7,Chris Nix,Lampasas,131.36,192.78,129.27,217.72,539.77,Single-ply,SBD,M
Boys,124.74+,8,Keaton Vawter,Bridgeport,132.81,174.63,117.93,188.24,480.81,Single-ply,SBD,M
Boys,124.74+,DQ,Tariq Henderson,Fort Worth Paschal,133.99,,,,,Single-ply,SBD,M
