Division,WeightClassKg,Place,Name,Team,BodyweightKg,Best3SquatKg,Best3BenchKg,Best3DeadliftKg,TotalKg,Equipment,Event,Sex
Boys,51.71,1,Christian Solis,Pecos,51.71,97.52,79.38,133.81,310.71,Single-ply,SBD,M
Boys,51.71,2,Jorge Delgado,Andrews,45.81,95.25,45.36,104.33,244.94,Single-ply,SBD,M
Boys,51.71,3,Jose Vasquez Cruz,Andrews,42.73,95.25,45.36,95.25,235.87,Single-ply,SBD,M
Boys,51.71,4,Kaleb Nance,Midland Greenwood,39.1,56.7,27.22,68.04,151.95,Single-ply,SBD,M
Boys,55.79,1,Zaniel Florez,Kermit,55.07,142.88,72.57,142.88,358.34,Single-ply,SBD,M
Boys,55.79,2,Jack Blair,Midland Greenwood,55.34,108.86,63.5,102.06,274.42,Single-ply,SBD,M
Boys,55.79,DQ,Anthony Tran,Seminole,54.07,115.67,,,,Single-ply,SBD,M
Boys,55.79,DQ,Augie Maldonado,Midland,54.7,,,,,Single-ply,SBD,M
Boys,59.87,1,Junie Gonzales,Midland Greenwood,59.87,158.76,74.84,156.49,390.09,Single-ply,SBD,M
Boys,59.87,2,Jackson Carroll,Pecos,58.92,117.93,65.77,136.08,319.78,Single-ply,SBD,M
Boys,59.87,3,Cayden Ruiz,Midland Greenwood,59.51,108.86,86.18,113.4,308.44,Single-ply,SBD,M
Boys,59.87,DQ,Lucas Esparza,Andrews,59.78,172.37,,,,Single-ply,SBD,M
Boys,59.87,DQ,Rene Heredia,Monahans,59.69,,,,,Single-ply,SBD,M
Boys,59.87,DQ,Óscar Vásquez,Monahans,59.24,,,,,Single-ply,SBD,M
Boys,67.13,1,Christian Valles,Andrews,66.5,213.19,108.86,201.85,523.9,Single-ply,SBD,M
Boys,67.13,2,Gabriel Zubiate,Seminole,66.32,174.63,77.11,176.9,428.64,Single-ply,SBD,M
Boys,67.13,3,Luis Zubiate,Seminole,67.04,172.37,77.11,172.37,421.84,Single-ply,SBD,M
Boys,67.13,4,Oscar Ariza,Seminole,66.95,156.49,90.72,167.83,415.04,Single-ply,SBD,M
Boys,67.13,5,Cowan Tab,Midland Greenwood,62.6,136.08,81.65,136.08,353.8,Single-ply,SBD,M
Boys,67.13,6,Xavier Urias,McCamey,63.68,113.4,81.65,127.01,322.05,Single-ply,SBD,M
Boys,67.13,7,Adalberto Verdugo,Seminole,62.14,127.01,58.97,127.01,312.98,Single-ply,SBD,M
Boys,67.13,8,Sawyer Jackson,Alpine,65.23,68.04,61.23,88.45,217.72,Single-ply,SBD,M
Boys,67.13,9,Ryan Austin,Midland Greenwood,65.68,154.22,,,154.22,Single-ply,S,M
Boys,74.84,1,Ryan Orona,Pecos,74.84,192.78,129.27,226.8,548.85,Single-ply,SBD,M
Boys,74.84,2,Devin Doerksen,Seminole,72.94,199.58,104.33,215.46,519.36,Single-ply,SBD,M
Boys,74.84,3,Cesar Trejo,Fort Stockton,72.85,188.24,122.47,188.24,498.95,Single-ply,SBD,M
Boys,74.84,4,Gabriel Mendoza,Kermit,74.57,181.44,99.79,185.97,467.2,Single-ply,SBD,M
Boys,74.84,5,Hayden Gray,Seminole,73.12,183.7,104.33,174.63,462.66,Single-ply,SBD,M
Boys,74.84,6,Devan Salas,Pecos,70.99,167.83,95.25,174.63,437.72,Single-ply,SBD,M
Boys,74.84,7,Oscar Sanchez,Odessa,72.57,170.1,97.52,170.1,437.72,Single-ply,SBD,M
Boys,74.84,8,Colter Robertson,Seminole,67.59,158.76,77.11,147.42,383.29,Single-ply,SBD,M
Boys,74.84,9,Mack Plemons,Midland,74.48,136.08,88.45,138.35,362.87,Single-ply,SBD,M
Boys,74.84,10,Javon Mathews,Midland,69.49,190.51,92.99,,283.5,Single-ply,SB,M
Boys,74.84,11,Jalen Ybarra,Crane,73.84,179.17,92.99,,272.16,Single-ply,SB,M
Boys,74.84,DQ,Jarod Humphries,Midland Greenwood,74.48,,,,,Single-ply,SB,M
Boys,74.84,DQ,Raymond Flores,Andrews,68.4,197.31,,,,Single-ply,SB,M
Boys,82.1,1,Ernesto Ornales,Monahans,80.47,195.04,142.88,201.85,539.77,Single-ply,SBD,M
Boys,82.1,2,Devin Mora,Andrews,76.11,217.72,117.93,181.44,517.1,Single-ply,SBD,M
Boys,82.1,3,Tyler Paris,Odessa,79.38,151.95,111.13,199.58,462.66,Single-ply,SBD,M
Boys,82.1,4,William Hewitt,Seminole,76.84,190.51,99.79,167.83,458.13,Single-ply,SBD,M
Boys,82.1,5,Victor Salazar,Pecos,77.02,147.42,90.72,161.03,399.16,Single-ply,SBD,M
Boys,82.1,6,Marco Martínez,Alpine,77.56,72.57,47.63,99.79,219.99,Single-ply,SBD,M
Boys,82.1,DQ,Zion Ward,Midland,82.01,,,,,Single-ply,SBD,M
Boys,82.1,DQ,Edgar Caballero,Monahans,80.65,,,,,Single-ply,SBD,M
Boys,82.1,DQ,Josue Flores,Andrews,82.1,233.6,122.47,,,Single-ply,SBD,M
Boys,89.81,1,J Tom Garcia,Andrews,88.45,217.72,149.69,190.51,557.92,Single-ply,SBD,M
Boys,89.81,2,Justin Gonzales,Andrews,88.54,213.19,149.69,192.78,555.65,Single-ply,SBD,M
Boys,89.81,3,Mikial Burrola,Kermit,88.18,199.58,115.67,188.24,503.49,Single-ply,SBD,M
Boys,89.81,4,Andre Burling,Alpine,88.36,188.24,111.13,192.78,492.15,Single-ply,SBD,M
Boys,89.81,5,Axel Nuno,Crane,83.82,185.97,120.2,181.44,487.61,Single-ply,SBD,M
Boys,89.81,6,Sam Clendenen,Crane,82.19,181.44,99.79,179.17,460.4,Single-ply,SBD,M
Boys,89.81,7,Sylis Vidana,Monahans,86.18,176.9,97.52,172.37,446.79,Single-ply,SBD,M
Boys,89.81,8,Ryan Gooch,Alpine,87.82,170.1,86.18,158.76,415.04,Single-ply,SBD,M
Boys,89.81,9,Ashton Vega,Alpine,86,102.06,58.97,113.4,274.42,Single-ply,SBD,M
Boys,89.81,DQ,Freddy Cabos,Midland,82.74,131.54,92.99,,,Single-ply,SBD,M
Boys,99.79,1,Ian Alvidrez,Seminole,98.07,288.03,179.17,288.03,755.23,Single-ply,SBD,M
Boys,99.79,2,Hayden Pipkin,Monahans,94.71,244.94,163.29,226.8,635.03,Single-ply,SBD,M
Boys,99.79,3,Emmanuel Camacho,Crane,99.52,258.55,133.81,208.65,601.01,Single-ply,SBD,M
Boys,99.79,4,Petronillo Bustamante,Andrews,96.8,199.58,106.59,190.51,496.68,Single-ply,SBD,M
Boys,99.79,5,Angelo Lopez,Kermit,98.34,195.04,122.47,174.63,492.15,Single-ply,SBD,M
Boys,99.79,6,Caleb Noble,Pecos,98.75,158.76,90.72,165.56,415.04,Single-ply,SBD,M
Boys,99.79,DQ,Colby Buckner,Andrews,97.16,,,,,Single-ply,SBD,M
Boys,99.79,DQ,Octavio Frausto,Andrews,95.71,,,,,Single-ply,SBD,M
Boys,99.79,DQ,Paul Walker,Crane,96.62,226.8,,,,Single-ply,SBD,M
Boys,99.79,DQ,Conner McDonald,Midland Greenwood,99.7,,,,,Single-ply,SBD,M
Boys,109.77,1,Christian Baca,Pecos,109.59,238.14,102.06,226.8,566.99,Single-ply,SBD,M
Boys,109.77,2,Matthew Underwood,Wink,108.41,238.14,131.54,183.7,553.38,Single-ply,SBD,M
Boys,109.77,3,Devon Butler,Crane,107.05,210.92,136.08,192.78,539.77,Single-ply,SBD,M
Boys,109.77,4,Angel Rodríguez,Odessa,103.42,206.38,129.27,195.04,530.7,Single-ply,SBD,M
Boys,109.77,5,Caleb Alexander,Seminole,107.5,213.19,92.99,179.17,485.34,Single-ply,SBD,M
Boys,109.77,DQ,Juan Pulido,Crane,100.06,181.44,90.72,,,Single-ply,SBD,M
Boys,109.77,DQ,Joel Estrella,Andrews,106.78,,,,,Single-ply,SBD,M
Boys,109.77,DQ,Andrew Trejo,Pecos,106.1,,,,,Single-ply,SBD,M
Boys,109.77,DQ,Kyle Coffee,Monahans,109.41,188.24,106.59,,,Single-ply,SBD,M
Boys,124.74,1,Gabriel Marin,Andrews,116.03,258.55,158.76,217.72,635.03,Single-ply,SBD,M
Boys,124.74,2,Spencer Blue,Midland,121.56,224.53,136.08,240.4,601.01,Single-ply,SBD,M
Boys,124.74,3,Kwinton Jennings,Seminole,123.29,242.67,120.2,224.53,587.4,Single-ply,SBD,M
Boys,124.74,4,Ivien Gonzales,Lamesa,121.47,226.8,142.88,210.92,580.6,Single-ply,SBD,M
Boys,124.74,5,Darius Pando,Kermit,113.58,231.33,115.67,226.8,573.79,Single-ply,SBD,M
Boys,124.74,6,Jayson Pagan,McCamey,111.58,219.99,129.27,197.31,546.58,Single-ply,SBD,M
Boys,124.74,7,Gerry Salazar,McCamey,111.77,199.58,117.93,197.31,514.83,Single-ply,SBD,M
Boys,124.74,DQ,Ethan Martinez,Lamesa,119.48,,,,,Single-ply,SBD,M
Boys,124.74+,1,Reece Azam,Andrews,134.44,254.01,183.7,217.72,655.44,Single-ply,SBD,M
Boys,124.74+,2,Ralph Navarette,Crane,156.04,272.16,133.81,238.14,644.1,Single-ply,SBD,M
Boys,124.74+,3,Zach Garcia,Pecos,156.22,263.08,138.35,199.58,601.01,Single-ply,SBD,M
Boys,124.74+,4,Raziel Burrola,Kermit,125.01,213.19,167.83,208.65,589.67,Single-ply,SBD,M
Boys,124.74+,5,Taelor Pister,McCamey,126.55,217.72,138.35,217.72,573.79,Single-ply,SBD,M
Boys,124.74+,6,Noah Martinez,Lamesa,145.69,224.53,83.91,172.37,480.81,Single-ply,SBD,M
Boys,124.74+,7,Josh Price,Pecos,126.92,149.69,106.59,145.15,401.43,Single-ply,SBD,M
Boys,124.74+,DQ,Albert Aguilar,Pecos,148.96,244.94,,,,Single-ply,SBD,M
Boys,,NS,Josue Vasquez,Kermit,,,,,,Single-ply,SBD,M
Boys,,NS,Hernan Hernandez,Kermit,,,,,,Single-ply,SBD,M
Boys,,NS,Irvin Delgado,Seminole,,,,,,Single-ply,SBD,M
Boys,,NS,Matthew Everett,Fort Stockton,,,,,,Single-ply,SBD,M
Boys,,NS,Jose Marquez,Odessa,,,,,,Single-ply,SBD,M
Boys,,NS,Julian Vizcaino,Odessa,,,,,,Single-ply,SBD,M
Boys,,NS,Jose Martinez,Crane,,,,,,Single-ply,SBD,M
Boys,,NS,Cameron Burger,Midland Greenwood,,,,,,Single-ply,SBD,M
Boys,,NS,Zachary Kidd,Midland Greenwood,,,,,,Single-ply,SBD,M
Boys,,NS,Mario Yanez,Monahans,,,,,,Single-ply,SBD,M
Boys,,NS,Ryan Gooch,Alpine,,,,,,Single-ply,SBD,M
Boys,,NS,Alejandro Valenzuela,Alpine,,,,,,Single-ply,SBD,M
Boys,,NS,Alexandro Mucharraz,Alpine,,,,,,Single-ply,SBD,M
