Division,WeightClassKg,Place,Name,Team,BodyweightKg,Best3SquatKg,Best3BenchKg,Best3DeadliftKg,TotalKg,Equipment,Event,Sex
Girls,44.23,1,Hope Brekel,Nederland,44.23,113.4,49.9,108.86,272.16,Single-ply,SBD,F
Girls,44.23,2,Taylor Killgo,Vidor,43.54,95.25,43.09,106.59,244.94,Single-ply,SBD,F
Girls,44.23,3,Hannah Alexander,Lumberton,43.54,90.72,49.9,97.52,238.14,Single-ply,SBD,F
Girls,47.85,1,Hayley Kinard,Vidor,46.72,122.47,49.9,106.59,278.96,Single-ply,SBD,F
Girls,47.85,2,Shania Dies,Bridge City,45.36,92.99,38.56,99.79,231.33,Single-ply,SBD,F
Girls,47.85,3,Hallie Cappell,Nederland,44.91,81.65,38.56,86.18,206.38,Single-ply,SBD,F
Girls,47.85,DQ,Hailey Alexander,Lumberton,46.72,95.25,56.7,,,Single-ply,SBD,F
Girls,51.94,1,Catarina Tran,Nederland,50.44,113.4,49.9,124.74,288.03,Single-ply,SBD,F
Girls,51.94,2,Karli Brewer,Nederland,49.8,108.86,52.16,108.86,269.89,Single-ply,SBD,F
Girls,51.94,3,Maggie Garcia,Bridge City,50.89,95.25,40.82,111.13,247.21,Single-ply,SBD,F
Girls,51.94,4,Eva Boudreaux,Bridge City,49.71,49.9,29.48,63.5,142.88,Single-ply,SBD,F
Girls,56.02,1,Hope Pridgen,Vidor,56.02,127.01,49.9,122.47,299.37,Single-ply,SBD,F
Girls,56.02,2,Isabella Barragan,Nederland,55.88,102.06,49.9,115.67,267.62,Single-ply,SBD,F
Girls,56.02,3,Megan Wilkinson,Lumberton,54.98,95.25,45.36,108.86,249.48,Single-ply,SBD,F
Girls,56.02,4,Sadie Stone,Bridge City,55.43,88.45,45.36,102.06,235.87,Single-ply,SBD,F
Girls,56.02,5,Devin Gould,Vidor,55.52,120.2,,,120.2,Single-ply,S,F
Girls,60.1,1,Jenna Hoffman,Vidor,58.24,136.08,63.5,145.15,344.73,Single-ply,SBD,F
Girls,60.1,2,Liz Richardson,Nederland,57.52,102.06,56.7,113.4,272.16,Single-ply,SBD,F
Girls,60.1,3,Vivian Hughes,Nederland,58.97,72.57,38.56,88.45,199.58,Single-ply,SBD,F
Girls,67.36,1,Hannah Goode,Nederland,61.42,120.2,47.63,104.33,272.16,Single-ply,SBD,F
Girls,67.36,2,Erin Talley,Lumberton,66.32,99.79,54.43,113.4,267.62,Single-ply,SBD,F
Girls,67.36,3,Jayden Shay,Nederland,61.33,49.9,40.82,117.93,208.65,Single-ply,SBD,F
Girls,67.36,4,Nicole Hamilton,Vidor,62.78,79.38,38.56,79.38,197.31,Single-ply,SBD,F
Girls,67.36,5,Jadyn Cunningham,Bridge City,60.51,79.38,38.56,74.84,192.78,Single-ply,SBD,F
Girls,67.36,6,Cassandra Collazo,Bridge City,61.33,79.38,40.82,,120.2,Single-ply,SB,F
Girls,75.07,1,Autumn Magnuson,Bridge City,68.95,131.54,68.04,122.47,322.05,Single-ply,SBD,F
Girls,75.07,2,Ashley Kimey,Nederland,73.94,113.4,47.63,136.08,297.1,Single-ply,SBD,F
Girls,75.07,3,Lacey Pender,Bridge City,69.67,115.67,49.9,117.93,283.5,Single-ply,SBD,F
Girls,75.07,4,Megan Sheehan,Lumberton,69.13,122.47,56.7,102.06,281.23,Single-ply,SBD,F
Girls,75.07,5,Meagen Lafley,Vidor,70.03,88.45,38.56,92.99,219.99,Single-ply,SBD,F
Girls,82.33,1,Ashley Gonzalez,Lumberton,75.84,142.88,72.57,136.08,351.53,Single-ply,SBD,F
Girls,82.33,2,Carlee Dearing,Bridge City,77.11,127.01,56.7,117.93,301.64,Single-ply,SBD,F
Girls,82.33,DQ,Skyla Lakey,Vidor,77.02,70.31,,,,Single-ply,SBD,F
Girls,90.04,1,Kimber Ellender,Bridge City,88.9,97.52,45.36,104.33,247.21,Single-ply,SBD,F
Girls,117.71,1,Leshawna Boudreaux,Nederland,101.42,108.86,72.57,127.01,308.44,Single-ply,SBD,F
Girls,117.71,2,Taryn Hopper,Nederland,114.03,117.93,63.5,117.93,299.37,Single-ply,SBD,F
Girls,117.71,3,Chloe LeJeune,Bridge City,100.15,104.33,56.7,129.27,290.3,Single-ply,SBD,F
Girls,,NS,Sam Hargrave,Bridge City,,,,,,Single-ply,SBD,F
