Division,WeightClassKg,Place,Name,Team,BodyweightKg,Best3SquatKg,Best3BenchKg,Best3DeadliftKg,TotalKg,Equipment,Event,Sex
Boys,51.71,1,Mario Giron,Pilot Point,51.53,140.61,81.65,156.49,378.75,Single-ply,SBD,M
Boys,51.71,2,Ricky Lopez,Frisco Centennial,48.9,136.08,77.11,138.35,351.53,Single-ply,SBD,M
Boys,51.71,3,Nate Lunsford,Frisco Wakeland,51.71,129.27,81.65,129.27,340.19,Single-ply,SBD,M
Boys,55.79,4,Isaiah Tobar,McKinney Boyd,51.94,97.52,54.43,127.01,278.96,Single-ply,SBD,M
Boys,51.71,5,Cameron Police,Frisco Wakeland,50.44,99.79,52.16,111.13,263.08,Single-ply,SBD,M
Boys,51.71,6,Jordan Brooks,Frisco,51.48,97.52,52.16,104.33,254.01,Single-ply,SBD,M
Boys,51.71,7,Mathew Read,Frisco Heritage,50.89,72.57,43.09,90.72,206.38,Single-ply,SBD,M
Boys,55.79,1,Carlos Reynoso,McKinney Boyd,55.2,158.76,79.38,167.83,405.97,Single-ply,SBD,M
Boys,55.79,2,Logan Police,Frisco Wakeland,55.43,158.76,88.45,158.76,405.97,Single-ply,SBD,M
Boys,55.79,3,Gavin Carroll,Frisco Wakeland,55.52,117.93,70.31,129.27,317.51,Single-ply,SBD,M
Boys,55.79,4,Brady Gordon,Frisco Centennial,55.02,113.4,70.31,127.01,310.71,Single-ply,SBD,M
Boys,59.87,1,Gerald Van Ess,McKinney North,59.06,181.44,102.06,183.7,467.2,Single-ply,SBD,M
Boys,59.87,2,Justin Acosta,Frisco Lone Star,57.83,181.44,92.99,151.95,426.38,Single-ply,SBD,M
Boys,59.87,3,David Colmenero,Pilot Point,58.88,133.81,70.31,170.1,374.21,Single-ply,SBD,M
Boys,67.13,4,Carl Harvey,Frisco Centennial,60.01,97.52,70.31,140.61,308.44,Single-ply,SBD,M
Boys,67.13,5,Colin Wilbourn,Frisco Heritage,60.01,72.57,58.97,102.06,233.6,Single-ply,SBD,M
Boys,67.13,1,Andrew Wilson,Frisco Wakeland,64.77,181.44,104.33,181.44,467.2,Single-ply,SBD,M
Boys,67.13,2,Nico Barlis,Frisco Centennial,66.09,165.56,99.79,192.78,458.13,Single-ply,SBD,M
Boys,67.13,3,Malik Taylor,Frisco Liberty,62.01,176.9,95.25,170.1,442.25,Single-ply,SBD,M
Boys,67.13,4,Kolby Dodson,Frisco Centennial,66.32,154.22,113.4,172.37,439.98,Single-ply,SBD,M
Boys,67.13,5,Bailey Forst,Frisco Heritage,66.9,181.44,88.45,167.83,437.72,Single-ply,SBD,M
Boys,67.13,6,Jake Schumaker,Frisco Centennial,66.18,170.1,108.86,147.42,426.38,Single-ply,SBD,M
Boys,67.13,7,David Bikhai,Pilot Point,61.87,142.88,74.84,174.63,392.36,Single-ply,SBD,M
Boys,67.13,8,Will Perry,Frisco Wakeland,66.54,161.03,92.99,129.27,383.29,Single-ply,SBD,M
Boys,67.13,9,Jeremiah Beck,Richardson Lake Highlands,64.5,131.54,88.45,161.03,381.02,Single-ply,SBD,M
Boys,67.13,10,Jonathan Rodriguez,Frisco Independence,63.05,129.27,83.91,138.35,351.53,Single-ply,SBD,M
Boys,67.13,11,Da'Shon Lee,Richardson Lake Highlands,64.36,113.4,65.77,161.03,340.19,Single-ply,SBD,M
Boys,67.13,12,Mason Castaldo,Frisco Independence,66.59,120.2,88.45,120.2,328.85,Single-ply,SBD,M
Boys,67.13,13,Cameron Cotogno,McKinney Boyd,63.32,99.79,86.18,136.08,322.05,Single-ply,SBD,M
Boys,67.13,14,Jack Brown,Frisco Heritage,61.78,111.13,70.31,136.08,317.51,Single-ply,SBD,M
Boys,74.84,1,George Kennard,Frisco Wakeland,71.21,185.97,131.54,195.04,512.56,Single-ply,SBD,M
Boys,74.84,2,Taylor Barrett,Pilot Point,70.49,176.9,97.52,174.63,449.06,Single-ply,SBD,M
Boys,74.84,3,Ricky Fantroy,McKinney,68.72,161.03,90.72,185.97,437.72,Single-ply,SBD,M
Boys,74.84,4,Colt Galaway,Pilot Point,73.8,154.22,97.52,172.37,424.11,Single-ply,SBD,M
Boys,74.84,5,Doren Gibson,McKinney Boyd,72.35,147.42,83.91,188.24,419.57,Single-ply,SBD,M
Boys,74.84,6,Octavion Warren,Richardson Lake Highlands,74.84,156.49,92.99,170.1,419.57,Single-ply,SBD,M
Boys,74.84,7,Alec Beckett,Pilot Point,73.03,151.95,86.18,174.63,412.77,Single-ply,SBD,M
Boys,74.84,8,Mike Edwards,Frisco Liberty,74.71,158.76,99.79,154.22,412.77,Single-ply,SBD,M
Boys,74.84,9,Aiden Kilbane,Frisco Lone Star,70.17,154.22,95.25,161.03,410.5,Single-ply,SBD,M
Boys,74.84,10,Hunter Smith,Frisco Wakeland,73.84,158.76,97.52,149.69,405.97,Single-ply,SBD,M
Boys,74.84,11,Sean Moore,McKinney,70.72,124.74,83.91,170.1,378.75,Single-ply,SBD,M
Boys,74.84,12,Chris Thompson,Richardson Lake Highlands,74.43,113.4,65.77,136.08,315.25,Single-ply,SBD,M
Boys,74.84,DQ,Tommy Warkins,Frisco Heritage,72.48,88.45,,,,Single-ply,SBD,M
Boys,74.84,DQ,Aj Jaecke,McKinney,71.76,122.47,,,,Single-ply,SBD,M
Boys,82.1,1,Anthony Pegues,Frisco Centennial,80.74,226.8,136.08,226.8,589.67,Single-ply,SBD,M
Boys,82.1,2,Athens Gochis,Pilot Point,81.69,195.04,106.59,195.04,496.68,Single-ply,SBD,M
Boys,82.1,3,Josh Lee,Richardson Lake Highlands,78.56,174.63,108.86,188.24,471.74,Single-ply,SBD,M
Boys,82.1,4,Branden Williams,Frisco Independence,80.33,192.78,83.91,181.44,458.13,Single-ply,SBD,M
Boys,82.1,5,Darrion Green,Pilot Point,78.11,167.83,115.67,172.37,455.86,Single-ply,SBD,M
Boys,82.1,6,Antonion Puga,Pilot Point,79.33,170.1,102.06,167.83,439.98,Single-ply,SBD,M
Boys,82.1,7,Wyatt Park,McKinney Boyd,77.84,158.76,102.06,167.83,428.64,Single-ply,SBD,M
Boys,82.1,8,Mathew Rechsteiner,Frisco Heritage,79.33,145.15,102.06,181.44,428.64,Single-ply,SBD,M
Boys,82.1,9,Tyler Batson,McKinney,80.51,142.88,104.33,181.44,428.64,Single-ply,SBD,M
Boys,82.1,10,Kyle Johnson,Frisco,76.07,151.95,102.06,158.76,412.77,Single-ply,SBD,M
Boys,82.1,11,Matt Hinkle,McKinney North,79.65,156.49,90.72,158.76,405.97,Single-ply,SBD,M
Boys,82.1,12,Grifin Collins,Frisco Liberty,80.42,158.76,95.25,136.08,390.09,Single-ply,SBD,M
Boys,82.1,13,Matt Melvin,McKinney Boyd,80.88,136.08,79.38,149.69,365.14,Single-ply,SBD,M
Boys,89.81,1,Antonio Oliver,McKinney,83.23,185.97,104.33,217.72,508.02,Single-ply,SBD,M
Boys,99.79,2,Noah Forte,McKinney North,90.04,165.56,115.67,210.92,492.15,Single-ply,SBD,M
Boys,89.81,3,Richard McNamara,Frisco Liberty,87.72,179.17,120.2,172.37,471.74,Single-ply,SBD,M
Boys,89.81,4,Zach Barenberg,McKinney Boyd,89.04,154.22,111.13,201.85,467.2,Single-ply,SBD,M
Boys,89.81,5,Derek Brantzeg,Frisco Wakeland,88.72,167.83,104.33,181.44,453.59,Single-ply,SBD,M
Boys,89.81,6,Gage Lowe,Frisco Centennial,89.72,176.9,99.79,172.37,449.06,Single-ply,SBD,M
Boys,89.81,7,Matt Hawke,Frisco Independence,89.36,147.42,104.33,174.63,426.38,Single-ply,SBD,M
Boys,89.81,8,Taylor Hayen,Frisco Centennial,85.68,154.22,92.99,174.63,421.84,Single-ply,SBD,M
Boys,99.79,9,Khalil Lewis,McKinney North,89.95,158.76,83.91,174.63,417.3,Single-ply,SBD,M
Boys,89.81,10,Braden Torres-Labrie,Frisco Heritage,89.77,154.22,99.79,161.03,415.04,Single-ply,SBD,M
Boys,89.81,11,Connor Brach,Frisco,84.64,147.42,97.52,158.76,403.7,Single-ply,SBD,M
Boys,89.81,12,Spencer Gregory,McKinney North,82.55,138.35,92.99,149.69,381.02,Single-ply,SBD,M
Boys,89.81,13,Angel Herrera,Frisco Independence,84.78,138.35,86.18,149.69,374.21,Single-ply,SBD,M
Boys,89.81,14,Brandon Cambre,Frisco Independence,87.45,136.08,79.38,140.61,356.07,Single-ply,SBD,M
Boys,89.81,15,Seye Akinwale,Frisco Heritage,83.42,97.52,70.31,136.08,303.91,Single-ply,SBD,M
Boys,99.79,DQ,John Groff,Pilot Point,89.86,272.16,170.1,,,Single-ply,SBD,M
Boys,99.79,1,Alec Melkovitz,Frisco Centennial,92.62,231.33,147.42,192.78,571.53,Single-ply,SBD,M
Boys,99.79,2,Michael Mwosu,Richardson Lake Highlands,90.13,215.46,113.4,240.4,569.26,Single-ply,SBD,M
Boys,99.79,3,Jared Morris,McKinney North,94.89,195.04,117.93,226.8,539.77,Single-ply,SBD,M
Boys,99.79,4,Ryan Knesek,Frisco Wakeland,94.8,195.04,102.06,208.65,505.76,Single-ply,SBD,M
Boys,99.79,5,Ezequiel Trejo,Pilot Point,91.99,192.78,102.06,208.65,503.49,Single-ply,SBD,M
Boys,99.79,6,Michael Carpin,Frisco Heritage,96.57,158.76,117.93,181.44,458.13,Single-ply,SBD,M
Boys,99.79,7,Torrain Walker,McKinney,90.45,185.97,95.25,170.1,451.32,Single-ply,SBD,M
Boys,99.79,8,Rafay Usman,Frisco Liberty,95.25,163.29,113.4,172.37,449.06,Single-ply,SBD,M
Boys,99.79,9,Zack Rupe,McKinney,96.3,158.76,122.47,154.22,435.45,Single-ply,SBD,M
Boys,99.79,10,Devonte Fluellen,Richardson Lake Highlands,93.49,147.42,117.93,165.56,430.91,Single-ply,SBD,M
Boys,99.79,11,Chase Gschwend,Frisco Independence,94.71,174.63,86.18,167.83,428.64,Single-ply,SBD,M
Boys,99.79,12,Logan Jones,Frisco Lone Star,91.4,133.81,113.4,165.56,412.77,Single-ply,SBD,M
Boys,99.79,13,Vincent Ton,Frisco,98.2,147.42,99.79,156.49,403.7,Single-ply,SBD,M
Boys,99.79,14,Sergio Aldana,Frisco,94.57,133.81,97.52,158.76,390.09,Single-ply,SBD,M
Boys,109.77,1,Gage Rieter,Frisco Liberty,102.78,208.65,147.42,201.85,557.92,Single-ply,SBD,M
Boys,109.77,2,Drew Grisham,McKinney North,102.87,195.04,120.2,217.72,532.97,Single-ply,SBD,M
Boys,109.77,3,Kelvin Apari,Frisco Lone Star,100.88,192.78,124.74,190.51,508.02,Single-ply,SBD,M
Boys,109.77,4,Tyler Ballard,Frisco Liberty,105.78,195.04,113.4,183.7,492.15,Single-ply,SBD,M
Boys,109.77,5,Jake Ray,Frisco Lone Star,101.42,174.63,111.13,188.24,474,Single-ply,SBD,M
Boys,109.77,6,Jake Waszkowski,McKinney Boyd,104.6,138.35,142.88,183.7,464.93,Single-ply,SBD,M
Boys,109.77,7,Hunter Ghoreishi,Richardson Lake Highlands,101.56,158.76,88.45,195.04,442.25,Single-ply,SBD,M
Boys,109.77,8,Will Wagner,Frisco,106.5,122.47,97.52,172.37,392.36,Single-ply,SBD,M
Boys,109.77,9,Jeff Carson,McKinney,102.15,140.61,90.72,145.15,376.48,Single-ply,SBD,M
Boys,109.77,DQ,Sam Haster,Richardson Lake Highlands,106.64,163.29,83.91,,,Single-ply,SBD,M
Boys,124.74,1,Carlos Giron,Pilot Point,124.74,222.26,156.49,215.46,594.21,Single-ply,SBD,M
Boys,124.74,2,Philip Abramo,Frisco,121.7,226.8,142.88,197.31,566.99,Single-ply,SBD,M
Boys,124.74,3,Blaine Nuckols,Frisco Heritage,119.98,226.8,122.47,195.04,544.31,Single-ply,SBD,M
Boys,124.74,4,Donovan Taylor,Frisco Centennial,117.98,192.78,136.08,176.9,505.76,Single-ply,SBD,M
Boys,124.74,5,Constantino Zuniga,McKinney North,116.07,197.31,108.86,195.04,501.22,Single-ply,SBD,M
Boys,124.74,6,Christian Hernandez,Frisco Lone Star,115.44,183.7,124.74,170.1,478.54,Single-ply,SBD,M
Boys,124.74,7,Kevin Mair,Frisco Heritage,110.77,158.76,83.91,181.44,424.11,Single-ply,SBD,M
Boys,124.74,8,Jacob Sell,Richardson Lake Highlands,123.47,188.24,90.72,142.88,421.84,Single-ply,SBD,M
Boys,124.74,9,Andres Salerno,Frisco,110.18,124.74,92.99,167.83,385.55,Single-ply,SBD,M
Boys,124.74,10,Connor Wilkinson,Frisco,113.9,124.74,97.52,158.76,381.02,Single-ply,SBD,M
Boys,124.74+,1,Camren Thompson,Frisco Wakeland,125.69,269.89,154.22,256.28,680.39,Single-ply,SBD,M
Boys,124.74+,2,Alex Boyer,Frisco Liberty,129.59,235.87,158.76,215.46,610.08,Single-ply,SBD,M
Boys,124.74+,3,Alec Jamar,Frisco Liberty,130.36,249.48,138.35,210.92,598.74,Single-ply,SBD,M
Boys,124.74+,4,Francisco Estrada,Pilot Point,130.18,222.26,115.67,226.8,564.72,Single-ply,SBD,M
Boys,124.74+,5,Zach Thomas,McKinney North,143.34,233.6,136.08,192.78,562.45,Single-ply,SBD,M
Boys,124.74+,6,Patrick Quintana,McKinney Boyd,138.8,226.8,136.08,188.24,551.11,Single-ply,SBD,M
Boys,124.74+,7,Tanner Leser,Frisco Lone Star,128.59,185.97,120.2,181.44,487.61,Single-ply,SBD,M
Boys,124.74+,DQ,Kenny Gordon,Richardson Lake Highlands,136.12,217.72,140.61,,,Single-ply,SBD,M
Boys,,NS,Aj Womack,Frisco Lone Star,,,,,,Single-ply,SBD,M
Boys,,NS,Chima Maroney,Frisco Independence,,,,,,Single-ply,SBD,M
Boys,,NS,Adrian Castillo,McKinney,,,,,,Single-ply,SBD,M
Boys,,NS,Adain Mulligan,McKinney,,,,,,Single-ply,SBD,M
Boys,,NS,Caleb Stricklin,McKinney,,,,,,Single-ply,SBD,M
Boys,,NS,Dorrian Ogas,Frisco Liberty,,,,,,Single-ply,SBD,M
