Division,WeightClassKg,Place,Name,Team,BodyweightKg,Best3SquatKg,Best3BenchKg,Best3DeadliftKg,TotalKg,Equipment,Event,Sex
Boys,51.71,1,Clarence Smith,Abilene Cooper,51.53,131.54,77.11,147.42,356.07,Single-ply,SBD,M
Boys,51.71,2,Jamie Smith,Comanche,46.9,99.79,63.5,104.33,267.62,Single-ply,SBD,M
Boys,51.71,3,Tristan Dobson,Stephenville,51.26,83.91,45.36,102.06,231.33,Single-ply,SBD,M
Boys,55.79,1,Ray Lopez,Granbury,54.7,163.29,88.45,163.29,415.04,Single-ply,SBD,M
Boys,55.79,2,Justin Burnett,Hamilton,55.7,158.76,68.04,147.42,374.21,Single-ply,SBD,M
Boys,55.79,3,Terrence Sims,Abilene Cooper,54.98,113.4,74.84,124.74,312.98,Single-ply,SBD,M
Boys,55.79,4,Jeremy Moore,Fort Worth Western Hills,54.52,70.31,,,70.31,Single-ply,S,M
Boys,59.87,1,Kendrick Powdrill,Abilene Cooper,56.43,158.76,83.91,195.04,437.72,Single-ply,SBD,M
Boys,59.87,2,Morgan Kirkpatrick,Granbury,58.97,167.83,90.72,172.37,430.91,Single-ply,SBD,M
Boys,59.87,3,Edgar Macias,Lingleville,57.88,145.15,81.65,179.17,405.97,Single-ply,SBD,M
Boys,59.87,4,Michael Kohl,Rosebud-Lott,59.69,158.76,86.18,158.76,403.7,Single-ply,SBD,M
Boys,59.87,5,Austin Williams,Fort Worth Western Hills,58.88,138.35,99.79,156.49,394.63,Single-ply,SBD,M
Boys,59.87,6,Ruby Ramirez,Hamilton,59.24,151.95,81.65,149.69,383.29,Single-ply,SBD,M
Boys,59.87,7,Micael McCullough,Brownwood,56.52,156.49,86.18,136.08,378.75,Single-ply,SBD,M
Boys,67.13,8,Ryan Frakes,Tuscola Jim Ned,59.96,145.15,72.57,147.42,365.14,Single-ply,SBD,M
Boys,59.87,9,Henry Wilson,Fort Worth Western Hills,58.51,127.01,88.45,142.88,358.34,Single-ply,SBD,M
Boys,59.87,10,Mario Morado,Brady,59.87,113.4,68.04,154.22,335.66,Single-ply,SBD,M
Boys,59.87,11,Dakota Murray,Brady,56.61,133.81,52.16,131.54,317.51,Single-ply,SBD,M
Boys,59.87,12,Jeff Reese,Tuscola Jim Ned,58.06,115.67,68.04,124.74,308.44,Single-ply,SBD,M
Boys,59.87,13,Clayton Young,Stephenville,59.87,104.33,58.97,129.27,292.57,Single-ply,SBD,M
Boys,67.13,1,Jazper Solis,Abilene,65.59,204.12,111.13,190.51,505.76,Single-ply,SBD,M
Boys,74.84,2,Tj Bruns,Abilene Cooper,67.22,174.63,104.33,151.95,430.91,Single-ply,SBD,M
Boys,67.13,3,Carlton Vance,Keller Timber Creek,66.13,174.63,86.18,154.22,415.04,Single-ply,SBD,M
Boys,74.84,4,Sean Pyburn,Comanche,67.31,156.49,97.52,161.03,415.04,Single-ply,SBD,M
Boys,67.13,5,Hunter Self,Abilene,65.5,149.69,88.45,170.1,408.23,Single-ply,SBD,M
Boys,67.13,6,Shane Trogden,Odessa Permian,66.41,149.69,83.91,149.69,383.29,Single-ply,SBD,M
Boys,67.13,7,Montrele Clark,Fort Worth Wyatt,64.41,129.27,83.91,165.56,378.75,Single-ply,SBD,M
Boys,67.13,8,Kerry Sims,Abilene Cooper,61.69,124.74,72.57,151.95,349.27,Single-ply,SBD,M
Boys,67.13,9,Dylan White,Stephenville,65.77,113.4,88.45,138.35,340.19,Single-ply,SBD,M
Boys,67.13,10,Austin Hall,Odessa Permian,63.41,117.93,88.45,129.27,335.66,Single-ply,SBD,M
Boys,67.13,11,Rodney Rice,Brady,63.59,127.01,70.31,136.08,333.39,Single-ply,SBD,M
Boys,67.13,12,Chase McKissick,Tuscola Jim Ned,61.33,122.47,68.04,131.54,322.05,Single-ply,SBD,M
Boys,67.13,13,Kyle Arnold,Stephenville,64.41,99.79,56.7,129.27,285.76,Single-ply,SBD,M
Boys,67.13,DQ,Adam Boyer,Brady,64.14,,,,,Single-ply,SBD,M
Boys,74.84,1,Allen Almgren,Bangs,68.67,238.14,97.52,199.58,535.24,Single-ply,SBD,M
Boys,74.84,2,Josh Rodriguez,Stephenville,74.84,192.78,113.4,206.38,512.56,Single-ply,SBD,M
Boys,74.84,3,Jose Ramirez,Brady,74.03,188.24,99.79,215.46,503.49,Single-ply,SBD,M
Boys,74.84,4,Dakota Morris,Tuscola Jim Ned,73.21,183.7,127.01,183.7,494.42,Single-ply,SBD,M
Boys,74.84,5,Gabrial Diaz,Abilene Cooper,68.22,190.51,102.06,190.51,483.08,Single-ply,SBD,M
Boys,74.84,6,Carder Brooks,Hamilton,72.12,204.12,95.25,183.7,483.08,Single-ply,SBD,M
Boys,74.84,7,Aj Moore,Stephenville,74.84,181.44,108.86,181.44,471.74,Single-ply,SBD,M
Boys,74.84,8,Santiago Navajas,Abilene Cooper,70.76,163.29,124.74,176.9,464.93,Single-ply,SBD,M
Boys,74.84,9,Michael Molinar,Odessa Permian,70.85,181.44,95.25,165.56,442.25,Single-ply,SBD,M
Boys,74.84,10,Devin Rushing,De Soto,74.84,147.42,97.52,170.1,415.04,Single-ply,SBD,M
Boys,82.1,11,Bryson Echols,De Soto,75.02,147.42,95.25,161.03,403.7,Single-ply,SBD,M
Boys,74.84,12,Jamie Faust,Hamilton,69.13,181.44,61.23,151.95,394.63,Single-ply,SBD,M
Boys,74.84,13,Travis Sammons,Brady,70.76,140.61,88.45,154.22,383.29,Single-ply,SBD,M
Boys,74.84,14,Ben Smith,Lometa,72.3,149.69,81.65,145.15,376.48,Single-ply,SBD,M
Boys,82.1,15,Bradly Lind,Granbury,74.93,120.2,92.99,151.95,365.14,Single-ply,SBD,M
Boys,74.84,16,Kyle Evans,Stephenville,74.84,111.13,70.31,154.22,335.66,Single-ply,SBD,M
Boys,74.84,17,Robert Paternostro,Brady,74.84,136.08,58.97,136.08,331.12,Single-ply,SBD,M
Boys,74.84,18,Jon Barton,Fort Worth Western Hills,73.66,102.06,79.38,138.35,319.78,Single-ply,SBD,M
Boys,74.84,19,Gerardo Guerrero,Comanche,69.04,154.22,,,154.22,Single-ply,S,M
Boys,74.84,DQ,Cody Stone,Stephenville,73.48,97.52,56.7,102.06,,Single-ply,SBD,M
Boys,82.1,1,Jc Landers,Stephenville,81.19,229.06,140.61,213.19,582.87,Single-ply,SBD,M
Boys,82.1,2,Stephen Harrell,Stephenville,82.1,204.12,117.93,213.19,535.24,Single-ply,SBD,M
Boys,82.1,3,Taylor Bailey,Abilene Cooper,80.2,183.7,124.74,181.44,489.88,Single-ply,SBD,M
Boys,82.1,4,Britton Hale,Abilene Cooper,76.2,181.44,115.67,185.97,483.08,Single-ply,SBD,M
Boys,82.1,5,Nick Adams,Cross Plains,79.29,174.63,120.2,188.24,483.08,Single-ply,SBD,M
Boys,82.1,6,Edgar Rodriguez,Brownwood,80.29,179.17,120.2,172.37,471.74,Single-ply,SBD,M
Boys,82.1,7,Richie Gonzales,Odessa Permian,77.93,161.03,115.67,185.97,462.66,Single-ply,SBD,M
Boys,82.1,8,Jacob Hodges,Brady,78.2,197.31,77.11,185.97,460.4,Single-ply,SBD,M
Boys,82.1,9,Ozzy Zuniga,Odessa Permian,75.66,174.63,102.06,181.44,458.13,Single-ply,SBD,M
Boys,82.1,10,Xander Leatherwood,Brady,79.92,172.37,95.25,190.51,458.13,Single-ply,SBD,M
Boys,82.1,11,Jacob Cabos,Odessa Permian,79.11,185.97,83.91,185.97,455.86,Single-ply,SBD,M
Boys,82.1,12,Craig Wesson,Odessa Permian,79.56,147.42,102.06,204.12,453.59,Single-ply,SBD,M
Boys,82.1,13,Norberto Barron,Stephenville,79.38,142.88,102.06,174.63,419.57,Single-ply,SBD,M
Boys,82.1,14,Colin Crumley,Odessa Permian,76.2,156.49,95.25,154.22,405.97,Single-ply,SBD,M
Boys,82.1,15,Vernon Johnson,De Soto,80.74,133.81,97.52,154.22,385.55,Single-ply,SBD,M
Boys,82.1,16,Tyler Cagle,Abilene,77.02,142.88,90.72,129.27,362.87,Single-ply,SBD,M
Boys,82.1,17,Zack Smurphat,Tuscola Jim Ned,78.11,145.15,77.11,140.61,362.87,Single-ply,SBD,M
Boys,82.1,18,Jordan Boggs,Brady,81.47,145.15,56.7,136.08,337.93,Single-ply,SBD,M
Boys,82.1,19,Devin Parhams,De Soto,78.47,145.15,,158.76,303.91,Single-ply,SD,M
Boys,82.1,20,Gus Burd,Stephenville,81.65,79.38,77.11,133.81,290.3,Single-ply,SBD,M
Boys,82.1,21,Dorian Yearby,De Soto,81.92,,,145.15,145.15,Single-ply,D,M
Boys,82.1,DQ,Desmond Burris,Fort Worth Wyatt,81.56,,,,,Single-ply,D,M
Boys,82.1,DQ,Marcus Saldivar,Stephenville,81.65,161.03,120.2,170.1,,Single-ply,SBD,M
Boys,82.1,DQ,Conner Washington,Stephenville,77.11,149.69,88.45,147.42,,Single-ply,SBD,M
Boys,82.1,DQ,Chase Varnado,Stephenville,79.38,,,,,Single-ply,D,M
Boys,89.81,1,Josh Jones,Abilene,85.82,260.82,145.15,226.8,632.76,Single-ply,SBD,M
Boys,89.81,2,Quincy Moore,Abilene Cooper,87.91,222.26,149.69,215.46,587.4,Single-ply,SBD,M
Boys,89.81,3,Michael Price,Stephenville,87.09,235.87,138.35,206.38,580.6,Single-ply,SBD,M
Boys,89.81,4,John Maddigan,Rosebud-Lott,88.9,219.99,131.54,213.19,564.72,Single-ply,SBD,M
Boys,99.79,5,Rodney Johnson,Odessa Permian,89.99,224.53,122.47,195.04,542.04,Single-ply,SBD,M
Boys,89.81,6,Caleb Moreau,Fort Worth Western Hills,87.36,213.19,102.06,208.65,523.9,Single-ply,SBD,M
Boys,89.81,7,Cody Ferguson,Stephenville,85.73,226.8,124.74,167.83,519.36,Single-ply,SBD,M
Boys,89.81,8,Houston Jones,Tuscola Jim Ned,88.72,195.04,117.93,204.12,517.1,Single-ply,SBD,M
Boys,89.81,9,Jacob Borrego,Abilene Cooper,87.18,190.51,120.2,192.78,503.49,Single-ply,SBD,M
Boys,89.81,10,Austin Martinez,Abilene Cooper,88.9,190.51,102.06,210.92,503.49,Single-ply,SBD,M
Boys,89.81,11,Nic Garcia,Abilene Cooper,84.19,185.97,120.2,190.51,496.68,Single-ply,SBD,M
Boys,89.81,12,Jacob McAnnly,Brady,89.09,190.51,122.47,183.7,496.68,Single-ply,SBD,M
Boys,89.81,13,Mareno Meija,Hamilton,86.91,201.85,102.06,181.44,485.34,Single-ply,SBD,M
Boys,89.81,14,Charles Henderson,De Soto,88.36,190.51,90.72,204.12,485.34,Single-ply,SBD,M
Boys,99.79,15,Stearling Foster,Granbury,89.99,185.97,113.4,174.63,474,Single-ply,SBD,M
Boys,89.81,16,Jerod Daniel,Abilene,87.63,183.7,106.59,181.44,471.74,Single-ply,SBD,M
Boys,89.81,17,Antoinne Jimmerson,De Soto,88,170.1,97.52,204.12,471.74,Single-ply,SBD,M
Boys,89.81,18,Francisco Hernandez,Abilene,86.55,172.37,115.67,181.44,469.47,Single-ply,SBD,M
Boys,89.81,19,Steven Lugo,Abilene Cooper,89.63,176.9,97.52,195.04,469.47,Single-ply,SBD,M
Boys,89.81,20,Junior Gomez,Odessa Permian,87.36,185.97,102.06,176.9,464.93,Single-ply,SBD,M
Boys,89.81,21,La Villarreal,Brady,88.18,190.51,99.79,174.63,464.93,Single-ply,SBD,M
Boys,89.81,22,Jonus Gutierez,Granbury,88.99,174.63,104.33,174.63,453.59,Single-ply,SBD,M
Boys,89.81,23,Mario Covarriubias,Fort Worth Wyatt,87,165.56,86.18,197.31,449.06,Single-ply,SBD,M
Boys,89.81,24,Jeret Smith,Abilene,89.81,183.7,86.18,172.37,442.25,Single-ply,SBD,M
Boys,89.81,25,Gary Singleton,De Soto,87.09,158.76,95.25,167.83,421.84,Single-ply,SBD,M
Boys,89.81,26,Taylor Young,De Soto,89.72,142.88,102.06,170.1,415.04,Single-ply,SBD,M
Boys,89.81,27,Ryan Polite,De Soto,88.81,127.01,99.79,170.1,396.89,Single-ply,SBD,M
Boys,89.81,28,Sabastian Castillo,Brady,88.18,136.08,77.11,163.29,376.48,Single-ply,SBD,M
Boys,89.81,29,Tyler P Jones,Granbury,86.91,136.08,74.84,113.4,324.32,Single-ply,SBD,M
Boys,89.81,DQ,Tommy Sanders,Stephenville,83.46,,,,,Single-ply,SBD,M
Boys,89.81,DQ,Alonzo Puente,Stephenville,89.81,158.76,95.25,149.69,,Single-ply,SBD,M
Boys,99.79,1,Jesse Hernandez,Granbury,97.34,258.55,142.88,254.01,655.44,Single-ply,SBD,M
Boys,99.79,2,Ron Holmes,Odessa Permian,95.44,226.8,120.2,217.72,564.72,Single-ply,SBD,M
Boys,99.79,3,Justin Taylor,Comanche,99.61,204.12,142.88,215.46,562.45,Single-ply,SBD,M
Boys,99.79,4,Tyler Jones,Granbury,96.71,215.46,136.08,204.12,555.65,Single-ply,SBD,M
Boys,99.79,5,Shaquille Johnson,Odessa Permian,98.07,226.8,122.47,204.12,553.38,Single-ply,SBD,M
Boys,99.79,6,Austin Melvin,Stephenville,99.79,190.51,113.4,244.94,548.85,Single-ply,SBD,M
Boys,109.77,7,Hasten Wood,Odessa Permian,99.97,188.24,124.74,226.8,539.77,Single-ply,SBD,M
Boys,109.77,8,Jamar Renfro,Abilene Cooper,99.88,199.58,124.74,206.38,530.7,Single-ply,SBD,M
Boys,99.79,9,Padyn Giebler,Stephenville,95.25,188.24,127.01,213.19,528.44,Single-ply,SBD,M
Boys,99.79,10,Cory Armstrong,Abilene Cooper,96.98,204.12,129.27,181.44,514.83,Single-ply,SBD,M
Boys,99.79,11,Jason Poole,Fort Worth Western Hills,93.26,183.7,104.33,217.72,505.76,Single-ply,SBD,M
Boys,99.79,12,Austin Thomas,Cross Plains,97.43,192.78,115.67,192.78,501.22,Single-ply,SBD,M
Boys,99.79,13,Derek Smallwood,De Soto,92.17,213.19,104.33,181.44,498.95,Single-ply,SBD,M
Boys,99.79,14,Trey Spangler,Odessa Permian,95.89,170.1,124.74,204.12,498.95,Single-ply,SBD,M
Boys,99.79,15,Lorenzo Martinez,Abilene,94.89,199.58,88.45,199.58,487.61,Single-ply,SBD,M
Boys,99.79,16,Zack Martinez,Tuscola Jim Ned,95.35,197.31,115.67,170.1,483.08,Single-ply,SBD,M
Boys,99.79,17,Jacob Martinez,Abilene,95.35,181.44,106.59,195.04,483.08,Single-ply,SBD,M
Boys,99.79,18,Albert Willingham,Fort Worth Western Hills,92.8,174.63,124.74,176.9,476.27,Single-ply,SBD,M
Boys,99.79,19,Micheal Daniels,Stephenville,99.79,165.56,102.06,192.78,460.4,Single-ply,SBD,M
Boys,99.79,20,Taylor Kubacak,Brady,97.61,167.83,86.18,176.9,430.91,Single-ply,SBD,M
Boys,99.79,21,Alex Lyons,De Soto,93.98,154.22,95.25,174.63,424.11,Single-ply,SBD,M
Boys,99.79,22,Mike Richardson,De Soto,98.25,140.61,95.25,181.44,417.3,Single-ply,SBD,M
Boys,99.79,23,Courtland Davis,De Soto,93.44,151.95,104.33,154.22,410.5,Single-ply,SBD,M
Boys,99.79,24,Christian Lacatore,Odessa Permian,98.61,147.42,92.99,167.83,408.23,Single-ply,SBD,M
Boys,99.79,25,Jason Gann,Tuscola Jim Ned,92.71,154.22,90.72,147.42,392.36,Single-ply,SBD,M
Boys,99.79,26,Bonner Martin,Granbury,95.25,124.74,113.4,142.88,381.02,Single-ply,SBD,M
Boys,99.79,27,Garrison Railsback,Abilene Cooper,96.07,190.51,,,190.51,Single-ply,S,M
Boys,99.79,DQ,Kasai Equere,De Soto,93.44,,,,,Single-ply,S,M
Boys,99.79,DQ,Jacob Mathis,Granbury,97.25,,,,,Single-ply,S,M
Boys,99.79,DQ,Cody Miller-Salem,Stephenville,90.72,147.42,102.06,115.67,,Single-ply,SBD,M
Boys,99.79,DQ,Cameron Hilzer,Stephenville,95.71,167.83,86.18,142.88,,Single-ply,SBD,M
Boys,109.77,1,Josh Hamaty,Abilene,108.59,263.08,133.81,235.87,632.76,Single-ply,SBD,M
Boys,109.77,2,Joe Dillard,Abilene Cooper,109.41,233.6,142.88,215.46,591.94,Single-ply,SBD,M
Boys,109.77,3,Damon Rose,Odessa Permian,107.95,213.19,138.35,222.26,573.79,Single-ply,SBD,M
Boys,109.77,4,Kirk Wallace,Granbury,107.5,215.46,131.54,215.46,562.45,Single-ply,SBD,M
Boys,109.77,5,Mason White,Keller Timber Creek,108.14,215.46,102.06,226.8,544.31,Single-ply,SBD,M
Boys,109.77,6,Jose Escamilla,Abilene Cooper,106.05,213.19,111.13,199.58,523.9,Single-ply,SBD,M
Boys,109.77,7,Joseph Pilgram,Granbury,100.61,204.12,108.86,192.78,505.76,Single-ply,SBD,M
Boys,109.77,8,Ruben Ochoa,Odessa Permian,108.23,226.8,88.45,190.51,505.76,Single-ply,SBD,M
Boys,109.77,9,Kale Plumlee,Comanche,103.51,183.7,111.13,192.78,487.61,Single-ply,SBD,M
Boys,109.77,10,Kirby Massingill,Hamilton,105.87,199.58,79.38,181.44,460.4,Single-ply,SBD,M
Boys,124.74,11,Isaiah Shepard,De Soto,109.86,147.42,122.47,181.44,451.32,Single-ply,SBD,M
Boys,109.77,12,Jay Krebs,Abilene,101.24,172.37,92.99,179.17,444.52,Single-ply,SBD,M
Boys,109.77,13,Ryan Sterns,De Soto,104.05,158.76,83.91,147.42,390.09,Single-ply,SBD,M
Boys,109.77,14,Jake Beyer,Stephenville,106.59,136.08,68.04,145.15,349.27,Single-ply,SBD,M
Boys,109.77,15,Rustin Collins,Comanche,101.97,129.27,,,129.27,Single-ply,S,M
Boys,124.74,1,Nick Perez,Stephenville,113.4,294.84,163.29,272.16,730.28,Single-ply,SBD,M
Boys,124.74,2,Dj Vandenberge,Stephenville,117.93,294.84,154.22,210.92,659.98,Single-ply,SBD,M
Boys,124.74,3,Luis Hernandez,Abilene,122.65,244.94,170.1,226.8,641.83,Single-ply,SBD,M
Boys,124.74,4,Ben Dammers,Stephenville,116.57,226.8,170.1,224.53,621.42,Single-ply,SBD,M
Boys,124.74,5,Stephan Molinas,Abilene,116.03,244.94,131.54,204.12,580.6,Single-ply,SBD,M
Boys,124.74,6,Matt Freeman,Abilene Cooper,114.12,233.6,145.15,192.78,571.53,Single-ply,SBD,M
Boys,124.74,7,Larry Hutchinson,Fort Worth Wyatt,114.67,213.19,129.27,224.53,566.99,Single-ply,SBD,M
Boys,124.74,8,Jesse Baeza,Odessa Permian,112.13,213.19,124.74,222.26,560.19,Single-ply,SBD,M
Boys,124.74,9,Avery Rodriguez,Odessa Permian,117.57,226.8,122.47,204.12,553.38,Single-ply,SBD,M
Boys,124.74,10,Ben Kittley,Abilene,110.95,226.8,124.74,190.51,542.04,Single-ply,SBD,M
Boys,124.74,11,Cody Erickson,Odessa Permian,121.74,213.19,120.2,195.04,528.44,Single-ply,SBD,M
Boys,124.74,12,Victor Cruz,Abilene,112.49,195.04,124.74,199.58,519.36,Single-ply,SBD,M
Boys,124.74,13,Marcelo Camarillo,Brady,122.56,204.12,111.13,204.12,519.36,Single-ply,SBD,M
Boys,124.74,14,Jason Cortez,Fort Worth Western Hills,119.93,206.38,117.93,183.7,508.02,Single-ply,SBD,M
Boys,124.74,15,Miles Williams,De Soto,114.12,204.12,117.93,183.7,505.76,Single-ply,SBD,M
Boys,124.74,16,Marcus Hutchins,De Soto,116.39,185.97,111.13,204.12,501.22,Single-ply,SBD,M
Boys,124.74,17,Alex Gonzales,Odessa Permian,114.31,179.17,113.4,181.44,474,Single-ply,SBD,M
Boys,124.74,18,Emmanuel Cross,De Soto,117.66,181.44,90.72,181.44,453.59,Single-ply,SBD,M
Boys,124.74,19,Nelson Goldsmith,Abilene,117.75,158.76,102.06,165.56,426.38,Single-ply,SBD,M
Boys,124.74,20,Tyler Brown,Brady,110.59,147.42,95.25,170.1,412.77,Single-ply,SBD,M
Boys,124.74,21,Zac Christian,Comanche,118.66,95.25,86.18,117.93,299.37,Single-ply,SBD,M
Boys,124.74,22,Jaun Hull,De Soto,121.2,170.1,,,170.1,Single-ply,S,M
Boys,124.74,DQ,Kody Hook,Stephenville,117.03,185.97,127.01,199.58,,Single-ply,SBD,M
Boys,124.74,DQ,Tanner Jerett,Stephenville,113.85,185.97,97.52,179.17,,Single-ply,SBD,M
Boys,124.74+,1,Aaron Voss,Odessa Permian,133.72,249.48,136.08,226.8,612.35,Single-ply,SBD,M
Boys,124.74+,2,Anthony Flores,Abilene,129.82,226.8,142.88,199.58,569.26,Single-ply,SBD,M
Boys,124.74+,3,Hunter Crowder,Tuscola Jim Ned,157.94,215.46,136.08,195.04,546.58,Single-ply,SBD,M
Boys,124.74+,4,Keith Swan,Fort Worth Western Hills,141.07,201.85,108.86,215.46,526.17,Single-ply,SBD,M
Boys,124.74+,5,Javier Lara,Abilene,134.08,195.04,117.93,190.51,503.49,Single-ply,SBD,M
Boys,124.74+,6,Huelon Martinez,Abilene,127.64,199.58,106.59,181.44,487.61,Single-ply,SBD,M
Boys,124.74+,7,Curtis Riser,De Soto,128.82,161.03,102.06,199.58,462.66,Single-ply,SBD,M
Boys,124.74+,DQ,Ryan Turpin,Rosebud-Lott,154.77,,,,,Single-ply,SBD,M
Boys,124.74+,DQ,Zach Ryden,Stephenville,136.08,140.61,88.45,142.88,,Single-ply,SBD,M
