Place,WeightClassKg,Name,Equipment,Team,BodyweightKg,Squat1Kg,Squat2Kg,Squat3Kg,Best3SquatKg,Bench1Kg,Bench2Kg,Bench3Kg,Best3BenchKg,Deadlift1Kg,Deadlift2Kg,Deadlift3Kg,Best3DeadliftKg,TotalKg,Division,Sex,Event
1,67.5,Eddy Rislien,Single-ply,SPUVI,63.60,110,120,125,125.0,55,-60,-60,55.0,,,,,180,Teen 14-18,M,SB
1,75,Håkon Nilsen,Single-ply,SPUVI,73.30,130,-145,150,150.0,-100,100,-105,100.0,,,,,250,Teen 14-18,M,SB
2,75,Richard Bryhn,Single-ply,SPUVI,73.30,120,130,137.5,137.5,60,62.5,67.5,67.5,,,,,205,Teen 14-18,M,SB
DQ,90,Erik Strøyl,Single-ply,SPUVI,84.50,110,120,125,125.0,-85,-85,-85,,,,,,,Teen 14-18,M,SB
1,82.5,Fröde Gundersen,Single-ply,SPUVI,82.20,230,250,,250.0,150,160,,160.0,250,,,250.0,660,Juniors 19-23,M,SBD
2,82.5,Knut Johnsen,Single-ply,SPUVI,76.20,100,115,-122.5,115.0,75,-80,80,80.0,140,160,-170,160.0,355,Juniors 19-23,M,SBD
1,82.5,Johnny Transeth,Single-ply,SPUVI,78.60,-140,150,160,160.0,95,100,105,105.0,190,210,220,220.0,485,Open,M,SBD
1,125,Morten Novum,Single-ply,SPUVI,112.90,190,205,212.5,212.5,115,120,122.5,122.5,190,205,,205.0,540,Open,M,SBD
