Division,WeightClassKg,Place,Name,Team,BodyweightKg,Best3SquatKg,Best3BenchKg,Best3DeadliftKg,TotalKg,Equipment,Event,Sex
Div 3,51.71,1,Isaiah Lombrana,Brady,51.71,174.63,90.72,165.56,430.91,Single-ply,SBD,M
Div 3,51.71,2,Zohn-Luke McCoy,New Boston,51.44,170.1,99.79,151.95,421.84,Single-ply,SBD,M
Div 3,51.71,3,Jeff Smith,Valley Mills,51.71,167.83,83.91,165.56,417.3,Single-ply,SBD,M
Div 3,55.79,4,John Clerihew,Olney,51.94,156.49,86.18,165.56,408.23,Single-ply,SBD,M
Div 3,51.71,5,Gilbert Sanchez,San Diego,51.44,151.95,104.33,149.69,405.97,Single-ply,SBD,M
Div 3,51.71,6,Bruizer Del Bosque,Bishop,49.17,156.49,90.72,156.49,403.7,Single-ply,SBD,M
Div 3,51.71,7,Michael Ramsey,Cross Plains,49.44,136.08,68.04,158.76,362.87,Single-ply,SBD,M
Div 3,51.71,8,Chris Rodriguez,Iraan,51.03,136.08,86.18,136.08,358.34,Single-ply,SBD,M
Div 3,51.71,9,Edward Green,Daingerfield,51.03,136.08,63.5,154.22,353.8,Single-ply,SBD,M
Div 3,55.79,10,Joey Salinas,Jacksboro,51.94,122.47,70.31,127.01,319.78,Single-ply,SBD,M
Div 3,51.71,11,Charles Fentress,Woodville,51.71,124.74,65.77,102.06,292.57,Single-ply,SBD,M
Div 3,51.71,12,Trenton Thedford,Vanderbilt Industrial,49.35,120.2,68.04,102.06,290.3,Single-ply,SBD,M
Div 3,55.79,1,Michael Casarez,Three Rivers,55.34,192.78,95.25,188.24,476.27,Single-ply,SBD,M
Div 3,59.87,2,Beau Burleson,Woodville,55.88,183.7,108.86,176.9,469.47,Single-ply,SBD,M
Div 3,59.87,3,Caleb Coates,Lago Vista,55.88,183.7,104.33,170.1,458.13,Single-ply,SBD,M
Div 3,59.87,4,Jonathon Hardeway,Edna,56.02,161.03,108.86,176.9,446.79,Single-ply,SBD,M
Div 3,55.79,5,Jd Franke,Henrietta,55.25,183.7,92.99,165.56,442.25,Single-ply,SBD,M
Div 3,55.79,6,Tyler West,Shelbyville,55.7,170.1,95.25,161.03,426.38,Single-ply,SBD,M
Div 3,55.79,7,Stephen Nelson,Pottsboro,55.7,165.56,90.72,163.29,419.57,Single-ply,SBD,M
Div 3,55.79,8,D'Montre Brown,Cameron Yoe,53.89,151.95,86.18,176.9,415.04,Single-ply,SBD,M
Div 3,59.87,9,Andy Duarte,Bovina,56.02,154.22,86.18,149.69,390.09,Single-ply,SBD,M
Div 3,55.79,10,Troy Morales,Floydada,53.71,145.15,86.18,156.49,387.82,Single-ply,SBD,M
Div 3,55.79,DQ,Christian Sanchez,Cotulla,55.25,136.08,,,,Single-ply,SBD,M
Div 3,55.79,DQ,Sam Foley,Waskom,55.79,,,,,Single-ply,SBD,M
Div 3,59.87,1,Travis Charles,Bishop,59.65,215.46,111.13,210.92,537.51,Single-ply,SBD,M
Div 3,67.13,2,Tristian Salinas,Santa Rosa,60.06,210.92,117.93,195.04,523.9,Single-ply,SBD,M
Div 3,59.87,3,Darion McMahan,Stockdale,59.51,206.38,111.13,188.24,505.76,Single-ply,SBD,M
Div 3,67.13,4,Ryan Linkous,Axtell,60.1,215.46,111.13,179.17,505.76,Single-ply,SBD,M
Div 3,67.13,5,John Kimble,Anahuac,60.1,195.04,102.06,195.04,492.15,Single-ply,SBD,M
Div 3,59.87,6,Walt Harden,Peaster,59.33,183.7,106.59,192.78,483.08,Single-ply,SBD,M
Div 3,59.87,7,Bryan Thompson,Elkhart,58.69,179.17,99.79,188.24,467.2,Single-ply,SBD,M
Div 3,67.13,8,Edward Garza,Sonora,59.96,190.51,99.79,176.9,467.2,Single-ply,SBD,M
Div 3,59.87,9,Michael Kohl,Rosebud-Lott,59.6,179.17,104.33,172.37,455.86,Single-ply,SBD,M
Div 3,59.87,10,Tate Hartley,Buffalo,59.78,174.63,90.72,176.9,442.25,Single-ply,SBD,M
Div 3,59.87,11,Alex Greene,Henrietta,58.88,170.1,92.99,172.37,435.45,Single-ply,SBD,M
Div 3,59.87,12,Victor Lara-Cortez,Corrigan-Camden,59.19,161.03,77.11,167.83,405.97,Single-ply,SBD,M
Div 3,59.87,DQ,Austin Martinez,Mertzon Irion County,58.74,167.83,,,,Single-ply,SBD,M
Div 3,67.13,1,Osiel Avilez,Jarrell,65.77,249.48,136.08,217.72,603.28,Single-ply,SBD,M
Div 3,67.13,2,Levi Bamber,Dublin,64.86,217.72,129.27,226.8,573.79,Single-ply,SBD,M
Div 3,67.13,3,Adam Guerrero,George West,66.86,249.48,115.67,208.65,573.79,Single-ply,SBD,M
Div 3,67.13,4,Abram Ramirez,Hebbronville,66.32,208.65,136.08,222.26,566.99,Single-ply,SBD,M
Div 3,74.84,5,Marty Garza,Jourdanton,67.31,208.65,136.08,204.12,548.85,Single-ply,SBD,M
Div 3,74.84,6,Tri Hoang,Wichita Falls City View,67.22,206.38,90.72,240.4,537.51,Single-ply,SBD,M
Div 3,67.13,7,Garrett Truong,Oakridge School,64.32,206.38,115.67,204.12,526.17,Single-ply,SBD,M
Div 3,67.13,8,Terrance Walker,Winnsboro,65.05,226.8,124.74,174.63,526.17,Single-ply,SBD,M
Div 3,74.84,9,Stephen Lehew,Maypearl,67.31,192.78,129.27,190.51,512.56,Single-ply,SBD,M
Div 3,67.13,10,Tanner Surratt,Louise,66.41,195.04,104.33,204.12,503.49,Single-ply,SBD,M
Div 3,67.13,11,Thad Whigham,Woodville,64.32,197.31,111.13,181.44,489.88,Single-ply,SBD,M
Div 3,67.13,12,Davy Salazar,Childress,66.45,167.83,111.13,190.51,469.47,Single-ply,SBD,M
Div 3,67.13,DQ,Leo Alfaro,Hempstead,65.23,181.44,104.33,,,Single-ply,SBD,M
Div 3,67.13,DQ,Brett DeVore,Hawley,67.13,210.92,113.4,,,Single-ply,SBD,M
Div 3,74.84,1,Alex Medrano,Dilley,73.57,231.33,158.76,240.4,630.49,Single-ply,SBD,M
Div 3,74.84,2,Jorge Castillo,Rankin,73.94,219.99,156.49,235.87,612.35,Single-ply,SBD,M
Div 3,74.84,3,Colton Redman,Alvord,74.16,215.46,136.08,235.87,587.4,Single-ply,SBD,M
Div 3,74.84,4,Hunter Fritscher,Crawford,72.8,242.67,129.27,210.92,582.87,Single-ply,SBD,M
Div 3,74.84,5,Robbie Eitel,Redwater,73.66,215.46,140.61,222.26,578.33,Single-ply,SBD,M
Div 3,74.84,6,Wayne Foston,Van Vleck,74.03,215.46,138.35,215.46,569.26,Single-ply,SBD,M
Div 3,74.84,7,Jesus Jaimes,Riesel,68.4,204.12,136.08,213.19,553.38,Single-ply,SBD,M
Div 3,74.84,8,Caleb Skahan,Caddo Mills,71.58,208.65,120.2,215.46,544.31,Single-ply,SBD,M
Div 3,74.84,DQ,Tyler Sample,Edna,73.39,,,,,Single-ply,SBD,M
Div 3,74.84,DQ,Aaron Lopez,Jourdanton,72.03,201.85,104.33,,,Single-ply,SBD,M
Div 3,74.84,DQ,Ian Pryor,Merkel,71.12,204.12,106.59,,,Single-ply,SBD,M
Div 3,74.84,DQ,James Jackson,Callisburg,73.12,181.44,129.27,,,Single-ply,SBD,M
Div 3,82.1,1,Marty Saenz,San Diego,79.83,272.16,140.61,258.55,671.32,Single-ply,SBD,M
Div 3,82.1,2,Josh Trumble,Redwater,81.42,249.48,151.95,238.14,639.57,Single-ply,SBD,M
Div 3,82.1,3,Matthew Glenn,Newton,81.19,219.99,151.95,260.82,632.76,Single-ply,SBD,M
Div 3,82.1,4,Sam Bryant,Van Vleck,80.65,231.33,154.22,244.94,630.49,Single-ply,SBD,M
Div 3,82.1,5,Jacob Clark,Elkhart,81.28,235.87,138.35,244.94,619.15,Single-ply,SBD,M
Div 3,82.1,6,Brad Wills,Clyde,79.56,238.14,149.69,219.99,607.81,Single-ply,SBD,M
Div 3,82.1,7,Bryan Vela,Meadow,80.51,240.4,140.61,226.8,607.81,Single-ply,SBD,M
Div 3,82.1,8,Kyle Saunders,Peaster,81.28,233.6,124.74,238.14,596.47,Single-ply,SBD,M
Div 3,82.1,9,Jamie Czajkowski,Milano,80.06,217.72,145.15,210.92,573.79,Single-ply,SBD,M
Div 3,82.1,10,David Garza,Cotulla,80.01,204.12,129.27,229.06,562.45,Single-ply,SBD,M
Div 3,82.1,DQ,Aj McCasland,Overton,78.56,,,,,Single-ply,SBD,M
Div 3,82.1,DQ,Terence Jackson,Wichita Falls City View,79.38,,,,,Single-ply,SBD,M
Div 3,82.1,DQ,Isaac Jimenez,San Saba,80.74,,,,,Single-ply,SBD,M
Div 3,89.81,1,Curt Allen,Oakridge School,88.18,278.96,176.9,278.96,734.82,Single-ply,SBD,M
Div 3,89.81,2,Chris Hubnik,Rogers,89.45,265.35,156.49,235.87,657.71,Single-ply,SBD,M
Div 3,99.79,3,Roy Rodriguez,Clifton,89.99,269.89,154.22,231.33,655.44,Single-ply,SBD,M
Div 3,99.79,4,Allen Harden,Palmer,89.9,226.8,151.95,240.4,619.15,Single-ply,SBD,M
Div 3,89.81,5,Kirk Salinas,Banquete,83.01,249.48,147.42,215.46,612.35,Single-ply,SBD,M
Div 3,99.79,6,Duncan Welch,Friona,89.9,199.58,149.69,219.99,569.26,Single-ply,SBD,M
Div 3,89.81,7,Ivan Garcia,Peaster,88.81,208.65,145.15,210.92,564.72,Single-ply,SBD,M
Div 3,89.81,8,Jose Baltizar,Danbury,85.82,215.46,129.27,190.51,535.24,Single-ply,SBD,M
Div 3,89.81,9,Joe Woodson,El Maton Tidehaven,84.1,188.24,113.4,210.92,512.56,Single-ply,SBD,M
Div 3,89.81,DQ,Lee Cecil,Redwater,88.9,226.8,154.22,,,Single-ply,SBD,M
Div 3,89.81,DQ,Paden Cornett,Seagraves,89.27,,,,,Single-ply,SBD,M
Div 3,89.81,DQ,Alfonso Montalvo,Riviera Kaufer,83.64,,,,,Single-ply,SBD,M
Div 3,99.79,1,Mark Armstrong,Corrigan-Camden,98.66,294.84,158.76,272.16,725.75,Single-ply,SBD,M
Div 3,99.79,2,Alex Costilla,Falfurrias,94.57,297.1,172.37,254.01,723.48,Single-ply,SBD,M
Div 3,99.79,3,John Caruso,Mineola,98.61,249.48,197.31,263.08,709.87,Single-ply,SBD,M
Div 3,99.79,4,Luis Lopez,San Diego,93.89,306.17,151.95,226.8,684.92,Single-ply,SBD,M
Div 3,99.79,5,DeVaughntae Norman,Stamford,99.43,260.82,142.88,244.94,648.64,Single-ply,SBD,M
Div 3,99.79,6,John Herrera,Banquete,95.89,249.48,156.49,240.4,646.37,Single-ply,SBD,M
Div 3,99.79,7,Dalton Ford,Buna,98.2,242.67,142.88,249.48,635.03,Single-ply,SBD,M
Div 3,99.79,8,John Maddigan,Rosebud-Lott,93.67,231.33,147.42,240.4,619.15,Single-ply,SBD,M
Div 3,99.79,DQ,Jacob McNamara,Moody,96.16,,,,,Single-ply,SBD,M
Div 3,99.79,DQ,Eduardo Webber,Howe,91.63,,,,,Single-ply,SBD,M
Div 3,99.79,DQ,Eddie Avalos,Olney,97.52,,,,,Single-ply,SBD,M
Div 3,99.79,DQ,Terry Jones,Beckville,95.44,,,,,Single-ply,SBD,M
Div 3,99.79,DQ,Juan DeOchoa,Floydada,98.2,,,,,Single-ply,SBD,M
Div 3,109.77,1,Jesse Roberson,Redwater,108.41,299.37,199.58,265.35,764.3,Single-ply,SBD,M
Div 3,109.77,2,Garlin Gonzalez,Waco Reicher Catholic,108.86,303.91,176.9,258.55,739.36,Single-ply,SBD,M
Div 3,109.77,3,Andy Costilla,Falfurrias,105.32,267.62,163.29,238.14,669.05,Single-ply,SBD,M
Div 3,109.77,4,Rj Rubesh,Louise,108.5,272.16,158.76,238.14,669.05,Single-ply,SBD,M
Div 3,109.77,5,Luis Ramírez,Waco Reicher Catholic,106.96,244.94,174.63,226.8,646.37,Single-ply,SBD,M
Div 3,109.77,6,Desmond Pulliam,Louise,102.6,240.4,145.15,238.14,623.69,Single-ply,SBD,M
Div 3,109.77,7,George Vela,Eden,107.95,251.74,120.2,240.4,612.35,Single-ply,SBD,M
Div 3,109.77,8,Dylan Bloodworth,Honey Grove,103.51,224.53,145.15,215.46,585.13,Single-ply,SBD,M
Div 3,109.77,9,Justin Givens,Wichita Falls City View,106.82,217.72,136.08,217.72,571.53,Single-ply,SBD,M
Div 3,109.77,DQ,Daniel Montez,Roby,102.29,,,,,Single-ply,SBD,M
Div 3,109.77,DQ,Jon Garcia,Ben Bolt-Palito Blanco,109.68,,,,,Single-ply,SBD,M
Div 3,109.77,DQ,Dewey Fleming,Redwater,101.33,,,,,Single-ply,SBD,M
Div 3,124.74,1,Will Dreyer,Clifton,118.61,278.96,181.44,276.69,737.09,Single-ply,SBD,M
Div 3,124.74,2,Damon Hinrichs,Millsap,116.8,281.23,208.65,244.94,734.82,Single-ply,SBD,M
Div 3,124.74,3,Isaiah Ross,Troy,122.24,294.84,140.61,263.08,698.53,Single-ply,SBD,M
Div 3,124.74,4,Krishon Seastrunk,Newton,119.2,288.03,124.74,281.23,694,Single-ply,SBD,M
Div 3,124.74,5,Taylor Henning,Refugio,121.47,267.62,167.83,240.4,675.85,Single-ply,SBD,M
Div 3,124.74,6,Jaylon Bradford,Louise,117.93,222.26,120.2,222.26,564.72,Single-ply,SBD,M
Div 3,124.74,DQ,Michael Dominguez,Hebbronville,115.21,,,,,Single-ply,SBD,M
Div 3,124.74,DQ,Shakeem Woodberry,Clarksville,122.2,260.82,,,,Single-ply,SBD,M
Div 3,124.74,DQ,Fabian Gutierrez,Colorado City Colorado,121.34,260.82,158.76,,,Single-ply,SBD,M
Div 3,124.74,DQ,Jayton May,Brady,122.38,,,,,Single-ply,SBD,M
Div 3,124.74,DQ,Tanner Holt,San Angelo Grape Creek,121.29,229.06,,,,Single-ply,SBD,M
Div 3,124.74,DQ,Chance Edwards,Redwater,112.4,,,,,Single-ply,SBD,M
Div 3,124.74,DQ,Jackson Cunningham,Paradise,118.3,,,,,Single-ply,SBD,M
Div 3,124.74+,1,Andrew Keheley,Malakoff,147.33,308.44,188.24,254.01,750.7,Single-ply,SBD,M
Div 3,124.74+,2,Jesus Pinon,Meridian,136.71,294.84,199.58,254.01,748.43,Single-ply,SBD,M
Div 3,124.74+,3,Adam Rodriguez,Chilton,128.82,303.91,172.37,231.33,707.6,Single-ply,SBD,M
Div 3,124.74+,4,Kaprice Williams,Elkhart,144.15,294.84,176.9,219.99,691.73,Single-ply,SBD,M
Div 3,124.74+,5,Dj Cratic,Corrigan-Camden,129.18,276.69,161.03,204.12,641.83,Single-ply,SBD,M
Div 3,124.74+,6,Mario Alaniz,San Diego,131.09,244.94,142.88,235.87,623.69,Single-ply,SBD,M
Div 3,124.74+,7,Manuel Tijerina,Jourdanton,133.72,231.33,136.08,256.28,623.69,Single-ply,SBD,M
Div 3,124.74+,8,Zach Kennedy,Corrigan-Camden,131.72,254.01,127.01,204.12,585.13,Single-ply,SBD,M
Div 3,124.74+,DQ,Cristian Venegas,Crane,134.04,,,,,Single-ply,SBD,M
Div 3,124.74+,DQ,Jeffrey Cooley,Jacksboro,135.62,,,,,Single-ply,SBD,M
Div 3,124.74+,DQ,Clayton Smiley,Friona,159.44,263.08,156.49,,,Single-ply,SBD,M
Div 3,124.74+,DQ,Ismael Martinez,Strawn,125.65,,,,,Single-ply,SBD,M
