Division,WeightClassKg,Place,Name,Team,BodyweightKg,Best3SquatKg,Best3BenchKg,Best3DeadliftKg,TotalKg,Equipment,Event,Sex
Boys,51.71,1,Osvaldo Palacias,Palestine,51.35,117.93,61.23,106.59,285.76,Single-ply,SBD,M
Boys,51.71,2,Braden Fears,White Oak,49.35,99.79,58.97,113.4,272.16,Single-ply,SBD,M
Boys,51.71,DQ,Matthew Thompson,Palestine,44.68,,,,,Single-ply,SBD,M
Boys,55.79,1,Johney Phelps,Palestine Westwood,53.71,174.63,81.65,151.95,408.23,Single-ply,SBD,M
Boys,55.79,2,José Castillo,Grapeland,52.16,129.27,70.31,142.88,342.46,Single-ply,SBD,M
Boys,55.79,3,Ethan Hoops,Eustace,55.52,133.81,74.84,133.81,342.46,Single-ply,SBD,M
Boys,55.79,4,Chris Soria,Buffalo,55.79,122.47,58.97,131.54,312.98,Single-ply,SBD,M
Boys,55.79,5,Marcus Dominguez,Buffalo,52.8,113.4,63.5,111.13,288.03,Single-ply,SBD,M
Boys,55.79,6,Charlie Ivey,Malakoff,53.89,102.06,58.97,111.13,272.16,Single-ply,SBD,M
Boys,59.87,1,Leo Rosales,Rusk,58.06,181.44,102.06,183.7,467.2,Single-ply,SBD,M
Boys,67.13,2,Robert Thompson,Palestine,60.01,136.08,79.38,142.88,358.34,Single-ply,SBD,M
Boys,59.87,3,Dillon Beshears,Buffalo,58.69,131.54,72.57,131.54,335.66,Single-ply,SBD,M
Boys,59.87,4,Tristan Bailey,Buffalo,58.6,111.13,61.23,111.13,283.5,Single-ply,SBD,M
Boys,67.13,1,Jalen Burns,Palestine Westwood,63.68,192.78,77.11,208.65,478.54,Single-ply,SBD,M
Boys,67.13,2,Dj Hicks,Palestine Westwood,66.86,174.63,95.25,185.97,455.86,Single-ply,SBD,M
Boys,67.13,3,Clay Hinkle,Eustace,64.05,147.42,79.38,163.29,390.09,Single-ply,SBD,M
Boys,74.84,4,Carlos Camacho,White Oak,67.31,142.88,90.72,151.95,385.55,Single-ply,SBD,M
Boys,67.13,5,Zach Morrow,Palestine Westwood,64.14,156.49,72.57,151.95,381.02,Single-ply,SBD,M
Boys,67.13,6,David McAlpine,Buffalo,60.69,142.88,74.84,147.42,365.14,Single-ply,SBD,M
Boys,67.13,7,Uliccs Guerrero,Buffalo,63.23,145.15,77.11,142.88,365.14,Single-ply,SBD,M
Boys,67.13,8,Joshua Hughes,Eustace,63.96,124.74,83.91,136.08,344.73,Single-ply,SBD,M
Boys,67.13,9,Elder Arellano,Rice,61.6,113.4,79.38,145.15,337.93,Single-ply,SBD,M
Boys,67.13,10,Shane Lewis,Frankston,63.14,120.2,61.23,133.81,315.25,Single-ply,SBD,M
Boys,67.13,11,Chon Cunningham,Jewett Leon,62.41,108.86,63.5,113.4,285.76,Single-ply,SBD,M
Boys,74.84,1,Chris Box,Elkhart,71.85,242.67,136.08,199.58,578.33,Single-ply,SBD,M
Boys,74.84,2,Quentin Parks,Eustace,72.85,192.78,102.06,185.97,480.81,Single-ply,SBD,M
Boys,74.84,3,Da'Lyn Gipson,Mount Enterprise,71.85,172.37,86.18,213.19,471.74,Single-ply,SBD,M
Boys,74.84,4,Poochie Weaver,Palestine,70.31,176.9,117.93,170.1,464.93,Single-ply,SBD,M
Boys,74.84,5,Michael Jones,Elkhart,70.49,176.9,95.25,176.9,449.06,Single-ply,SBD,M
Boys,74.84,6,Brant Hamilton,Malakoff,68.31,165.56,92.99,183.7,442.25,Single-ply,SBD,M
Boys,74.84,7,Nate Bell,Elkhart,69.58,181.44,97.52,156.49,435.45,Single-ply,SBD,M
Boys,74.84,8,Cameron Varner,Buffalo,69.76,181.44,74.84,176.9,433.18,Single-ply,SBD,M
Boys,74.84,9,Dustin Harrison,White Oak,73.57,145.15,102.06,185.97,433.18,Single-ply,SBD,M
Boys,74.84,10,Samuel Cervantes,Buffalo,72.57,145.15,83.91,183.7,412.77,Single-ply,SBD,M
Boys,74.84,11,Zant Tatum,Jewett Leon,69.94,158.76,77.11,174.63,410.5,Single-ply,SBD,M
Boys,74.84,12,William Wheat,Palestine,71.76,158.76,79.38,161.03,399.16,Single-ply,SBD,M
Boys,74.84,13,Cameron Riess,Grapeland,73.21,174.63,79.38,142.88,396.89,Single-ply,SBD,M
Boys,74.84,14,Josh Dollarhide,Frankston,70.31,136.08,72.57,156.49,365.14,Single-ply,SBD,M
Boys,74.84,15,Jake Baxter,Cushing,70.76,102.06,79.38,124.74,306.17,Single-ply,SBD,M
Boys,74.84,16,Taylor Jackson,Cushing,70.76,113.4,65.77,113.4,292.57,Single-ply,SBD,M
Boys,74.84,DQ,Lucas Roliff,Cushing,67.77,,,,,Single-ply,SBD,M
Boys,74.84,DQ,Rowdy Upchurch,Elkhart,72.67,199.58,,,,Single-ply,SBD,M
Boys,82.1,1,Zack Gray,Elkhart,80.56,249.48,133.81,235.87,619.15,Single-ply,SBD,M
Boys,82.1,2,Garrett Flanagan,Elkhart,80.38,240.4,129.27,222.26,591.94,Single-ply,SBD,M
Boys,82.1,3,Orlando Gonzales,Palestine Westwood,80.83,201.85,113.4,183.7,498.95,Single-ply,SBD,M
Boys,82.1,4,Chris Jump,Malakoff,81.83,183.7,122.47,185.97,492.15,Single-ply,SBD,M
Boys,82.1,5,Isiah Valaques,Cushing,79.47,183.7,102.06,165.56,451.32,Single-ply,SBD,M
Boys,89.81,6,Juan Garcia,Eustace,82.28,174.63,90.72,183.7,449.06,Single-ply,SBD,M
Boys,82.1,7,Tremel Preston,Frankston,75.66,172.37,88.45,179.17,439.98,Single-ply,SBD,M
Boys,82.1,8,Madison Mason,Jewett Leon,76.75,154.22,104.33,149.69,408.23,Single-ply,SBD,M
Boys,82.1,9,Darius Buckly,Cushing,80.2,142.88,102.06,156.49,401.43,Single-ply,SBD,M
Boys,82.1,10,Cody Presson,White Oak,79.92,140.61,83.91,172.37,396.89,Single-ply,SBD,M
Boys,82.1,11,AJ Harris,Rice,81.37,124.74,63.5,156.49,344.73,Single-ply,SBD,M
Boys,82.1,12,Demondraick Foreman,Rusk,76.2,102.06,72.57,124.74,299.37,Single-ply,SBD,M
Boys,89.81,1,Tony Burns,Mount Enterprise,88.72,226.8,142.88,208.65,578.33,Single-ply,SBD,M
Boys,89.81,2,Andre Agan,Elkhart,88.18,217.72,136.08,213.19,566.99,Single-ply,SBD,M
Boys,89.81,3,Johnathan Pearson,Neches,89.18,188.24,133.81,242.67,564.72,Single-ply,SBD,M
Boys,89.81,4,Keenan Hargest,Eustace,85,199.58,108.86,199.58,508.02,Single-ply,SBD,M
Boys,89.81,5,Gavin DeFore,Elkhart,88.72,167.83,131.54,192.78,492.15,Single-ply,SBD,M
Boys,89.81,6,Kyle Roach,Jewett Leon,88.72,210.92,92.99,181.44,485.34,Single-ply,SBD,M
Boys,89.81,7,Wally Shrout,Malakoff,83.28,185.97,108.86,185.97,480.81,Single-ply,SBD,M
Boys,89.81,8,Armando Vinaja,Palestine Westwood,88.09,176.9,106.59,172.37,455.86,Single-ply,SBD,M
Boys,89.81,9,Travis Hart,Palestine,89.22,181.44,92.99,181.44,455.86,Single-ply,SBD,M
Boys,89.81,10,Michael Roch,Eustace,84.28,156.49,108.86,188.24,453.59,Single-ply,SBD,M
Boys,89.81,11,Dakota Barrell,Rusk,83.01,142.88,86.18,151.95,381.02,Single-ply,SBD,M
Boys,89.81,12,Spencer Grisham,Malakoff,85.46,140.61,77.11,147.42,365.14,Single-ply,SBD,M
Boys,89.81,13,Travis Pepin,Rusk,89.54,136.08,72.57,136.08,344.73,Single-ply,SBD,M
Boys,99.79,1,Zachary Hughes,Eustace,97.43,213.19,165.56,235.87,614.62,Single-ply,SBD,M
Boys,99.79,2,Mikey Grubbs,Mount Enterprise,97.52,217.72,120.2,222.26,560.19,Single-ply,SBD,M
Boys,99.79,3,TJ Jones,Elkhart,95.25,208.65,102.06,199.58,510.29,Single-ply,SBD,M
Boys,99.79,4,Seth Folsom,Buffalo,99.43,192.78,104.33,185.97,483.08,Single-ply,SBD,M
Boys,99.79,5,Nick Johnson,White Oak,95.25,172.37,106.59,161.03,439.98,Single-ply,SBD,M
Boys,99.79,6,Will Fridell,Rusk,99.52,156.49,102.06,165.56,424.11,Single-ply,SBD,M
Boys,99.79,7,Chris Fletcher,Rusk,94.53,154.22,81.65,167.83,403.7,Single-ply,SBD,M
Boys,99.79,8,Jace Rogers,Rusk,90.81,136.08,81.65,156.49,374.21,Single-ply,SBD,M
Boys,99.79,9,Garrett Beamer,Rusk,94.53,113.4,72.57,149.69,335.66,Single-ply,SBD,M
Boys,99.79,DQ,Keelin Munoz,White Oak,91.08,204.12,113.4,,,Single-ply,SBD,M
Boys,109.77,1,Chris Bloyd,White Oak,105.6,260.82,138.35,226.8,625.96,Single-ply,SBD,M
Boys,109.77,2,Ty Swindle,Palestine,102.6,219.99,120.2,247.21,587.4,Single-ply,SBD,M
Boys,109.77,3,Joey Maltos,Buffalo,109.23,231.33,140.61,210.92,582.87,Single-ply,SBD,M
Boys,109.77,4,Zach Sanders,Malakoff,104.14,222.26,106.59,226.8,555.65,Single-ply,SBD,M
Boys,109.77,5,Will Dehart,Elkhart,104.51,231.33,127.01,195.04,553.38,Single-ply,SBD,M
Boys,109.77,6,Josh Porter,Frankston,105.32,215.46,115.67,206.38,537.51,Single-ply,SBD,M
Boys,109.77,7,Jayce Harris,Cayuga,104.14,192.78,115.67,192.78,501.22,Single-ply,SBD,M
Boys,109.77,8,Clint Guyton,Buffalo,103.87,179.17,108.86,170.1,458.13,Single-ply,SBD,M
Boys,109.77,9,Gabriel Gonzales,Palestine Westwood,104.96,181.44,83.91,163.29,428.64,Single-ply,SBD,M
Boys,109.77,DQ,Keenan Jackson,Palestine Westwood,109.41,,,,,Single-ply,SBD,M
Boys,124.74,1,Josh Tillis,Palestine,114.85,226.8,188.24,238.14,653.17,Single-ply,SBD,M
Boys,124.74,2,Benito Rivas,Buffalo,114.58,195.04,129.27,197.31,521.63,Single-ply,SBD,M
Boys,124.74,3,Joel Barbosa,Cayuga,115.94,201.85,117.93,199.58,519.36,Single-ply,SBD,M
Boys,124.74,4,Sir Rhodes,Palestine,123.06,210.92,133.81,174.63,519.36,Single-ply,SBD,M
Boys,124.74,5,Wes Carnely,Palestine Westwood,114.03,179.17,117.93,204.12,501.22,Single-ply,SBD,M
Boys,124.74,6,Zack Banks,Rusk,110.5,204.12,90.72,181.44,476.27,Single-ply,SBD,M
Boys,124.74,7,Marcux Staggs,Eustace,117.84,161.03,108.86,167.83,437.72,Single-ply,SBD,M
Boys,124.74+,1,Pat Cross,Palestine,126.55,317.51,165.56,251.74,734.82,Single-ply,SBD,M
Boys,124.74+,2,Taylor McBride,Cushing,143.7,299.37,147.42,235.87,682.66,Single-ply,SBD,M
Boys,124.74+,3,Zack McFarland,Elkhart,132.9,283.5,161.03,217.72,662.24,Single-ply,SBD,M
Boys,124.74+,4,Bryce Hoffman,Rusk,126.28,272.16,151.95,213.19,637.3,Single-ply,SBD,M
Boys,124.74+,5,Chris Thompson,Frankston,125.37,231.33,129.27,219.99,580.6,Single-ply,SBD,M
Boys,124.74+,6,Lyle Ownes,White Oak,134.26,219.99,149.69,170.1,539.77,Single-ply,SBD,M
Boys,124.74+,7,Sergio Sanchez,Jewett Leon,131.54,172.37,117.93,195.04,485.34,Single-ply,SBD,M
Boys,124.74+,8,Jesus Garcia-Castillo,Palestine,129.73,181.44,99.79,192.78,474,Single-ply,SBD,M
Boys,124.74+,9,Colton Moody,Cayuga,164.74,145.15,90.72,158.76,394.63,Single-ply,SBD,M
