Division,WeightClassKg,Place,Name,Team,BodyweightKg,Best3SquatKg,Best3BenchKg,Best3DeadliftKg,TotalKg,Equipment,Event,Sex
Boys,55.79,1,Jeff Smith,Valley Mills,51.8,142.88,86.18,115.67,344.73,Single-ply,SBD,M
Boys,51.71,2,Lane Fikes,Robinson,51.26,117.93,65.77,138.35,322.05,Single-ply,SBD,M
Boys,51.71,3,Tanner Blackwell,Gatesville,51.71,117.93,61.23,124.74,303.91,Single-ply,SBD,M
Boys,51.71,4,Justin Conley,Alvarado,51.71,90.72,70.31,131.54,292.57,Single-ply,SBD,M
Boys,51.71,5,Jonah Salazar,Robinson,51.71,108.86,58.97,117.93,285.76,Single-ply,SBD,M
Boys,51.71,6,Grady Rhonden,Alvarado,50.58,106.59,52.16,122.47,281.23,Single-ply,SBD,M
Boys,51.71,7,Guillermo Olvera,Alvarado,51.03,92.99,56.7,127.01,276.69,Single-ply,SBD,M
Boys,55.79,8,Joey Leavelle,Robinson,51.89,99.79,45.36,106.59,251.74,Single-ply,SBD,M
Boys,51.71,9,Colton Reeves,Valley Mills,51.03,88.45,54.43,104.33,247.21,Single-ply,SBD,M
Boys,51.71,10,Jesus Tonche,Waco Connally,51.03,81.65,56.7,104.33,242.67,Single-ply,SBD,M
Boys,51.71,11,Austin Mueller,China Spring,48.53,81.65,45.36,102.06,229.06,Single-ply,SBD,M
Boys,51.71,12,Curtis Evans,Riesel,47.26,90.72,40.82,83.91,215.46,Single-ply,SBD,M
Boys,59.87,1,Andrew Knight,Robinson,56.02,174.63,81.65,170.1,426.38,Single-ply,SBD,M
Boys,55.79,2,Josh McCraw,Gatesville,55.52,136.08,83.91,154.22,374.21,Single-ply,SBD,M
Boys,55.79,3,Ignacio Alvarado,Alvarado,54.43,145.15,72.57,154.22,371.95,Single-ply,SBD,M
Boys,55.79,4,Diego Padron,Waco Connally,55.79,133.81,74.84,158.76,367.41,Single-ply,SBD,M
Boys,55.79,5,Micah Thompson,Gatesville,54.88,145.15,61.23,156.49,362.87,Single-ply,SBD,M
Boys,55.79,6,Taylor Veselka,Waco Reicher Catholic,55.79,127.01,63.5,136.08,326.59,Single-ply,SBD,M
Boys,55.79,7,Chris Sheffield,China Spring,55.16,99.79,58.97,113.4,272.16,Single-ply,SBD,M
Boys,55.79,8,Sebastian Allen,Valley Mills,52.39,102.06,54.43,102.06,258.55,Single-ply,SBD,M
Boys,55.79,DQ,Myles Robison,Valley Mills,53.75,81.65,,,,Single-ply,SBD,M
Boys,59.87,1,Alex Leos,Robinson,59.42,176.9,95.25,183.7,455.86,Single-ply,SBD,M
Boys,59.87,2,Rey Castro,Waco Reicher Catholic,58.06,161.03,86.18,165.56,412.77,Single-ply,SBD,M
Boys,67.13,3,Michael Paynter,Riesel,59.96,129.27,56.7,136.08,322.05,Single-ply,SBD,M
Boys,59.87,4,Luke Dyer,Gatesville,56.25,113.4,70.31,136.08,319.78,Single-ply,SBD,M
Boys,67.13,5,Michael Lopez,Waco La Vega,60.1,111.13,74.84,129.27,315.25,Single-ply,SBD,M
Boys,67.13,6,Blake Osteem,Whitney,60.1,99.79,72.57,104.33,276.69,Single-ply,SBD,M
Boys,67.13,DQ,Michael Kohl,Rosebud-Lott,60.1,149.69,90.72,,,Single-ply,SBD,M
Boys,67.13,1,Tyrell Irby,Waco La Vega,66.68,226.8,129.27,240.4,596.47,Single-ply,SBD,M
Boys,67.13,2,Kyree Norman,Waco La Vega,66.9,226.8,115.67,213.19,555.65,Single-ply,SBD,M
Boys,67.13,3,Matthew Maley,Crawford,66.41,199.58,108.86,210.92,519.36,Single-ply,SBD,M
Boys,67.13,4,Omar Garza,Robinson,65.41,197.31,113.4,185.97,496.68,Single-ply,SBD,M
Boys,67.13,5,Chris Sosebee,Whitney,66.45,170.1,106.59,181.44,458.13,Single-ply,SBD,M
Boys,67.13,6,Nathan Kalil,China Spring,67.13,167.83,113.4,172.37,453.59,Single-ply,SBD,M
Boys,67.13,7,Scott Shanz,Bruceville-Eddy,63.96,172.37,97.52,179.17,449.06,Single-ply,SBD,M
Boys,67.13,8,Drew Perry,Robinson,66.77,151.95,111.13,183.7,446.79,Single-ply,SBD,M
Boys,67.13,9,Stephen Mitchell,Robinson,66.04,167.83,86.18,174.63,428.64,Single-ply,SBD,M
Boys,67.13,10,Bryce Pogue,Lorena,60.33,167.83,95.25,147.42,410.5,Single-ply,SBD,M
Boys,67.13,11,Derek Bonner,Whitney,62.37,142.88,95.25,145.15,383.29,Single-ply,SBD,M
Boys,67.13,12,Mike Fitzhugh,Waco Reicher Catholic,63.05,138.35,74.84,161.03,374.21,Single-ply,SBD,M
Boys,67.13,13,Jacob Guilbault,Waco Reicher Catholic,67.13,136.08,81.65,156.49,374.21,Single-ply,SBD,M
Boys,67.13,14,Garrett Harvey,Whitney,61.01,127.01,83.91,136.08,347,Single-ply,SBD,M
Boys,67.13,15,Kade Robinson,Lorena,63.05,136.08,65.77,131.54,333.39,Single-ply,SBD,M
Boys,67.13,16,Brady Baker,Riesel,63.68,131.54,63.5,136.08,331.12,Single-ply,SBD,M
Boys,67.13,17,Darion Holloway,Riesel,64.41,95.25,49.9,102.06,247.21,Single-ply,SBD,M
Boys,67.13,DQ,Jacob Roberts,Whitney,66,95.25,,,,Single-ply,SBD,M
Boys,74.84,1,Jordan Taylor,Waco La Vega,74.39,208.65,136.08,229.06,573.79,Single-ply,SBD,M
Boys,74.84,2,Dustin Dorris,Crawford,68.95,224.53,122.47,188.24,535.24,Single-ply,SBD,M
Boys,74.84,3,Hunter Fritscher,Crawford,71.44,215.46,113.4,188.24,517.1,Single-ply,SBD,M
Boys,74.84,4,Garrison Dean,Crawford,70.53,176.9,106.59,195.04,478.54,Single-ply,SBD,M
Boys,74.84,5,Jose Hernandez,China Spring,72.35,172.37,115.67,190.51,478.54,Single-ply,SBD,M
Boys,74.84,6,Harley Patterson,Gatesville,70.99,181.44,88.45,197.31,467.2,Single-ply,SBD,M
Boys,74.84,7,Collin Cresson,Lorena,73.48,176.9,102.06,181.44,460.4,Single-ply,SBD,M
Boys,74.84,8,Michael Hammond,Whitney,68.04,181.44,102.06,174.63,458.13,Single-ply,SBD,M
Boys,74.84,9,Corey Schroeder,Riesel,70.76,181.44,92.99,181.44,455.86,Single-ply,SBD,M
Boys,74.84,10,Juan Frausto,Waco Connally,68.95,165.56,83.91,201.85,451.32,Single-ply,SBD,M
Boys,74.84,11,Andrew Kaluza,Waco Reicher Catholic,74.84,165.56,81.65,170.1,417.3,Single-ply,SBD,M
Boys,74.84,12,J'Earl Jefferson,Waco Connally,68.04,158.76,77.11,176.9,412.77,Single-ply,SBD,M
Boys,74.84,13,Brandon Fortune,Alvarado,67.81,142.88,79.38,172.37,394.63,Single-ply,SBD,M
Boys,74.84,14,Nick Zavala,Waco La Vega,73.03,138.35,97.52,142.88,378.75,Single-ply,SBD,M
Boys,74.84,15,Michael Jackson,Riesel,74.84,147.42,77.11,154.22,378.75,Single-ply,SBD,M
Boys,74.84,16,Jimmy Joiner,Lorena,68.04,145.15,70.31,145.15,360.61,Single-ply,SBD,M
Boys,82.1,17,Jackson Roye,Stephenville,75.07,142.88,90.72,127.01,360.61,Single-ply,SBD,M
Boys,74.84,18,Dustin McDonald,Riesel,69.4,147.42,74.84,136.08,358.34,Single-ply,SBD,M
Boys,74.84,19,Jeremy Tanner,Riesel,70.08,131.54,68.04,158.76,358.34,Single-ply,SBD,M
Boys,74.84,20,Patrick Wright,Waco Reicher Catholic,71.21,129.27,74.84,138.35,342.46,Single-ply,SBD,M
Boys,74.84,21,Garrett Tanner,Stephenville,68.49,124.74,65.77,147.42,337.93,Single-ply,SBD,M
Boys,82.1,22,Darian Robinson,Waco Connally,75.07,108.86,81.65,127.01,317.51,Single-ply,SBD,M
Boys,74.84,23,Logan Womat,Riesel,72.8,138.35,63.5,113.4,315.25,Single-ply,SBD,M
Boys,74.84,24,Cody Stone,Stephenville,73.48,90.72,52.16,92.99,235.87,Single-ply,SBD,M
Boys,74.84,DQ,Ty Marshall,Riesel,71.67,204.12,,,,Single-ply,SBD,M
Boys,74.84,DQ,Brandon Pollard,Gatesville,74.16,,,,,Single-ply,SBD,M
Boys,89.81,1,Michael Armstrong,China Spring,82.28,219.99,138.35,217.72,576.06,Single-ply,SBD,M
Boys,82.1,2,Matt Thigpen,Bruceville-Eddy,78.47,215.46,138.35,217.72,571.53,Single-ply,SBD,M
Boys,82.1,3,Ty Caruso,Robinson,81.87,204.12,145.15,183.7,532.97,Single-ply,SBD,M
Boys,82.1,4,Chandler Snodgrass,Lorena,76.88,208.65,111.13,192.78,512.56,Single-ply,SBD,M
Boys,82.1,5,Jack Baskin,Lorena,78.02,195.04,102.06,190.51,487.61,Single-ply,SBD,M
Boys,82.1,6,Dustin McLearen,Gatesville,80.29,172.37,106.59,192.78,471.74,Single-ply,SBD,M
Boys,82.1,7,Andrew Drennan,Waco Reicher Catholic,78.56,181.44,104.33,183.7,469.47,Single-ply,SBD,M
Boys,82.1,8,Kenny Adams,Alvarado,81.42,181.44,97.52,190.51,469.47,Single-ply,SBD,M
Boys,82.1,9,Wayne Onderdonck,Alvarado,76.43,170.1,104.33,181.44,455.86,Single-ply,SBD,M
Boys,82.1,10,Malik Hampton,Waco La Vega,79.83,156.49,92.99,161.03,410.5,Single-ply,SBD,M
Boys,82.1,11,Chase Taylor,Gatesville,77.56,154.22,90.72,163.29,408.23,Single-ply,SBD,M
Boys,82.1,12,Cooper Crum,Riesel,75.98,124.74,56.7,106.59,288.03,Single-ply,SBD,M
Boys,89.81,13,Gus Burd,Stephenville,82.33,77.11,68.04,113.4,258.55,Single-ply,SBD,M
Boys,82.1,DQ,Norberto Barron,Stephenville,80.06,142.88,,,,Single-ply,SBD,M
Boys,82.1,DQ,Blake Glenn,Waco Connally,75.75,179.17,,,,Single-ply,SBD,M
Boys,89.81,1,Michael Martin,China Spring,88.99,210.92,127.01,229.06,566.99,Single-ply,SBD,M
Boys,89.81,2,Michael Price,Stephenville,85.73,226.8,138.35,199.58,564.72,Single-ply,SBD,M
Boys,89.81,3,John Maddigan,Rosebud-Lott,88.45,204.12,131.54,226.8,562.45,Single-ply,SBD,M
Boys,89.81,4,Matt Perkins,Waco Connally,84.37,217.72,102.06,217.72,537.51,Single-ply,SBD,M
Boys,89.81,5,Colby Gordon,Lorena,86.18,195.04,117.93,190.51,503.49,Single-ply,SBD,M
Boys,89.81,6,Josh Barrett,China Spring,89.13,188.24,106.59,199.58,494.42,Single-ply,SBD,M
Boys,99.79,7,Josh Carroll,Waco La Vega,90.04,192.78,102.06,188.24,483.08,Single-ply,SBD,M
Boys,89.81,8,Tyler Dixon,Alvarado,86.18,204.12,90.72,181.44,476.27,Single-ply,SBD,M
Boys,89.81,9,Dalton Carter,Waco Connally,87.32,145.15,95.25,181.44,421.84,Single-ply,SBD,M
Boys,89.81,10,Joseph Reddrick,Riesel,88.9,158.76,79.38,158.76,396.89,Single-ply,SBD,M
Boys,89.81,11,Rowdy Goff,Alvarado,87.32,113.4,99.79,142.88,356.07,Single-ply,SBD,M
Boys,89.81,12,Jacob Garcia,Lorena,87.54,140.61,79.38,136.08,356.07,Single-ply,SBD,M
Boys,89.81,13,Tommy Sanders,Stephenville,83.46,124.74,70.31,140.61,335.66,Single-ply,SBD,M
Boys,99.79,1,Garlin Gonzales,Waco Reicher Catholic,99.79,283.5,158.76,274.42,716.68,Single-ply,SBD,M
Boys,99.79,2,Daniel Johnston,Alvarado,92.53,229.06,142.88,233.6,605.55,Single-ply,SBD,M
Boys,99.79,3,Parker Hamm,China Spring,94.71,192.78,145.15,201.85,539.77,Single-ply,SBD,M
Boys,99.79,4,Patrick Martin,China Spring,95.25,197.31,133.81,199.58,530.7,Single-ply,SBD,M
Boys,99.79,5,Matt Meador,Gatesville,93.08,195.04,122.47,210.92,528.44,Single-ply,SBD,M
Boys,99.79,6,Justin Crow,Waco Connally,90.99,197.31,124.74,204.12,526.17,Single-ply,SBD,M
Boys,99.79,7,Justin Stocks,Robinson,95.62,197.31,131.54,190.51,519.36,Single-ply,SBD,M
Boys,99.79,8,Chris Johnson,Waco Connally,93.8,195.04,117.93,201.85,514.83,Single-ply,SBD,M
Boys,99.79,9,Aj Castillio,Alvarado,93.53,183.7,129.27,192.78,505.76,Single-ply,SBD,M
Boys,99.79,10,Dustin Westerfield,Waco La Vega,91.35,201.85,122.47,167.83,492.15,Single-ply,SBD,M
Boys,99.79,11,Dillon Sharp,Lorena,91.9,199.58,106.59,181.44,487.61,Single-ply,SBD,M
Boys,109.77,12,Cody Travis,Stephenville,99.97,158.76,131.54,192.78,483.08,Single-ply,SBD,M
Boys,99.79,13,Chris Collier,Alvarado,95.62,183.7,108.86,183.7,476.27,Single-ply,SBD,M
Boys,99.79,14,Jonathan Hefelfinger,Riesel,99.06,204.12,99.79,170.1,474,Single-ply,SBD,M
Boys,99.79,15,Jacoby Miller-Salem,Stephenville,92.71,151.95,102.06,111.13,365.14,Single-ply,SBD,M
Boys,99.79,16,Weston Adams,Riesel,93.08,113.4,74.84,149.69,337.93,Single-ply,SBD,M
Boys,99.79,17,Justin Arredondo,Alvarado,90.49,102.06,72.57,142.88,317.51,Single-ply,SBD,M
Boys,109.77,1,Austin Pierce,Waco Connally,108.68,242.67,124.74,206.38,573.79,Single-ply,SBD,M
Boys,109.77,2,Luis Ramírez,Waco Reicher Catholic,109.32,210.92,147.42,204.12,562.45,Single-ply,SBD,M
Boys,109.77,3,Nathan Donovan,Alvarado,107.86,208.65,136.08,204.12,548.85,Single-ply,SBD,M
Boys,109.77,4,Nick Mackay,Gatesville,104.33,217.72,136.08,192.78,546.58,Single-ply,SBD,M
Boys,109.77,5,Austin Brown,Hubbard,107.5,195.04,113.4,183.7,492.15,Single-ply,SBD,M
Boys,109.77,6,Omar Cardosa,Waco Reicher Catholic,106.14,183.7,95.25,190.51,469.47,Single-ply,SBD,M
Boys,109.77,DQ,Jonathon Hoxie,Waco Reicher Catholic,100.7,195.04,,,,Single-ply,SBD,M
Boys,109.77,DQ,Javie Perez,Stephenville,105.96,226.8,154.22,,,Single-ply,SBD,M
Boys,124.74,1,Josh Holt,Lorena,123.01,283.5,154.22,272.16,709.87,Single-ply,SBD,M
Boys,124.74,2,Trent Hughes,Waco Reicher Catholic,117.93,240.4,133.81,229.06,603.28,Single-ply,SBD,M
Boys,124.74,3,Jake Glasscock,Alvarado,112.22,240.4,124.74,215.46,580.6,Single-ply,SBD,M
Boys,124.74,4,Khiry Hart,Waco La Vega,121.65,231.33,131.54,204.12,566.99,Single-ply,SBD,M
Boys,124.74,5,Colton Ridley,Gatesville,111.22,226.8,136.08,181.44,544.31,Single-ply,SBD,M
Boys,124.74,6,Treston Clark,Waco La Vega,117.03,235.87,108.86,195.04,539.77,Single-ply,SBD,M
Boys,124.74,7,Scott York,Robinson,124.74,208.65,145.15,185.97,539.77,Single-ply,SBD,M
Boys,124.74,8,Michael Miller,Whitney,124.51,219.99,115.67,192.78,528.44,Single-ply,SBD,M
Boys,124.74,9,Augie Hinojosa,Whitney,123.83,199.58,111.13,215.46,526.17,Single-ply,SBD,M
Boys,124.74,10,Kody Hook,Stephenville,114.67,170.1,120.2,190.51,480.81,Single-ply,SBD,M
Boys,124.74,11,David Zettler,Waco Reicher Catholic,110.68,185.97,99.79,163.29,449.06,Single-ply,SBD,M
Boys,124.74,12,Kyle Burgess,Alvarado,123.65,181.44,106.59,124.74,412.77,Single-ply,SBD,M
Boys,124.74,13,David Romero,Whitney,120.2,154.22,90.72,136.08,381.02,Single-ply,SBD,M
Boys,124.74+,1,Ed Jones,Waco La Vega,160.12,351.53,204.12,244.94,800.59,Single-ply,SBD,M
Boys,124.74+,2,Lance Tepe,Waco Reicher Catholic,137.89,267.62,149.69,260.82,678.12,Single-ply,SBD,M
Boys,124.74+,3,Shawn McKinney,Hubbard,167.38,272.16,158.76,233.6,664.51,Single-ply,SBD,M
Boys,124.74+,4,Garrett Boyd,China Spring,145.33,215.46,149.69,206.38,571.53,Single-ply,SBD,M
Boys,124.74+,5,Matt Bruce,China Spring,141.97,215.46,138.35,197.31,551.11,Single-ply,SBD,M
Boys,124.74+,6,Ryan Turpin,Rosebud-Lott,153.22,226.8,115.67,181.44,523.9,Single-ply,SBD,M
Boys,124.74+,DQ,Jt Huggins,Whitney,145.38,204.12,113.4,,,Single-ply,SBD,M
