Division,WeightClassKg,Place,Name,Team,BodyweightKg,Best3SquatKg,Best3BenchKg,Best3DeadliftKg,TotalKg,Equipment,Event,Sex
Girls,44.23,1,Odalys Garduno,Victoria West,43.41,122.47,54.43,131.54,308.44,Single-ply,SBD,F
Girls,44.23,2,Zoe Sonsel,Port Lavaca Calhoun,43.68,113.4,47.63,122.47,283.5,Single-ply,SBD,F
Girls,44.23,3,Lauren Aldape,Mercedes,42.14,106.59,47.63,120.2,274.42,Single-ply,SBD,F
Girls,44.23,4,Camryn Riggins,College Station,43.18,104.33,52.16,106.59,263.08,Single-ply,SBD,F
Girls,44.23,5,Rhema Orta,Port Lavaca Calhoun,40.91,104.33,47.63,108.86,260.82,Single-ply,SBD,F
Girls,44.23,6,Hope Spivey,College Station,42.46,99.79,56.7,99.79,256.28,Single-ply,SBD,F
Girls,44.23,7,Ashley Fink,Little Elm,42.86,106.59,56.7,86.18,249.48,Single-ply,SBD,F
Girls,44.23,8,Tianne Trujillo,Alice,40.19,104.33,43.09,97.52,244.94,Single-ply,SBD,F
Girls,44.23,9,Hope Brekel,Nederland,44,102.06,45.36,97.52,244.94,Single-ply,SBD,F
Girls,44.23,10,Maya Higgenbotham,Wylie,42.77,92.99,52.16,95.25,240.4,Single-ply,SBD,F
Girls,44.23,11,Taylor Kilgo,Vidor,43.32,83.91,40.82,104.33,229.06,Single-ply,SBD,F
Girls,44.23,12,Annette Roberts,Forney,43.91,83.91,29.48,74.84,188.24,Single-ply,SBD,F
Girls,47.85,1,McKayla Cortez,Port Lavaca Calhoun,46.99,136.08,77.11,127.01,340.19,Single-ply,SBD,F
Girls,47.85,2,Nadya Valero,San Antonio Southside,47.31,133.81,68.04,124.74,326.59,Single-ply,SBD,F
Girls,47.85,3,Briseidi Cantu,Rio Grande City,47.04,124.74,58.97,131.54,315.25,Single-ply,SBD,F
Girls,47.85,4,LeUyen Do,Georgetown East View,46.04,122.47,61.23,124.74,308.44,Single-ply,SBD,F
Girls,47.85,5,Mia Reyes,Corpus Christi Tuloso-Midway,47.22,133.81,49.9,122.47,306.17,Single-ply,SBD,F
Girls,47.85,6,Brenda Quintero,Laredo Martin,47.22,117.93,52.16,122.47,292.57,Single-ply,SBD,F
Girls,47.85,7,Salma Ramirez,Elgin,47.4,120.2,47.63,117.93,285.76,Single-ply,SBD,F
Girls,47.85,8,Hailey Alexander,Lumberton,46.63,106.59,52.16,117.93,276.69,Single-ply,SBD,F
Girls,47.85,9,Hope Davila,Corpus Christi Tuloso-Midway,46.72,117.93,40.82,117.93,276.69,Single-ply,SBD,F
Girls,47.85,10,Britney Golladay,Wylie,47.04,92.99,58.97,113.4,265.35,Single-ply,SBD,F
Girls,47.85,11,Hayley Kinard,Vidor,46.72,113.4,40.82,92.99,247.21,Single-ply,SBD,F
Girls,47.85,12,Norma Ortega,Longview Pine Tree,47.26,90.72,38.56,97.52,226.8,Single-ply,SBD,F
Girls,47.85,13,Sage Landeros,Plainview,47.85,70.31,34.02,88.45,192.78,Single-ply,SBD,F
Girls,47.85,14,Natalie Perez,Plainview,46.04,65.77,24.95,88.45,179.17,Single-ply,SBD,F
Girls,47.85,NS,Aslin Barrientos,Mount Pleasant,,,,,,Single-ply,SBD,F
Girls,47.85,NS,Valeria Torres,Pharr Valley View,,,,,,Single-ply,SBD,F
Girls,47.85,NS,Sonni Gehring,Wylie,,,,,,Single-ply,SBD,F
Girls,47.85,NS,Perla Hernandez,Brownsville Pace,,,,,,Single-ply,SBD,F
Girls,51.94,1,Marie Cavazos,Edinburg Vela,51.03,170.1,72.57,142.88,385.55,Single-ply,SBD,F
Girls,51.94,2,Miranda Smith,Port Lavaca Calhoun,51.57,142.88,70.31,145.15,358.34,Single-ply,SBD,F
Girls,51.94,3,Danielle Bacon,Port Lavaca Calhoun,49.85,136.08,68.04,142.88,347,Single-ply,SBD,F
Girls,51.94,4,Belen Morales,San Antonio Kennedy,51.35,133.81,70.31,142.88,347,Single-ply,SBD,F
Girls,51.94,5,Amanda Rodriguez,Mission Sharyland,51.39,129.27,61.23,145.15,335.66,Single-ply,SBD,F
Girls,51.94,6,Brissa Ramirez,Mission Sharyland,50.35,129.27,61.23,142.88,333.39,Single-ply,SBD,F
Girls,51.94,7,Abril Salinas,Pharr Valley View,51.57,149.69,54.43,127.01,331.12,Single-ply,SBD,F
Girls,51.94,8,Emma Beebe,Wylie East,50.94,120.2,54.43,142.88,317.51,Single-ply,SBD,F
Girls,51.94,9,Leah Sanchez,College Station,50.67,120.2,58.97,131.54,310.71,Single-ply,SBD,F
Girls,51.94,10,Melissa Butler,Longview Pine Tree,51.26,120.2,70.31,115.67,306.17,Single-ply,SBD,F
Girls,51.94,11,Juliette Cantu,Edinburg Vela,49.71,124.74,68.04,111.13,303.91,Single-ply,SBD,F
Girls,51.94,12,Sylvia Gil,San Antonio Kennedy,50.58,115.67,61.23,122.47,299.37,Single-ply,SBD,F
Girls,51.94,13,Erica Garcia,Temple,51.62,106.59,49.9,136.08,292.57,Single-ply,SBD,F
Girls,51.94,14,Kailey Trice,Wylie,51.3,127.01,54.43,108.86,290.3,Single-ply,SBD,F
Girls,51.94,15,Natalie Garcia,Forney,51.71,120.2,47.63,117.93,285.76,Single-ply,SBD,F
Girls,51.94,16,Monica Hernandez,Dumas,51.94,106.59,47.63,124.74,278.96,Single-ply,SBD,F
Girls,51.94,17,Karli Brewer,Nederland,51.94,102.06,52.16,117.93,272.16,Single-ply,SBD,F
Girls,51.94,18,Miranda Housman,New Caney Porter,51.3,99.79,52.16,111.13,263.08,Single-ply,SBD,F
Girls,51.94,19,Anissa Porras,Plainview,51.75,90.72,54.43,92.99,238.14,Single-ply,SBD,F
Girls,56.02,1,Chassity Sims,Lindale,54.84,149.69,61.23,167.83,378.75,Single-ply,SBD,F
Girls,56.02,2,Ravyn Deangel,Donna,53.98,170.1,70.31,122.47,362.87,Single-ply,SBD,F
Girls,56.02,3,Kalen Wootan,College Station,54.66,136.08,70.31,138.35,344.73,Single-ply,SBD,F
Girls,56.02,4,Janelle Castillo,Alice,55.38,147.42,61.23,136.08,344.73,Single-ply,SBD,F
Girls,56.02,5,Giovanna Valdez,Wylie,55.84,124.74,79.38,129.27,333.39,Single-ply,SBD,F
Girls,56.02,6,Victoria Salinas,Rio Grande City,55.02,122.47,65.77,138.35,326.59,Single-ply,SBD,F
Girls,56.02,7,Bernabeth Beason,Wylie,54.34,133.81,61.23,129.27,324.32,Single-ply,SBD,F
Girls,56.02,8,Katelan House,San Angelo Lake View,55.02,131.54,63.5,127.01,322.05,Single-ply,SBD,F
Girls,56.02,9,Jenna Hoffman,Vidor,55.97,120.2,58.97,131.54,310.71,Single-ply,SBD,F
Girls,56.02,10,Ileana Gonzales,Lockhart,54.98,108.86,63.5,136.08,308.44,Single-ply,SBD,F
Girls,56.02,11,Ashton Strange,Waxahachie,54.2,102.06,45.36,129.27,276.69,Single-ply,SBD,F
Girls,56.02,12,Ashley Rushing,Vidor,55.02,106.59,47.63,106.59,260.82,Single-ply,SBD,F
Girls,56.02,13,Cinthia Ramirez,Plainview,55.93,90.72,49.9,113.4,254.01,Single-ply,SBD,F
Girls,60.1,1,April Botello,San Antonio Southside,59.24,170.1,88.45,167.83,426.38,Single-ply,SBD,F
Girls,60.1,2,Cecily Gonzalez,Alice,59.83,167.83,79.38,174.63,421.84,Single-ply,SBD,F
Girls,60.1,3,Azalia Jones,Corpus Christi Tuloso-Midway,58.6,161.03,77.11,167.83,405.97,Single-ply,SBD,F
Girls,60.1,4,Cierra Jackson,Mansfield Timberview,59.51,151.95,65.77,158.76,376.48,Single-ply,SBD,F
Girls,60.1,5,Yocelin Hernandez,Wylie,59.87,142.88,74.84,151.95,369.68,Single-ply,SBD,F
Girls,60.1,6,Corina Yanez,Donna,56.29,151.95,70.31,142.88,365.14,Single-ply,SBD,F
Girls,60.1,7,Bre Haesche,Conroe Caney Creek,58.33,136.08,65.77,149.69,351.53,Single-ply,SBD,F
Girls,60.1,8,Angela Banda,Plainview,60.1,131.54,61.23,142.88,335.66,Single-ply,SBD,F
Girls,60.1,9,Bailey Crocker,Forney,59.24,138.35,49.9,140.61,328.85,Single-ply,SBD,F
Girls,60.1,10,Gloria Horton,Lockhart,58.65,115.67,58.97,145.15,319.78,Single-ply,SBD,F
Girls,60.1,11,Bailey Walser,Canyon Randall,58.83,108.86,58.97,127.01,294.84,Single-ply,SBD,F
Girls,60.1,12,Shelbie Swinhoe,New Caney Porter,59.56,113.4,49.9,117.93,281.23,Single-ply,SBD,F
Girls,60.1,DQ,Aileen Andrew,Georgetown East View,57.2,129.27,70.31,,,Single-ply,SBD,F
Girls,60.1,DQ,Raven Reese,Longview Pine Tree,58.06,,,,,Single-ply,SBD,F
Girls,67.36,1,Norma Chapa,Donna North,64.95,154.22,86.18,163.29,403.7,Single-ply,SBD,F
Girls,67.36,2,Zoey Dierlam,Port Lavaca Calhoun,65.91,156.49,86.18,161.03,403.7,Single-ply,SBD,F
Girls,67.36,3,Karen Martinez,Donna,63.96,165.56,65.77,158.76,390.09,Single-ply,SBD,F
Girls,67.36,4,Abby McFall,Port Lavaca Calhoun,64.95,158.76,77.11,154.22,390.09,Single-ply,SBD,F
Girls,67.36,5,Ally Garcia,Edcouch-Elsa,65.09,163.29,68.04,156.49,387.82,Single-ply,SBD,F
Girls,67.36,6,Alexis Estringel,Alice,67.13,165.56,72.57,147.42,385.55,Single-ply,SBD,F
Girls,67.36,7,Kaylen Evans,Joshua,66.54,156.49,65.77,158.76,381.02,Single-ply,SBD,F
Girls,67.36,8,Maria Castillo,College Station,66.09,154.22,65.77,142.88,362.87,Single-ply,SBD,F
Girls,67.36,9,Briana Williams,Wylie,66.77,129.27,68.04,165.56,362.87,Single-ply,SBD,F
Girls,67.36,10,Makayla Millbrook,Wylie,67,136.08,72.57,151.95,360.61,Single-ply,SBD,F
Girls,67.36,11,Ashley Otah,Wylie,67.18,120.2,74.84,149.69,344.73,Single-ply,SBD,F
Girls,67.36,12,Morgan Lowry,Forney,62.78,142.88,56.7,142.88,342.46,Single-ply,SBD,F
Girls,67.36,13,Cassity Schubert,Forney,64.82,120.2,52.16,138.35,310.71,Single-ply,SBD,F
Girls,67.36,14,Julisa Medrano,San Angelo Lake View,65.41,133.81,56.7,115.67,306.17,Single-ply,SBD,F
Girls,67.36,15,Diamond Paul,Nederland,65.09,113.4,49.9,129.27,292.57,Single-ply,SBD,F
Girls,75.07,1,Allison Macias,Alice,74.34,199.58,88.45,172.37,460.4,Single-ply,SBD,F
Girls,75.07,2,Julia McGinnis,College Station,73.26,170.1,86.18,151.95,408.23,Single-ply,SBD,F
Girls,75.07,3,Katy Shipley,Rockwall-Heath,73.98,163.29,90.72,151.95,405.97,Single-ply,SBD,F
Girls,75.07,4,Kailey Jones,Denison,73.89,161.03,83.91,158.76,403.7,Single-ply,SBD,F
Girls,75.07,5,Ashtyn Burget,Wylie,73.26,149.69,86.18,163.29,399.16,Single-ply,SBD,F
Girls,75.07,6,Destiny Andrade,Castroville Medina Valley,74.07,174.63,81.65,140.61,396.89,Single-ply,SBD,F
Girls,75.07,7,Miranda Garcia,Seguin,72.44,147.42,72.57,174.63,394.63,Single-ply,SBD,F
Girls,75.07,8,Juliet Nwokocha,Wylie,68.4,165.56,58.97,149.69,374.21,Single-ply,SBD,F
Girls,75.07,9,Makaylah Laza,Santa Fe,73.21,161.03,74.84,133.81,369.68,Single-ply,SBD,F
Girls,75.07,10,Morgan Boody,Santa Fe,70.17,149.69,56.7,142.88,349.27,Single-ply,SBD,F
Girls,75.07,11,Gabby Moreno,Dumas,71.99,133.81,58.97,145.15,337.93,Single-ply,SBD,F
Girls,75.07,12,Stephanie Avalos,Lubbock Cooper,71.76,124.74,61.23,120.2,306.17,Single-ply,SBD,F
Girls,75.07,13,India Tennial,Jacksonville,72.39,124.74,45.36,131.54,301.64,Single-ply,SBD,F
Girls,75.07,NS,Kaitlyn Jackson,San Marcos,,,,,,Single-ply,SBD,F
Girls,75.07,DQ,Gabiella Zavala,Waxahachie,71.67,102.06,52.16,,,Single-ply,SBD,F
Girls,82.33,1,Katie Lollar,College Station,76.38,188.24,97.52,163.29,449.06,Single-ply,SBD,F
Girls,82.33,2,Abi Lutz,Wylie East,79.79,183.7,99.79,163.29,446.79,Single-ply,SBD,F
Girls,82.33,3,Fatima Herrera,San Antonio Southside,80.56,183.7,95.25,154.22,433.18,Single-ply,SBD,F
Girls,82.33,4,Alexis Ortiz,Seguin,78.93,192.78,97.52,140.61,430.91,Single-ply,SBD,F
Girls,82.33,5,Kimberlynn Patzold,New Caney Porter,78.56,154.22,102.06,158.76,415.04,Single-ply,SBD,F
Girls,82.33,6,Mariah Castillo,Lockhart,81.1,158.76,81.65,163.29,403.7,Single-ply,SBD,F
Girls,82.33,7,Avery Coronado,Sharyland Pioneer,80.51,156.49,79.38,163.29,399.16,Single-ply,SBD,F
Girls,82.33,8,Kylea Nix,Gregory-Portland,81.87,156.49,72.57,170.1,399.16,Single-ply,SBD,F
Girls,82.33,9,Maddie Whaley,Wylie,81.83,149.69,83.91,136.08,369.68,Single-ply,SBD,F
Girls,82.33,10,Fre'Dasia Daniels,Longview Pine Tree,79.61,122.47,72.57,151.95,347,Single-ply,SBD,F
Girls,82.33,11,Furnice Bates,Lindale,80.56,142.88,68.04,133.81,344.73,Single-ply,SBD,F
Girls,82.33,12,Kyla Clark,Dumas,77.61,133.81,61.23,136.08,331.12,Single-ply,SBD,F
Girls,82.33,13,Amy Saucedo,Plainview,79.92,102.06,65.77,113.4,281.23,Single-ply,SBD,F
Girls,82.33,DQ,Alyssa De Los Santos,San Marcos,79.11,176.9,,,,Single-ply,SBD,F
Girls,90.04,1,Suba Johnson,College Station,84.91,204.12,86.18,181.44,471.74,Single-ply,SBD,F
Girls,90.04,2,Chloe Zapata,Alice,84.91,204.12,97.52,154.22,455.86,Single-ply,SBD,F
Girls,90.04,3,Camryn Byrtle,College Station A&M Cons,85.23,179.17,88.45,176.9,444.52,Single-ply,SBD,F
Girls,90.04,4,Allison Villarreal,Edcouch-Elsa,87,176.9,81.65,158.76,417.3,Single-ply,SBD,F
Girls,90.04,5,Alyssa Spence,McKinney,86.64,165.56,88.45,154.22,408.23,Single-ply,SBD,F
Girls,90.04,6,Amina Petty,Lindale,87.09,151.95,77.11,163.29,392.36,Single-ply,SBD,F
Girls,90.04,7,Avery Heimer,Floresville,83.28,163.29,83.91,142.88,390.09,Single-ply,SBD,F
Girls,90.04,8,Hanna Beattie,Wylie,86.32,181.44,68.04,138.35,387.82,Single-ply,SBD,F
Girls,90.04,9,Marisa Crider,Conroe Caney Creek,82.46,149.69,68.04,158.76,376.48,Single-ply,SBD,F
Girls,90.04,10,Kathryn Cantu,Mount Pleasant,86.82,154.22,61.23,145.15,360.61,Single-ply,SBD,F
Girls,90.04,11,Emilee Courville,Dumas,88.45,136.08,65.77,138.35,340.19,Single-ply,SBD,F
Girls,90.04,DQ,Taylor Slaughter,Abilene Cooper,85.77,111.13,,,,Single-ply,SBD,F
Girls,90.04,DQ,Michelle Landry,Beaumont Ozen,83.96,102.06,,,,Single-ply,SBD,F
Girls,90.04,DQ,America Osorio,Elgin,88.41,183.7,,,,Single-ply,SBD,F
Girls,100.02,1,Timmea Joiner,Temple,97.75,181.44,88.45,206.38,476.27,Single-ply,SBD,F
Girls,100.02,2,Luciana Zamora,Gregory-Portland,99.11,206.38,92.99,170.1,469.47,Single-ply,SBD,F
Girls,100.02,3,Keyshawna Newman,Wichita Falls Rider,95.03,181.44,74.84,192.78,449.06,Single-ply,SBD,F
Girls,100.02,4,Corrine Garcia,Corpus Christi Tuloso-Midway,97.2,195.04,81.65,172.37,449.06,Single-ply,SBD,F
Girls,100.02,5,Ellie Hair,College Station,99.84,181.44,90.72,172.37,444.52,Single-ply,SBD,F
Girls,100.02,6,Ashley Tapia,PSJA,96.84,176.9,86.18,172.37,435.45,Single-ply,SBD,F
Girls,100.02,7,Jazzmyn Moreno,Donna,96.57,195.04,81.65,151.95,428.64,Single-ply,SBD,F
Girls,100.02,8,Ebony Thibodeaux,Mansfield Timberview,95.25,172.37,92.99,156.49,421.84,Single-ply,SBD,F
Girls,100.02,9,Sammie Slagle,Wichita Falls,96.93,181.44,83.91,154.22,419.57,Single-ply,SBD,F
Girls,100.02,10,Karizma Alexander,Waxahachie,96.52,154.22,61.23,145.15,360.61,Single-ply,SBD,F
Girls,100.02,11,Hannah Havard,Willis,97.84,167.83,56.7,124.74,349.27,Single-ply,SBD,F
Girls,100.02,12,Callie Lightfoot,Longview Pine Tree,95.35,129.27,58.97,136.08,324.32,Single-ply,SBD,F
Girls,100.02,13,Anastacia Sosa,Plainview,95.57,133.81,61.23,99.79,294.84,Single-ply,SBD,F
Girls,100.02,DQ,Yasmin Dominguez,Plainview,91.99,,,,,Single-ply,SBD,F
Girls,100.02,DQ,Rikiaya McClain,Beaumont Central,97.16,156.49,56.7,,,Single-ply,SBD,F
Girls,100.02+,1,Lexi Harris,Cleburne,169.1,244.94,181.44,208.65,635.03,Single-ply,SBD,F
Girls,100.02+,2,London Leslie,Fort Worth Arlington Heights,138.62,226.8,104.33,179.17,510.29,Single-ply,SBD,F
Girls,100.02+,3,Ebony Cortez,Floresville,126.69,190.51,120.2,185.97,496.68,Single-ply,SBD,F
Girls,100.02+,4,Keuna Webster,College Station A&M Cons,127.73,219.99,97.52,154.22,471.74,Single-ply,SBD,F
Girls,100.02+,5,Marion Wright,Wylie East,119.34,174.63,115.67,147.42,437.72,Single-ply,SBD,F
Girls,100.02+,6,Leslie Quijada,Royse City,109.5,199.58,81.65,145.15,426.38,Single-ply,SBD,F
Girls,100.02+,7,Bayleigh Smith,Lumberton,112.54,183.7,79.38,163.29,426.38,Single-ply,SBD,F
Girls,100.02+,8,Mary Chavez,Corpus Christi Tuloso-Midway,134.49,195.04,99.79,122.47,417.3,Single-ply,SBD,F
Girls,100.02+,9,Lorna Baulechong,Corsicana,126.33,158.76,74.84,156.49,390.09,Single-ply,SBD,F
Girls,100.02+,10,Priscilla Zamarron,Dumas,101.7,145.15,58.97,154.22,358.34,Single-ply,SBD,F
Girls,100.02+,11,Mialissa Peeples,Mount Pleasant,122.65,133.81,65.77,113.4,312.98,Single-ply,SBD,F
Girls,100.02+,12,Marissa Cervantes,San Angelo Lake View,121.34,113.4,47.63,117.93,278.96,Single-ply,SBD,F
Girls,100.02+,NS,Kaley Golnisch,Conroe Caney Creek,,,,,,Single-ply,SBD,F
Girls,,NS,Shyann Nevares,Plainview,,,,,,Single-ply,SBD,F
Girls,,NS,Victoria Olivarez,Mission Veterans Memorial,,,,,,Single-ply,SBD,F
