Division,WeightClassKg,Place,Name,Team,BodyweightKg,Best3SquatKg,Best3BenchKg,Best3DeadliftKg,TotalKg,Equipment,Event,Sex
Girls,44.23,1,Mari Lopez,Corpus Christi West Oso,41.5,117.93,52.16,140.61,310.71,Single-ply,SBD,F
Girls,44.23,2,Nadia Rodriguez,Hidalgo Early College,43.59,108.86,63.5,117.93,290.3,Single-ply,SBD,F
Girls,44.23,3,Guadalupe Gobellan,Hillsboro,44.18,113.4,52.16,124.74,290.3,Single-ply,SBD,F
Girls,44.23,4,Maribel Tavarez,Monahans,42.73,115.67,54.43,113.4,283.5,Single-ply,SBD,F
Girls,44.23,5,Lourdes Jaimes,Bonham,43.5,115.67,52.16,113.4,281.23,Single-ply,SBD,F
Girls,44.23,6,Kenzee Gerik,Waco Connally,43.32,104.33,54.43,111.13,269.89,Single-ply,SBD,F
Girls,44.23,7,Celeste Correa,Carrizo Springs,43.41,111.13,38.56,113.4,263.08,Single-ply,SBD,F
Girls,44.23,8,Estefania Espino,Perryton,43.41,106.59,54.43,97.52,258.55,Single-ply,SBD,F
Girls,44.23,9,June Ji Peters,Columbus,40.55,99.79,43.09,106.59,249.48,Single-ply,SBD,F
Girls,44.23,10,Jessica Taylor,Gilmer,44.18,92.99,52.16,104.33,249.48,Single-ply,SBD,F
Girls,44.23,11,LeighAnn Sitzman,Decatur,42.18,92.99,45.36,95.25,233.6,Single-ply,SBD,F
Girls,44.23,12,Astrid Inestroza,Cleveland,43.77,86.18,34.02,106.59,226.8,Single-ply,SBD,F
Girls,44.23,13,Chrissy Wilson,Quinlan Ford,41.32,79.38,36.29,106.59,222.26,Single-ply,SBD,F
Girls,44.23,14,Emily Franklin,Shepherd,40.78,79.38,38.56,95.25,213.19,Single-ply,SBD,F
Girls,47.85,1,Aaliyah Garcia,Crystal City,46.54,151.95,68.04,138.35,358.34,Single-ply,SBD,F
Girls,47.85,2,Jacqueline Washington,Hillsboro,47.13,133.81,63.5,140.61,337.93,Single-ply,SBD,F
Girls,47.85,3,Bri Hernandez,Corpus Christi West Oso,46.77,145.15,68.04,122.47,335.66,Single-ply,SBD,F
Girls,47.85,4,Alyssa Canales,Corpus Christi West Oso,47.04,138.35,58.97,129.27,326.59,Single-ply,SBD,F
Girls,47.85,5,Stephany Villarreal,Zapata,47.04,115.67,70.31,129.27,315.25,Single-ply,SBD,F
Girls,47.85,6,Caitlin Watson,Bandera,46.9,124.74,65.77,122.47,312.98,Single-ply,SBD,F
Girls,47.85,7,Victoria Vasquez,Andrews,45.77,122.47,54.43,124.74,301.64,Single-ply,SBD,F
Girls,47.85,8,Blaine Gluck,Stephenville,47.45,120.2,54.43,127.01,301.64,Single-ply,SBD,F
Girls,47.85,9,Tatiana Contreras,Springtown,45.99,122.47,52.16,122.47,297.1,Single-ply,SBD,F
Girls,47.85,10,Karina Castillo,Gilmer,47.85,117.93,58.97,120.2,297.1,Single-ply,SBD,F
Girls,47.85,11,Karen Becerril,Perryton,46.58,108.86,61.23,120.2,290.3,Single-ply,SBD,F
Girls,47.85,12,Xeauna Rodriguez,Bandera,47.85,117.93,68.04,104.33,290.3,Single-ply,SBD,F
Girls,47.85,13,Jenny Jamie,Henderson,47.4,115.67,52.16,117.93,285.76,Single-ply,SBD,F
Girls,47.85,14,Shania Dies,Bridge City,46.31,117.93,49.9,115.67,283.5,Single-ply,SBD,F
Girls,47.85,15,Linsey Tackett,Orangefield,45.99,99.79,54.43,113.4,267.62,Single-ply,SBD,F
Girls,47.85,16,Yelena Martinez,Gainesville,47.58,99.79,43.09,115.67,258.55,Single-ply,SBD,F
Girls,47.85,NS,Elizabeth Chavez,Center,,,,,,Single-ply,SBD,F
Girls,51.94,1,Kaitlyn Pelitire,Beeville Jones,50.89,179.17,95.25,156.49,430.91,Single-ply,SBD,F
Girls,51.94,2,Jazmine Tejada,Gainesville,50.94,142.88,65.77,154.22,362.87,Single-ply,SBD,F
Girls,51.94,3,Samantha Wann,Springtown,50.89,142.88,79.38,124.74,347,Single-ply,SBD,F
Girls,51.94,4,Mindy Mullens,Springtown,51.26,138.35,63.5,142.88,344.73,Single-ply,SBD,F
Girls,51.94,5,Diamond Teran,Hidalgo Early College,50.71,136.08,79.38,127.01,342.46,Single-ply,SBD,F
Girls,51.94,6,Alyssa Ayers,Lampasas,50.08,117.93,77.11,136.08,331.12,Single-ply,SBD,F
Girls,51.94,7,Kalen Ruiz,Venus,50.85,120.2,68.04,138.35,326.59,Single-ply,SBD,F
Girls,51.94,8,Yagaira Martinez,Sinton,49.9,127.01,58.97,131.54,317.51,Single-ply,SBD,F
Girls,51.94,9,Brea Equia,Crystal City,50.35,136.08,70.31,111.13,317.51,Single-ply,SBD,F
Girls,51.94,10,Nancy Martinez,Decatur,51.57,117.93,56.7,140.61,315.25,Single-ply,SBD,F
Girls,51.94,11,Kereny Hernandez,Perryton,51.89,115.67,61.23,136.08,312.98,Single-ply,SBD,F
Girls,51.94,12,Ansley Downs,Paris,51.48,120.2,61.23,120.2,301.64,Single-ply,SBD,F
Girls,51.94,13,Natalia Juarez,Snyder,49.85,124.74,52.16,115.67,292.57,Single-ply,SBD,F
Girls,51.94,14,Sydney Jo Sears,Center,51.85,120.2,58.97,108.86,288.03,Single-ply,SBD,F
Girls,51.94,15,Madison Williams,Cleveland Tarkington,51.17,122.47,54.43,106.59,283.5,Single-ply,SBD,F
Girls,51.94,16,Sadie Stone,Bridge City,51.66,102.06,49.9,113.4,265.35,Single-ply,SBD,F
Girls,56.02,1,Aly Urrabazo,Crystal City,55.02,163.29,97.52,151.95,412.77,Single-ply,SBD,F
Girls,56.02,2,Madison Taylor,Orangefield,54.93,149.69,72.57,149.69,371.95,Single-ply,SBD,F
Girls,56.02,3,Trew Gaston,Springtown,52.12,149.69,83.91,136.08,369.68,Single-ply,SBD,F
Girls,56.02,4,Olivia Ansley,Shepherd,54.16,147.42,81.65,133.81,362.87,Single-ply,SBD,F
Girls,56.02,5,Joanna Arredondo,Crystal City,55.25,154.22,65.77,138.35,358.34,Single-ply,SBD,F
Girls,56.02,6,Vicky Aragon-Marcial,Anna,52.98,149.69,83.91,120.2,353.8,Single-ply,SBD,F
Girls,56.02,7,Victoria Urquidez,Gilmer,56.02,131.54,74.84,142.88,349.27,Single-ply,SBD,F
Girls,56.02,8,Maryanna GAVlANES,Zapata,55.07,131.54,72.57,142.88,347,Single-ply,SBD,F
Girls,56.02,9,Bergandi Alvarado,Snyder,55.57,149.69,65.77,124.74,340.19,Single-ply,SBD,F
Girls,56.02,10,Kaityn Brown,Venus,55.25,136.08,70.31,127.01,333.39,Single-ply,SBD,F
Girls,56.02,11,Annie Stevenson,Gilmer,54.66,133.81,52.16,133.81,319.78,Single-ply,SBD,F
Girls,56.02,12,Scout Bebee,Silsbee,54.25,136.08,54.43,124.74,315.25,Single-ply,SBD,F
Girls,56.02,13,Alicia Monreal,Perryton,56.02,122.47,65.77,111.13,299.37,Single-ply,SBD,F
Girls,56.02,DQ,Sadie Salazar,Beeville Jones,55.2,,,,,Single-ply,SBD,F
Girls,56.02,DQ,Natalie Denoso,Lampasas,54.7,120.2,,,,Single-ply,SBD,F
Girls,60.1,1,Cheyenne Avila,Snyder,59.6,192.78,97.52,151.95,442.25,Single-ply,SBD,F
Girls,60.1,2,Isabella Weatherby,Alvarado,59.19,174.63,81.65,158.76,415.04,Single-ply,SBD,F
Girls,60.1,3,Frances Ajaero,Stafford,59.15,147.42,56.7,179.17,383.29,Single-ply,SBD,F
Girls,60.1,4,Ashley Cuellar,Zapata,58.42,136.08,90.72,138.35,365.14,Single-ply,SBD,F
Girls,60.1,5,Rachel Hellam,Springtown,58.24,149.69,70.31,140.61,360.61,Single-ply,SBD,F
Girls,60.1,6,Pracilla Ramirez,Crystal City,58.65,149.69,86.18,124.74,360.61,Single-ply,SBD,F
Girls,60.1,7,Claire Coutemanche,Smithville,58.79,151.95,61.23,145.15,358.34,Single-ply,SBD,F
Girls,60.1,8,Cierra Anderson,Gilmer,59.96,154.22,65.77,133.81,353.8,Single-ply,SBD,F
Girls,60.1,9,Madi Issacs,Fairfield,59.42,131.54,68.04,145.15,344.73,Single-ply,SBD,F
Girls,60.1,10,Kristin Rocco,Dalhart,59.65,127.01,70.31,122.47,319.78,Single-ply,SBD,F
Girls,60.1,11,Steffani Moser,Shepherd,57.7,117.93,70.31,99.79,288.03,Single-ply,SBD,F
Girls,67.36,1,Andrea Ramirez,Rio Hondo,62.01,181.44,117.93,165.56,464.93,Single-ply,SBD,F
Girls,67.36,2,Erieanna Lopez,Shepherd,65.41,174.63,102.06,158.76,435.45,Single-ply,SBD,F
Girls,67.36,3,Kayla Jimenez,Crystal City,66.04,183.7,83.91,163.29,430.91,Single-ply,SBD,F
Girls,67.36,4,Alexandrea Nall,Waco Connally,66.04,172.37,86.18,165.56,424.11,Single-ply,SBD,F
Girls,67.36,5,Nayeli Miranda,Perryton,63.96,158.76,83.91,163.29,405.97,Single-ply,SBD,F
Girls,67.36,6,Maiya Rodriguez,Kaufman,62.91,172.37,83.91,147.42,403.7,Single-ply,SBD,F
Girls,67.36,7,Nallely Ramirez,Perryton,65.91,149.69,95.25,142.88,387.82,Single-ply,SBD,F
Girls,67.36,8,Natalie Koenig,Anna,64.95,149.69,74.84,161.03,385.55,Single-ply,SBD,F
Girls,67.36,9,Kaci Donaldson,Lorena,64.18,154.22,90.72,136.08,381.02,Single-ply,SBD,F
Girls,67.36,10,Victoria Martinez,Lampasas,64,149.69,81.65,142.88,374.21,Single-ply,SBD,F
Girls,67.36,11,Sheila Flores,Hillsboro,64.46,154.22,74.84,136.08,365.14,Single-ply,SBD,F
Girls,67.36,12,Madelyn Vining,Springtown,66.95,145.15,77.11,133.81,356.07,Single-ply,SBD,F
Girls,67.36,13,Audree Shelton,Bullard,65.59,136.08,77.11,138.35,351.53,Single-ply,SBD,F
Girls,67.36,14,Lacey Pender,Bridge City,66.36,142.88,56.7,142.88,342.46,Single-ply,SBD,F
Girls,67.36,DQ,Kayla Gonzalez,Venus,65.91,,,,,Single-ply,SBD,F
Girls,75.07,1,Kerrington Biggers,Snyder,69.81,199.58,97.52,188.24,485.34,Single-ply,SBD,F
Girls,75.07,2,Kianna Lara,Crystal City,73.75,192.78,122.47,154.22,469.47,Single-ply,SBD,F
Girls,75.07,3,Julianna Barrera,Port Isabel,67.77,185.97,90.72,158.76,435.45,Single-ply,SBD,F
Girls,75.07,4,Maddie Dills,Bonham,74.43,170.1,95.25,158.76,424.11,Single-ply,SBD,F
Girls,75.07,5,Jayla Sims,Paris,71.4,158.76,86.18,163.29,408.23,Single-ply,SBD,F
Girls,75.07,6,Haylee Lasiter,Crystal City,73.75,174.63,90.72,142.88,408.23,Single-ply,SBD,F
Girls,75.07,7,Tori Contreras,Beeville Jones,70.26,170.1,70.31,158.76,399.16,Single-ply,SBD,F
Girls,75.07,8,Jayci Craig,Burnet,67.4,172.37,77.11,131.54,381.02,Single-ply,SBD,F
Girls,75.07,9,Victoria Allen,Cleveland,74.84,170.1,74.84,136.08,381.02,Single-ply,SBD,F
Girls,75.07,10,Bonnie Jasper,Snyder,72.26,149.69,74.84,145.15,369.68,Single-ply,SBD,F
Girls,75.07,11,Karen Villanueva,Rio Hondo,72.57,147.42,79.38,142.88,369.68,Single-ply,SBD,F
Girls,75.07,12,Angel Beavers,Mineral Wells,72.53,149.69,65.77,147.42,362.87,Single-ply,SBD,F
Girls,75.07,13,Jocalynn Fountain,Gilmer,73.84,154.22,63.5,142.88,360.61,Single-ply,SBD,F
Girls,75.07,14,Mykhala Lewis,Needville,72.67,147.42,68.04,142.88,358.34,Single-ply,SBD,F
Girls,75.07,DQ,Hannah Patton,Hillsboro,73.48,154.22,70.31,,,Single-ply,SBD,F
Girls,75.07,DQ,Desiree Gonzales,Beeville Jones,73.62,,,,,Single-ply,SBD,F
Girls,82.33,1,Macy Davis,Anna,80.92,183.7,138.35,158.76,480.81,Single-ply,SBD,F
Girls,82.33,2,Lauryn Botello,Beeville Jones,81.87,185.97,117.93,151.95,455.86,Single-ply,SBD,F
Girls,82.33,3,Marshae Davis,Gilmer,79.06,167.83,92.99,181.44,442.25,Single-ply,SBD,F
Girls,82.33,4,Maria Rodriguez,Crystal City,79.38,172.37,106.59,163.29,442.25,Single-ply,SBD,F
Girls,82.33,5,Audrey Gonzales,Geronimo Navarro,79.79,170.1,92.99,172.37,435.45,Single-ply,SBD,F
Girls,82.33,6,Illea Lugo,Somerset,80.69,197.31,88.45,145.15,430.91,Single-ply,SBD,F
Girls,82.33,7,Carlie Roberts,Big Spring,82.28,158.76,86.18,181.44,426.38,Single-ply,SBD,F
Girls,82.33,8,Angela Rendon,Hidalgo Early College,81.19,190.51,83.91,145.15,419.57,Single-ply,SBD,F
Girls,82.33,9,Anyssa Barrientes,Rio Hondo,82.24,161.03,95.25,156.49,412.77,Single-ply,SBD,F
Girls,82.33,10,Stefani Norton,Nevada Community,81.19,158.76,117.93,131.54,408.23,Single-ply,SBD,F
Girls,82.33,11,Alexis Resendez,Kingsville King,81.01,156.49,97.52,151.95,405.97,Single-ply,SBD,F
Girls,82.33,12,Amanda Rivera,Poteet,79.38,195.04,61.23,145.15,401.43,Single-ply,SBD,F
Girls,82.33,13,Kallie Flowers,Gainesville,82.28,174.63,81.65,142.88,399.16,Single-ply,SBD,F
Girls,82.33,14,Jeriana Jones,Gatesville,80.83,147.42,74.84,165.56,387.82,Single-ply,SBD,F
Girls,82.33,15,Cami Pennington,Shepherd,76.97,167.83,86.18,122.47,376.48,Single-ply,SBD,F
Girls,82.33,16,Carla Guerra,Princeton,79.47,147.42,79.38,147.42,374.21,Single-ply,SBD,F
Girls,82.33,17,Lizett Garza,West Columbia,81.06,151.95,77.11,140.61,369.68,Single-ply,SBD,F
Girls,82.33,18,Siria Martinez,Seminole,80.2,154.22,68.04,145.15,367.41,Single-ply,SBD,F
Girls,82.33,19,Natalie Lopez,Venus,78.65,165.56,79.38,117.93,362.87,Single-ply,SBD,F
Girls,82.33,DQ,Alyssa Alva,Pearsall,78.79,183.7,79.38,,,Single-ply,SBD,F
Girls,82.33,DQ,Jamie Wilkinson,Fairfield,80.06,185.97,97.52,,,Single-ply,SBD,F
Girls,90.04,1,Mariana Botello,Beeville Jones,88.18,233.6,120.2,142.88,496.68,Single-ply,SBD,F
Girls,90.04,2,Katelin Van Dong,Lytle,85.32,204.12,95.25,195.04,494.42,Single-ply,SBD,F
Girls,90.04,3,Reva Salazar,Beeville Jones,89.49,188.24,117.93,156.49,462.66,Single-ply,SBD,F
Girls,90.04,4,Gabriella Patino,Crystal City,86.23,195.04,95.25,154.22,444.52,Single-ply,SBD,F
Girls,90.04,5,Jessica Ebeling,Stephenville,86.45,185.97,88.45,158.76,433.18,Single-ply,SBD,F
Girls,90.04,6,Brianna Sims,Castleberry,86.86,156.49,108.86,167.83,433.18,Single-ply,SBD,F
Girls,90.04,7,Lorelei Irby,Sweeny,87.23,170.1,86.18,151.95,408.23,Single-ply,SBD,F
Girls,90.04,8,Elizabeth Montes,Dalhart,86.95,174.63,70.31,158.76,403.7,Single-ply,SBD,F
Girls,90.04,9,FeKyra Wells,Anna,82.92,176.9,90.72,131.54,399.16,Single-ply,SBD,F
Girls,90.04,10,Ke'Brianna Malone,Sour Lake Hardin-Jefferson,86.59,158.76,83.91,156.49,399.16,Single-ply,SBD,F
Girls,90.04,11,Andrea Fabela,Perryton,83.14,156.49,104.33,131.54,392.36,Single-ply,SBD,F
Girls,90.04,12,Zahia Cooper,Henderson,82.64,163.29,72.57,145.15,381.02,Single-ply,SBD,F
Girls,90.04,13,Crystal Garcia,Gonzales,82.78,161.03,61.23,149.69,371.95,Single-ply,SBD,F
Girls,90.04,14,Ashlea Perales,Rio Hondo,86.45,167.83,102.06,,269.89,Single-ply,SB,F
Girls,90.04,DQ,Emma Juarez,Sealy,88.68,181.44,74.84,,,Single-ply,SBD,F
Girls,90.04,DQ,Kailan Randle,Center,85.68,,,,,Single-ply,SBD,F
Girls,100.02,1,Jazmine Kuper,Springtown,96.52,213.19,136.08,163.29,512.56,Single-ply,SBD,F
Girls,100.02,2,Amber Ramirez,Beeville Jones,98.57,188.24,142.88,161.03,492.15,Single-ply,SBD,F
Girls,100.02,3,Kaylie Perez,Victoria St. Joseph,96.39,195.04,102.06,170.1,467.2,Single-ply,SBD,F
Girls,100.02,4,Crystal Gutierrez,Perryton,99.2,190.51,108.86,165.56,464.93,Single-ply,SBD,F
Girls,100.02,5,Bethanie Rodriguez,Crystal City,98.34,183.7,113.4,161.03,458.13,Single-ply,SBD,F
Girls,100.02,6,Isabel Hinojos,Andrews,95.98,213.19,83.91,138.35,435.45,Single-ply,SBD,F
Girls,100.02,7,Yazmine Garcia,Pearsall,91.44,185.97,83.91,149.69,419.57,Single-ply,SBD,F
Girls,100.02,8,Brailey Hall,Burnet,93.67,188.24,86.18,136.08,410.5,Single-ply,SBD,F
Girls,100.02,9,Courtney Renia,Llano,99.93,154.22,83.91,161.03,399.16,Single-ply,SBD,F
Girls,100.02,10,Yadira Abreu,Castleberry,98.7,145.15,92.99,154.22,392.36,Single-ply,SBD,F
Girls,100.02,11,Otilia Olague,Henderson,99.79,174.63,74.84,142.88,392.36,Single-ply,SBD,F
Girls,100.02,12,Savannah Davey,Needville,96.62,158.76,79.38,142.88,381.02,Single-ply,SBD,F
Girls,100.02,13,Lataevia Thomas,Freeport Brazosport,97.61,147.42,83.91,149.69,381.02,Single-ply,SBD,F
Girls,100.02,14,Kala Oliver,Henderson,93.53,131.54,58.97,142.88,333.39,Single-ply,SBD,F
Girls,117.71,1,Melanie Morin,Andrews,114.35,226.8,111.13,181.44,519.36,Single-ply,SBD,F
Girls,117.71,2,Danielle Brown,Shepherd,110.36,217.72,108.86,167.83,494.42,Single-ply,SBD,F
Girls,117.71,3,Jeannie Flores,Orange Grove,111.63,208.65,102.06,176.9,487.61,Single-ply,SBD,F
Girls,117.71,4,Brandy Gonzales,Rio Hondo,108.27,215.46,122.47,147.42,485.34,Single-ply,SBD,F
Girls,117.71,5,Brenda Sanchez,Fort Worth Diamond Hill-Jarvis,107.23,183.7,102.06,185.97,471.74,Single-ply,SBD,F
Girls,117.71,6,Emily Hertel,Midland Greenwood,109.09,217.72,102.06,151.95,471.74,Single-ply,SBD,F
Girls,117.71,7,Analicia Ramirez,Beeville Jones,114.26,192.78,113.4,142.88,449.06,Single-ply,SBD,F
Girls,117.71,8,Tabitha Barksdale,Waxahachie Life,101.02,185.97,92.99,167.83,446.79,Single-ply,SBD,F
Girls,117.71,9,Savannah Ford,Gatesville,113.4,199.58,99.79,147.42,446.79,Single-ply,SBD,F
Girls,117.71,10,Grayce Riley,Denver City,113.53,188.24,102.06,156.49,446.79,Single-ply,SBD,F
Girls,117.71,11,Hannah McCullough,Sour Lake Hardin-Jefferson,107.95,190.51,88.45,165.56,444.52,Single-ply,SBD,F
Girls,117.71,12,Luz Garcia,Crystal City,113.26,181.44,102.06,142.88,426.38,Single-ply,SBD,F
Girls,117.71,13,Kaylee Shilling,Waco La Vega,102.29,183.7,95.25,142.88,421.84,Single-ply,SBD,F
Girls,117.71,14,Denisha Dodis,Silsbee,109.09,179.17,90.72,151.95,421.84,Single-ply,SBD,F
Girls,117.71,15,Maggie Young,Burkburnett,111.31,165.56,61.23,149.69,376.48,Single-ply,SBD,F
Girls,117.71,16,Grace Moses,Gilmer,116.12,158.76,61.23,127.01,347,Single-ply,SBD,F
Girls,117.71,DQ,Karina Martinez,Raymondville,109.54,256.28,115.67,,,Single-ply,SBD,F
Girls,117.71+,1,Erlyna Morgan,Kennedale,120.47,231.33,97.52,185.97,514.83,Single-ply,SBD,F
Girls,117.71+,2,Enriquez Castro Ashley,Anna,120.25,229.06,108.86,163.29,501.22,Single-ply,SBD,F
Girls,117.71+,3,Ebony Wolridge,Giddings,142.61,213.19,113.4,170.1,496.68,Single-ply,SBD,F
Girls,117.71+,4,Aliyah Allison,Waco La Vega,152.18,195.04,108.86,170.1,474,Single-ply,SBD,F
Girls,117.71+,5,Shannie Jones,Gilmer,118.02,226.8,83.91,154.22,464.93,Single-ply,SBD,F
Girls,117.71+,6,Kenya Jeffcoat,Shepherd,126.37,204.12,113.4,142.88,460.4,Single-ply,SBD,F
Girls,117.71+,7,Tori Lewis,Henderson,120.07,204.12,74.84,147.42,426.38,Single-ply,SBD,F
Girls,117.71+,8,Irma Rodriguez,Perryton,124.74,174.63,92.99,147.42,415.04,Single-ply,SBD,F
Girls,117.71+,9,Illeana Bosquez,Pleasanton,131.5,174.63,88.45,140.61,403.7,Single-ply,SBD,F
Girls,117.71+,10,Janal Robertson,Cleveland,127.55,170.1,72.57,147.42,390.09,Single-ply,SBD,F
Girls,117.71+,11,Madison Curbow,Pleasanton,124.92,156.49,92.99,129.27,378.75,Single-ply,SBD,F
Girls,117.71+,12,Esmi Ramirez,Pecos,120.66,138.35,90.72,136.08,365.14,Single-ply,SBD,F
