Division,WeightClassKg,Place,Name,Team,BodyweightKg,Best3SquatKg,Best3BenchKg,Best3DeadliftKg,TotalKg,Equipment,Event,Sex
Boys,51.71,1,Jason Nguyen,Oakridge School,51.71,161.03,79.38,165.56,405.97,Single-ply,SBD,M
Boys,51.71,2,Aj Stark,Cedar Hill,48.08,97.52,58.97,99.79,256.28,Single-ply,SBD,M
Boys,51.71,3,Jack Hurt,Dallas Highland Park,51.71,77.11,43.09,102.06,222.26,Single-ply,SBD,M
Boys,55.79,1,Jordan Estell,North Mesquite,55.79,158.76,79.38,185.97,424.11,Single-ply,SBD,M
Boys,55.79,2,Elliot Stone,Dallas Jesuit,53.52,129.27,74.84,161.03,365.14,Single-ply,SBD,M
Boys,55.79,3,Romeo Roberts,Richardson Berkner,54.43,108.86,65.77,129.27,303.91,Single-ply,SBD,M
Boys,55.79,4,Simeion Blow,North Mesquite,52.62,102.06,58.97,129.27,290.3,Single-ply,SBD,M
Boys,55.79,5,Brandon McKee,Cedar Hill,54.43,106.59,68.04,113.4,288.03,Single-ply,SBD,M
Boys,55.79,6,Nolan Roberts,Dallas Highland Park,54.43,102.06,52.16,120.2,274.42,Single-ply,SBD,M
Boys,59.87,1,Dalton McWilliams,Lewisville Marcus,59.83,165.56,111.13,136.08,412.77,Single-ply,SBD,M
Boys,59.87,DQ,Spencer Landwehr,Dallas Highland Park,58.06,,61.23,106.59,,Single-ply,SBD,M
Boys,67.13,1,A'Daireon Madlock,North Mesquite,67.13,197.31,92.99,192.78,483.08,Single-ply,SBD,M
Boys,67.13,2,Darius Sockwell,Cedar Hill,66.22,183.7,97.52,197.31,478.54,Single-ply,SBD,M
Boys,67.13,3,Fletcher Kerr,Dallas Jesuit,64.86,154.22,97.52,156.49,408.23,Single-ply,SBD,M
Boys,67.13,4,Tim Lewis,North Mesquite,66.22,147.42,79.38,167.83,394.63,Single-ply,SBD,M
Boys,67.13,5,James Herring,Dallas Highland Park,65.77,140.61,74.84,136.08,351.53,Single-ply,SBD,M
Boys,67.13,6,Chrirstin Williams,Richardson Berkner,64.36,113.4,70.31,163.29,347,Single-ply,SBD,M
Boys,67.13,7,Nick Drkulec,Oakridge School,63.5,102.06,70.31,120.2,292.57,Single-ply,SBD,M
Boys,67.13,8,Allen Habashy,Plano John Paul II,65.32,83.91,58.97,138.35,281.23,Single-ply,SBD,M
Boys,74.84,1,Dominique McBride,North Mesquite,72.57,226.8,106.59,219.99,553.38,Single-ply,SBD,M
Boys,74.84,2,Ben Walzel,Dallas Highland Park,74.84,204.12,136.08,206.38,546.58,Single-ply,SBD,M
Boys,74.84,3,Hennon Cooper,Cedar Hill,73.03,181.44,111.13,206.38,498.95,Single-ply,SBD,M
Boys,74.84,4,Blake Echols,Oakridge School,73.48,174.63,115.67,197.31,487.61,Single-ply,SBD,M
Boys,74.84,5,Sam Wortham,Lucas Lovejoy,74.39,165.56,104.33,181.44,451.32,Single-ply,SBD,M
Boys,74.84,6,Sagar Patel,Oakridge School,71.21,151.95,97.52,195.04,444.52,Single-ply,SBD,M
Boys,74.84,7,Zack Folts,Dallas Highland Park,74.84,140.61,92.99,165.56,399.16,Single-ply,SBD,M
Boys,74.84,8,Marshall Ballard,Dallas Highland Park,72.57,124.74,68.04,129.27,322.05,Single-ply,SBD,M
Boys,74.84,9,George Reynolds,Dallas Highland Park,74.84,127.01,77.11,102.06,306.17,Single-ply,SBD,M
Boys,82.1,10,Za'Shone Lindley,Richardson Berkner,74.93,102.06,65.77,136.08,303.91,Single-ply,SBD,M
Boys,74.84,11,Rari Patel,Oakridge School,69.4,111.13,58.97,122.47,292.57,Single-ply,SBD,M
Boys,74.84,12,Cole Bohner,Dallas Highland Park,72.57,95.25,65.77,108.86,269.89,Single-ply,SBD,M
Boys,74.84,DQ,Jared Stephens,Coppell,72.48,170.1,,174.63,,Single-ply,SBD,M
Boys,74.84,DQ,Reed West,Plano John Paul II,72.57,,54.43,127.01,,Single-ply,SBD,M
Boys,74.84,DQ,Sean Sachnik,Plano John Paul II,74.39,,70.31,102.06,,Single-ply,SBD,M
Boys,89.81,1,Elijah Moore,Cedar Hill,82.24,204.12,136.08,213.19,553.38,Single-ply,SBD,M
Boys,82.1,2,Cason Kelley,Lucas Lovejoy,78.79,204.12,129.27,208.65,542.04,Single-ply,SBD,M
Boys,82.1,3,Chance Alexander,Oakridge School,79.38,204.12,102.06,208.65,514.83,Single-ply,SBD,M
Boys,82.1,4,Zack Ashman,Lewisville Marcus,80.01,181.44,120.2,192.78,494.42,Single-ply,SBD,M
Boys,82.1,5,Lonnie Burgess,Cedar Hill,78.29,201.85,108.86,181.44,492.15,Single-ply,SBD,M
Boys,82.1,6,Carter Collins,Dallas Highland Park,81.65,165.56,95.25,156.49,417.3,Single-ply,SBD,M
Boys,82.1,7,Caleb Scott,Cedar Hill,75.75,142.88,83.91,172.37,399.16,Single-ply,SBD,M
Boys,82.1,8,Ryan Jones,Coppell,80.2,138.35,97.52,154.22,390.09,Single-ply,SBD,M
Boys,82.1,9,Ryan Landsberg,Dallas Highland Park,78.47,140.61,88.45,127.01,356.07,Single-ply,SBD,M
Boys,82.1,10,Ben Richardson,Dallas Highland Park,79.38,129.27,70.31,136.08,335.66,Single-ply,SBD,M
Boys,82.1,11,Jack Toohey,Dallas Highland Park,77.11,122.47,74.84,120.2,317.51,Single-ply,SBD,M
Boys,82.1,DQ,Steven Kinyanjui,Plano John Paul II,81.78,136.08,,,,Single-ply,SBD,M
Boys,89.81,1,Stacy Sublett,North Mesquite,85.14,226.8,106.59,235.87,569.26,Single-ply,SBD,M
Boys,89.81,2,Jared Link,Dallas Highland Park,89.81,213.19,115.67,204.12,532.97,Single-ply,SBD,M
Boys,89.81,3,Christain Nelson,Dallas Jesuit,88.36,204.12,111.13,192.78,508.02,Single-ply,SBD,M
Boys,89.81,4,Joseph Stautner,Dallas Jesuit,88.77,185.97,120.2,201.85,508.02,Single-ply,SBD,M
Boys,89.81,5,Philip Prather,North Mesquite,86.45,181.44,108.86,206.38,496.68,Single-ply,SBD,M
Boys,89.81,6,Chase Barajas,Lucas Lovejoy,87.23,172.37,111.13,204.12,487.61,Single-ply,SBD,M
Boys,89.81,7,Luke Blanton,Dallas Highland Park,88.45,190.51,106.59,190.51,487.61,Single-ply,SBD,M
Boys,89.81,8,Josh Block,Dallas Highland Park,86.18,170.1,106.59,183.7,460.4,Single-ply,SBD,M
Boys,89.81,9,Kade Ashley,Lucas Lovejoy,87.82,170.1,129.27,158.76,458.13,Single-ply,SBD,M
Boys,89.81,10,Steven Mancillas,Dallas Jesuit,85.59,174.63,95.25,154.22,424.11,Single-ply,SBD,M
Boys,89.81,11,Ben Boudreaux,Dallas Highland Park,89.81,163.29,88.45,158.76,410.5,Single-ply,SBD,M
Boys,89.81,12,Parker LaCour,Dallas Highland Park,83.91,149.69,90.72,158.76,399.16,Single-ply,SBD,M
Boys,89.81,13,Matt Gahm,Dallas Highland Park,84.82,145.15,95.25,158.76,399.16,Single-ply,SBD,M
Boys,89.81,14,David Anderson,Plano John Paul II,87.09,131.54,86.18,158.76,376.48,Single-ply,SBD,M
Boys,89.81,15,Noble Nash,Dallas Highland Park,88.45,138.35,86.18,149.69,374.21,Single-ply,SBD,M
Boys,89.81,16,Jack Arnold,Dallas Highland Park,86.18,145.15,74.84,145.15,365.14,Single-ply,SBD,M
Boys,89.81,17,Ryan Coxe,Dallas Highland Park,86.18,131.54,83.91,140.61,356.07,Single-ply,SBD,M
Boys,89.81,18,John Lewis,Richardson Berkner,84.87,102.06,70.31,129.27,301.64,Single-ply,SBD,M
Boys,89.81,19,Harrison Murski,Dallas Highland Park,87.54,149.69,86.18,,235.87,Single-ply,SB,M
Boys,89.81,DQ,Hayden Schnieders,Dallas Highland Park,88.9,,145.15,,,Single-ply,SB,M
Boys,89.81,DQ,Trey Goodspeed,Coppell,86.14,,95.25,,,Single-ply,SB,M
Boys,89.81,DQ,Matt Barge,Dallas Highland Park,86.18,,111.13,,,Single-ply,SB,M
Boys,89.81,DQ,Henry Allen,Dallas Highland Park,84.37,,79.38,158.76,,Single-ply,SBD,M
Boys,99.79,1,Nico Rodriguez,Dallas Jesuit,98.88,240.4,156.49,244.94,641.83,Single-ply,SBD,M
Boys,99.79,2,D Falana,Cedar Hill,99.02,226.8,138.35,233.6,598.74,Single-ply,SBD,M
Boys,99.79,3,Bennett Brock,Dallas Highland Park,92.08,217.72,127.01,217.72,562.45,Single-ply,SBD,M
Boys,99.79,4,Noor Wafayee,Oakridge School,99.34,190.51,127.01,219.99,537.51,Single-ply,SBD,M
Boys,99.79,5,Matt Hever,Dallas Jesuit,92.62,181.44,129.27,210.92,521.63,Single-ply,SBD,M
Boys,99.79,6,Anthony Smith,Cedar Hill,94.35,208.65,113.4,199.58,521.63,Single-ply,SBD,M
Boys,99.79,7,Kevin Pouncil,North Mesquite,93.62,195.04,129.27,185.97,510.29,Single-ply,SBD,M
Boys,99.79,8,Garrett Wingrove,Dallas Highland Park,98.43,190.51,113.4,204.12,508.02,Single-ply,SBD,M
Boys,99.79,9,Lavee Simpson,Richardson Berkner,92.62,188.24,108.86,185.97,483.08,Single-ply,SBD,M
Boys,99.79,10,Elliot Hartman,Dallas Jesuit,97.11,174.63,106.59,192.78,474,Single-ply,SBD,M
Boys,99.79,11,Jack Holstead,Lucas Lovejoy,98.02,176.9,102.06,181.44,460.4,Single-ply,SBD,M
Boys,99.79,12,Hawkins Taylor,Lewisville Marcus,99.52,156.49,129.27,170.1,455.86,Single-ply,SBD,M
Boys,99.79,13,Bobby Hrncir,Dallas Highland Park,95.25,151.95,113.4,181.44,446.79,Single-ply,SBD,M
Boys,99.79,14,Jack Mulderrig,Plano John Paul II,93.67,154.22,97.52,190.51,442.25,Single-ply,SBD,M
Boys,99.79,15,Jerry Nathan,Richardson Berkner,95.89,129.27,92.99,195.04,417.3,Single-ply,SBD,M
Boys,99.79,16,Johnny Alfaro,Richardson Berkner,96.3,172.37,102.06,142.88,417.3,Single-ply,SBD,M
Boys,99.79,17,William Kraft,Dallas Highland Park,95.25,158.76,95.25,161.03,415.04,Single-ply,SBD,M
Boys,99.79,18,Turner Coxe,Dallas Highland Park,99.79,145.15,95.25,170.1,410.5,Single-ply,SBD,M
Boys,99.79,19,John Hoover,Dallas Highland Park,93.44,154.22,83.91,161.03,399.16,Single-ply,SBD,M
Boys,99.79,20,Aj Bright,Richardson Berkner,92.99,124.74,102.06,124.74,351.53,Single-ply,SBD,M
Boys,99.79,21,Jd Berverly,Dallas Highland Park,99.79,136.08,74.84,,210.92,Single-ply,SB,M
Boys,99.79,DQ,John Gray,Dallas Highland Park,91.17,136.08,,154.22,,Single-ply,SBD,M
Boys,99.79,DQ,Rodney Darare,Richardson Berkner,94.94,188.24,,204.12,,Single-ply,SBD,M
Boys,109.77,1,Ryan Brooks,Dallas Jesuit,100.74,272.16,156.49,226.8,655.44,Single-ply,SBD,M
Boys,109.77,2,Quinton Washington,Lewisville Marcus,104.14,226.8,149.69,213.19,589.67,Single-ply,SBD,M
Boys,109.77,3,Grant Benno,Lucas Lovejoy,100.06,204.12,136.08,206.38,546.58,Single-ply,SBD,M
Boys,109.77,4,William Neeley,Dallas Highland Park,100.7,208.65,142.88,195.04,546.58,Single-ply,SBD,M
Boys,109.77,5,Romario Barnes,Richardson Berkner,108.68,183.7,108.86,199.58,492.15,Single-ply,SBD,M
Boys,109.77,6,Giff Giffin,Dallas Highland Park,108.86,147.42,95.25,190.51,433.18,Single-ply,SBD,M
Boys,109.77,7,Grey Giddens,Dallas Highland Park,104.33,163.29,90.72,174.63,428.64,Single-ply,SBD,M
Boys,109.77,8,Hassan Badawy,Richardson Berkner,108.23,136.08,102.06,183.7,421.84,Single-ply,SBD,M
Boys,109.77,9,Aaron Bankes,Lucas Lovejoy,106.82,156.49,104.33,158.76,419.57,Single-ply,SBD,M
Boys,109.77,10,Jack Petroff,Plano John Paul II,106.23,158.76,83.91,165.56,408.23,Single-ply,SBD,M
Boys,109.77,11,Jaxson Fearing,Dallas Jesuit,108.77,136.08,102.06,158.76,396.89,Single-ply,SBD,M
Boys,109.77,12,Chris Shumacher,Plano John Paul II,109.36,131.54,72.57,142.88,347,Single-ply,SBD,M
Boys,124.74,1,Nick Wood,Lewisville Marcus,119.88,263.08,151.95,213.19,628.23,Single-ply,SBD,M
Boys,124.74,2,Jack Sides,Dallas Highland Park,120.2,238.14,149.69,226.8,614.62,Single-ply,SBD,M
Boys,124.74,3,David Hogue,North Mesquite,118.57,224.53,133.81,213.19,571.53,Single-ply,SBD,M
Boys,124.74,4,Morgn Dooley,Lucas Lovejoy,112.67,238.14,142.88,181.44,562.45,Single-ply,SBD,M
Boys,124.74,5,Baliey Smih,Lucas Lovejoy,123.47,165.56,97.52,208.65,471.74,Single-ply,SBD,M
Boys,124.74,6,Jack Metz,Dallas Jesuit,112.13,174.63,102.06,179.17,455.86,Single-ply,SBD,M
Boys,124.74,7,Dalton Allen,Dallas Jesuit,121.29,151.95,95.25,165.56,412.77,Single-ply,SBD,M
Boys,124.74,8,Jack Doyle,Plano John Paul II,112.54,124.74,79.38,167.83,371.95,Single-ply,SBD,M
Boys,124.74,9,Ethan Shaw,Dallas Jesuit,118.02,136.08,79.38,142.88,358.34,Single-ply,SBD,M
Boys,124.74+,1,Dominique Farmer,Lewisville Marcus,125.65,244.94,145.15,190.51,580.6,Single-ply,SBD,M
Boys,124.74+,2,Jose Mejia,Coppell,125.24,192.78,156.49,192.78,542.04,Single-ply,SBD,M
Boys,124.74+,3,Desmon Coleman,North Mesquite,128.82,199.58,142.88,197.31,539.77,Single-ply,SBD,M
Boys,124.74+,4,Jose Barbosa,Richardson Berkner,142.38,165.56,108.86,192.78,467.2,Single-ply,SBD,M
Boys,124.74+,5,Robert Breland,Richardson Berkner,125.87,158.76,133.81,158.76,451.32,Single-ply,SBD,M
Boys,124.74+,6,Richard Browder,Richardson Berkner,128.32,129.27,92.99,176.9,399.16,Single-ply,SBD,M
Boys,124.74+,DQ,Thomas Shellmire,Dallas Highland Park,128.82,149.69,,174.63,,Single-ply,SBD,M
