Place,Name,State,WeightClassKg,BodyweightKg,Age,Best3SquatKg,Best3BenchKg,Best3DeadliftKg,TotalKg,Sex,Division,Equipment,Deadlift4Kg,Bench4Kg,Event
1,Rachel Bielmeier,NY,52,50.30,21,105.00,57.50,137.50,300.00,F,Juniors 20-23,Raw,,,SBD
1,Jennifer Spencer,NY,56,56.00,23,100.00,60.00,125.00,285.00,F,Juniors 20-23,Raw,,,SBD
1,Mary Di Matteo,NY,67.5,64.20,23,117.50,65.00,137.50,320.00,F,Juniors 20-23,Raw,,,SBD
1,Brianna Lanoye,NY,52,51.70,24,115.00,62.50,137.50,315.00,F,Open,Raw,,,SBD
1,Kaitlin Drollette,NY,56,56.00,29,105.00,65.00,117.50,287.50,F,Open,Raw,,,SBD
1,Becki Pierotti,NY,60,60.00,29,117.50,80.00,130.00,327.50,F,Open,Raw,,,SBD
2,Dené Dainotto,NY,60,60.00,29,120.00,70.00,132.50,322.50,F,Open,Raw,,,SBD
3,Andrea Andttor,NY,60,59.50,29,115.00,65.00,130.00,310.00,F,Open,Raw,,,SBD
4,Leanne Lin,NY,60,58.70,26,85.00,62.50,90.00,237.50,F,Open,Raw,,,SBD
1,Jennifer Spafford,NY,67.5,65.60,31,102.50,62.50,137.50,302.50,F,Open,Raw,,,SBD
2,Chelsea Gifford,NY,67.5,65.90,26,75.00,47.50,115.00,237.50,F,Open,Raw,,,SBD
1,Heather Pray,NY,75,71.10,43,117.50,70.00,165.00,352.50,F,Open,Raw,,,SBD
1,Riki Napiorkowski,NY,82.5,81.20,28,132.50,87.50,172.50,392.50,F,Open,Raw,,,SBD
2,Niki Rodo,NY,82.5,82.50,29,100.00,57.50,120.00,277.50,F,Open,Raw,,,SBD
1,Karin Caldwell,NY,52,51.30,44,77.50,40.00,92.50,210.00,F,Masters 40-44,Raw,,,SBD
1,Heather Pray,NY,75,71.10,43,117.50,70.00,165.00,352.50,F,Masters 40-44,Raw,,,SBD
1,Anthony Pirie,NY,75,72.30,23,177.50,122.50,227.50,527.50,M,Juniors 20-23,Raw,,,SBD
2,Derek Palmerton,NY,75,74.20,22,185.00,110.00,232.50,527.50,M,Juniors 20-23,Raw,,,SBD
1,Sharrieff Fareed,NY,90,87.30,20,230.00,167.50,250.00,647.50,M,Juniors 20-23,Raw,,,SBD
2,Paul Lane,NY,90,88.50,23,205.00,120.00,297.50,622.50,M,Juniors 20-23,Raw,,,SBD
1,Richard Parsons,NY,100,99.30,20,195.00,152.50,245.00,592.50,M,Juniors 20-23,Raw,,,SBD
1,Corbin Boggs,NY,110,108.90,21,232.50,142.50,262.50,637.50,M,Juniors 20-23,Raw,,,SBD
2,Joshua Snyder,NY,110,106.50,23,190.00,167.50,242.50,600.00,M,Juniors 20-23,Raw,,,SBD
1,Salvatore Christopher,NY,82.5,82.30,33,222.50,170.00,265.00,657.50,M,Open,Raw,,,SBD
2,Michael Olyer,NY,82.5,80.60,25,185.00,137.50,227.50,550.00,M,Open,Raw,,,SBD
1,Alex Delle Bovi,NY,90,84.00,27,245.00,167.50,272.50,685.00,M,Open,Raw,,,SBD
2,Joe Crane,NY,90,89.30,26,147.50,107.50,215.00,470.00,M,Open,Raw,,,SBD
1,Mark Chieco,NY,100,98.50,38,250.00,215.00,260.00,725.00,M,Open,Raw,,,SBD
2,Luke Bright,NY,100,96.60,27,200.00,177.50,295.00,672.50,M,Open,Raw,,,SBD
1,Corbin Boggs,NY,110,108.90,21,232.50,142.50,262.00,637.00,M,Open,Raw,,,SBD
1,Jon Alvarez,NY,125,120.70,26,237.50,185.00,280.00,702.50,M,Open,Raw,,,SBD
1,Kurt Colwell,NY,110,104.80,35,237.50,192.50,262.50,692.50,M,Submasters 35-39,Raw,,,SBD
1,Matthew Cooper,NY,125,120.80,39,235.00,162.50,252.50,650.00,M,Submasters 35-39,Raw,,,SBD
1,William Trudell,NY,82.5,82.50,55,142.50,90.00,197.50,430.00,M,Masters 55-59,Raw,200.5,,SBD
1,Eugene Ring,NY,100,99.00,52,227.50,132.50,230.00,590.00,M,Masters 50-54,Raw,,,SBD
1,Robert Ballentine,NY,125,117.20,59,137.50,110.00,162.50,410.00,M,Masters 55-59,Raw,,,SBD
1,Jeff Linton,NY,140,128.50,52,260.00,203.00,295.00,758.00,M,Masters 50-54,Raw,,,SBD
1,Tonie Rurrkiewicz,NY,67.5,63.50,14,102.50,50.00,120.00,272.50,F,Juniors 13-15,Raw,,,SBD
1,Albert Marcantonio,NY,75,74.50,20,182.50,137.50,227.50,547.50,M,Juniors 20-23,Wraps,,,SBD
1,Derek Winans,NY,56,53.10,29,140.00,95.00,192.50,427.50,M,Open,Wraps,,,SBD
DQ,Anthony Hobaica,NY,82.5,81.60,28,307.50,215.00,-313.00,,M,Open,Wraps,,,SBD
1,Jeff Flynn,NY,100,98.30,35,262.50,212.50,250.00,725.00,M,Open,Wraps,,,SBD
2,Jason Domingo,NY,100,98.90,33,227.50,170.00,280.00,677.50,M,Open,Wraps,,,SBD
1,Patrick Fraccola,NY,110,108.20,21,267.50,217.50,267.50,752.50,M,Open,Wraps,,,SBD
1,Carley Skarupinski,NY,140,127.00,25,262.50,152.50,250.00,665.00,M,Open,Wraps,,,SBD
1,Bruce Colwell,NY,110,108.00,39,237.50,172.50,252.50,662.50,M,Submasters 35-39,Wraps,,,SBD
1,Elgie Kightlinger,NY,140+,152.20,35,182.50,147.50,227.50,557.50,M,Submasters 35-39,Wraps,,,SBD
1,Robert Barreca,NY,67.5,67.30,60,102.50,82.50,147.50,332.50,M,Masters 60-64,Wraps,,,SBD
1,Thomas Stevenson,NY,125,122.70,59,182.50,92.50,182.50,457.50,M,Masters 55-59,Wraps,,,SBD
1,Everly Blank,NY,75,66.80,35,,82.50,,82.50,F,Open,Raw,,,B
1,Kathryn Scheffer,NY,90+,151.70,27,,70.00,,70.00,F,Open,Raw,,,B
1,Sarah Gravino,NY,56,54.60,37,,65.00,,65.00,F,Submasters 35-39,Raw,,,B
DQ,Shannon Brandes,NY,60,57.80,39,,-62.50,,,F,Submasters 35-39,Raw,,,B
1,Becky Black,NY,90+,116.80,39,,75.00,,75.00,F,Submasters 35-39,Raw,,,B
1,Vanessa Blackwell,NY,90+,95.20,49,,75.00,,75.00,F,Masters 45-49,Raw,,,B
1,Noah Wrazin,NY,67.5,66.00,16,,97.50,,97.50,M,Juniors 16-17,Raw,,,B
1,Jesse Ciffa,NY,82.5,81.90,21,,170.00,,170.00,M,Juniors 20-23,Raw,,,B
1,Benjamin Carella,NY,90,88.60,20,,140.00,,140.00,M,Juniors 20-23,Raw,,,B
1,Blake Schweikowsky,NY,125,115.70,15,,72.50,,72.50,M,Juniors 13-15,Raw,,,B
1,Luigi Fagiani,NY,110,109.50,25,,200.00,,200.00,M,Open,Raw,,,B
1,Reggie Robertson,NY,110,108.60,35,,160.00,,160.00,M,Submasters 35-39,Raw,,,B
1,Robert Schurr,NY,100,98.60,50,,147.50,,147.50,M,Masters 50-54,Raw,,,B
DQ,John Stellrecht,NY,100,98.60,69,,-130.00,,,M,Masters 65-69,Raw,,,B
1,Paul Bencal,NY,110,107.60,67,,125.00,,125.00,M,Masters 65-69,Raw,,,B
1,Jim Phraner,NY,125,111.60,30,,365.00,,365.00,M,Open,Single-ply,,,B
1,David Estrada,NY,140,128.90,48,,180.00,,180.00,M,Masters 45-49,Single-ply,,193,B
1,Sarah Gravino,NY,56,54.60,37,,,115.00,115.00,F,Submasters 35-39,Raw,,,D
1,Colleen O'Connell,NY,90+,90.90,36,,,75.00,75.00,F,Submasters 35-39,Raw,,,D
1,Vanessa Blackwell,NY,90+,95.20,49,,,140.00,140.00,F,Masters 45-49,Raw,,,D
1,Blake Schweikowsky,NY,125,115.70,15,,,140.00,140.00,M,Juniors 13-15,Raw,,,D
1,Derek Winans,NY,56,53.10,29,,,192.50,192.50,M,Open,Raw,,,D
1,Alex Delle Bovi,NY,90,84.00,27,,,272.50,272.50,M,Open,Raw,,,D
2,Scott Letts,NY,90,89.10,30,,,237.50,237.50,M,Open,Raw,,,D
1,Paul Bencal,NY,110,107.60,67,,,232.50,232.50,M,Masters 65-69,Raw,,,D
1,David Estrada,NY,140,128.90,48,,,275.50,275.50,M,Masters 45-49,Raw,295,,D
