Division,WeightClassKg,Place,Name,Team,BodyweightKg,Best3SquatKg,Best3BenchKg,Best3DeadliftKg,TotalKg,Equipment,Event,Sex
Boys,51.71,1,Jerry Lopez,Port Isabel,51.53,131.54,74.84,140.61,347,Single-ply,SBD,M
Boys,55.79,2,Cesar Casas,Hidalgo Early College,51.89,104.33,70.31,120.2,294.84,Single-ply,SBD,M
Boys,55.79,3,Jesus Morales,Port Isabel,51.94,92.99,72.57,104.33,269.89,Single-ply,SBD,M
Boys,51.71,4,George Trujillo,Santa Maria,51.17,79.38,52.16,95.25,226.8,Single-ply,SBD,M
Boys,51.71,DQ,Gabriel Montemoyor,Santa Rosa,50.53,,,,,Single-ply,SBD,M
Boys,55.79,1,Tristian Salinas,Santa Rosa,55.25,154.22,102.06,174.63,430.91,Single-ply,SBD,M
Boys,59.87,DQ,Seth Naranjo,Santa Rosa,55.97,,,,,Single-ply,SBD,M
Boys,59.87,1,Hugo Betancourt,Hidalgo Early College,59.87,127.01,95.25,158.76,381.02,Single-ply,SBD,M
Boys,67.13,DQ,Joseph Zaragoza,Raymondville,59.96,,,,,Single-ply,SBD,M
Boys,67.13,1,Joshua Watrous,Santa Rosa,64.77,185.97,86.18,215.46,487.61,Single-ply,SBD,M
Boys,67.13,2,Leonard Ramirez,Raymondville,65.77,174.63,115.67,165.56,455.86,Single-ply,SBD,M
Boys,67.13,3,Aaron Guerra,Lyford,65.32,158.76,83.91,165.56,408.23,Single-ply,SBD,M
Boys,67.13,4,Jacob Esparza,Lyford,65.77,149.69,83.91,149.69,383.29,Single-ply,SBD,M
Boys,67.13,5,James Cruz,Lyford,60.87,147.42,77.11,151.95,376.48,Single-ply,SBD,M
Boys,82.1,1,Julio Mendoza,Port Isabel,74.93,244.94,138.35,231.33,614.62,Single-ply,SBD,M
Boys,74.84,2,Ej Ybarra,Port Isabel,74.84,199.58,124.74,204.12,528.44,Single-ply,SBD,M
Boys,74.84,3,Adrian Moncevaiz,Raymondville,72.85,183.7,88.45,179.17,451.32,Single-ply,SBD,M
Boys,74.84,4,Nick Guerrero,Lyford,74.3,158.76,102.06,165.56,426.38,Single-ply,SBD,M
Boys,82.1,1,Luis Muñoz,Hidalgo Early College,81.83,213.19,129.27,215.46,557.92,Single-ply,SBD,M
Boys,82.1,2,Jose Martinez,Port Isabel,82.1,206.38,136.08,185.97,528.44,Single-ply,SBD,M
Boys,82.1,3,Beto Chavez,Hidalgo Early College,77.38,158.76,131.54,149.69,439.98,Single-ply,SBD,M
Boys,89.81,4,Joshua Rivera,Santa Rosa,82.28,136.08,79.38,142.88,358.34,Single-ply,SBD,M
Boys,82.1,DQ,Rick Strong,Santa Rosa,78.11,,,,,Single-ply,SBD,M
Boys,82.1,DQ,Alvaro Hernandez,Progreso,81.01,,,,,Single-ply,SBD,M
Boys,89.81,1,Francisco Cisneros,Rio Hondo,88.9,226.8,170.1,238.14,635.03,Single-ply,SBD,M
Boys,99.79,2,Mark Cavazos,Raymondville,90.04,229.06,174.63,195.04,598.74,Single-ply,SBD,M
Boys,89.81,3,Santiago Lozoya,Santa Maria,87.27,219.99,111.13,192.78,523.9,Single-ply,SBD,M
Boys,89.81,4,Juan Villarreal,Santa Rosa,87.63,208.65,111.13,201.85,521.63,Single-ply,SBD,M
Boys,89.81,5,Isaac Saldivar,Lyford,89.81,183.7,111.13,192.78,487.61,Single-ply,SBD,M
Boys,89.81,6,Daniel Coronado,La Feria,84.46,142.88,88.45,172.37,403.7,Single-ply,SBD,M
Boys,89.81,DQ,Elias Ezquivel,La Feria,86.91,,,,,Single-ply,SBD,M
Boys,89.81,DQ,Lawrence Caldwell,Rio Hondo,89.45,,,,,Single-ply,SBD,M
Boys,99.79,1,Justin Duran,Raymondville,90.63,310.71,170.1,242.67,723.48,Single-ply,SBD,M
Boys,99.79,2,Gregory Juarez,Raymondville,98.52,274.42,147.42,210.92,632.76,Single-ply,SBD,M
Boys,99.79,3,Jose Duran,Progreso,98.25,204.12,122.47,249.48,576.06,Single-ply,SBD,M
Boys,99.79,4,Roman Flores,Progreso,99.25,213.19,124.74,238.14,576.06,Single-ply,SBD,M
Boys,99.79,5,Victor Leal,Rio Hondo,98.79,204.12,131.54,204.12,539.77,Single-ply,SBD,M
Boys,99.79,6,Jesus Ramirez,Port Isabel,91.26,181.44,117.93,217.72,517.1,Single-ply,SBD,M
Boys,99.79,7,Isaac Carrizales,La Feria,97.43,183.7,108.86,188.24,480.81,Single-ply,SBD,M
Boys,99.79,8,Anthony Rios,Rio Hondo,95.62,142.88,102.06,165.56,410.5,Single-ply,SBD,M
Boys,99.79,DQ,Aureliano Silva,Port Isabel,93.35,,,,,Single-ply,SBD,M
Boys,109.77,1,Michael Newton,Port Isabel,109.41,231.33,147.42,201.85,580.6,Single-ply,SBD,M
Boys,109.77,2,Miguel Navarro,Rio Hondo,108.5,192.78,142.88,183.7,519.36,Single-ply,SBD,M
Boys,109.77,3,Ramsey Lopez,La Feria,101.51,192.78,111.13,204.12,508.02,Single-ply,SBD,M
Boys,109.77,4,Lincoln Chavez,Lyford,101.42,204.12,106.59,192.78,503.49,Single-ply,SBD,M
Boys,109.77,5,Tony Perez,Raymondville,102.69,201.85,99.79,197.31,498.95,Single-ply,SBD,M
Boys,109.77,6,Andrew Villarreal,Lyford,107.95,204.12,108.86,181.44,494.42,Single-ply,SBD,M
Boys,109.77,DQ,Joel White,La Feria,108.14,292.57,156.49,,,Single-ply,SBD,M
Boys,109.77,DQ,Manuel Melendez,Rio Hondo,104.78,,,,,Single-ply,SBD,M
Boys,124.74,DQ,Carl Contreras,Raymondville,109.86,240.4,,,,Single-ply,SBD,M
Boys,109.77,DQ,Michael Kalnes,La Feria,100.15,,,,,Single-ply,SBD,M
Boys,109.77,DQ,Andy Salinas,Port Isabel,107.32,,,,,Single-ply,SBD,M
Boys,124.74,1,Joe Trevino,Raymondville,124.28,387.82,192.78,260.82,841.41,Single-ply,SBD,M
Boys,124.74,2,Johnny Delgado,Port Isabel,121.47,219.99,133.81,213.19,566.99,Single-ply,SBD,M
Boys,124.74,3,Tyler James,Port Isabel,121.29,183.7,111.13,183.7,478.54,Single-ply,SBD,M
Boys,124.74,4,Abran Ramirez,Lyford,123.47,181.44,81.65,158.76,421.84,Single-ply,SBD,M
Boys,124.74,DQ,Frank Alvarez,Port Isabel,122.29,124.74,83.91,142.88,,Single-ply,SBD,M
Boys,124.74,DQ,Emilio Rivera,Lyford,124.56,,,,,Single-ply,SBD,M
Boys,124.74+,DQ,Mark Reyes,Hidalgo Early College,130.54,,,,,Single-ply,SBD,M
Boys,124.74+,DQ,Aaron Gonzales,Raymondville,131.81,,,,,Single-ply,SBD,M
