Division,WeightClassKg,Place,Name,Team,BodyweightKg,Best3SquatKg,Best3BenchKg,Best3DeadliftKg,TotalKg,Equipment,Event,Sex
Boys,51.71,1,Jermaine Mendiola,Somerset,50.85,142.88,68.04,142.88,353.8,Single-ply,SBD,M
Boys,51.71,2,Maverick Graham,Lytle,49.03,90.72,54.43,90.72,235.87,Single-ply,SBD,M
Boys,51.71,3,Seth Aguinaga,Lytle,49.9,79.38,47.63,104.33,231.33,Single-ply,SBD,M
Boys,51.71,4,Justin Griggs,Castroville Medina Valley,44,68.04,43.09,79.38,190.51,Single-ply,SBD,M
Boys,55.79,1,Max Obregon,Dilley,55.79,181.44,102.06,181.44,464.93,Single-ply,SBD,M
Boys,55.79,2,Dimas Tenorio,Crystal City,54.11,147.42,95.25,158.76,401.43,Single-ply,SBD,M
Boys,59.87,3,Colton Rodriguez,Jourdanton,55.88,117.93,68.04,145.15,331.12,Single-ply,SBD,M
Boys,55.79,4,Sebastian Estrada,Somerset,54.88,113.4,63.5,136.08,312.98,Single-ply,SBD,M
Boys,55.79,5,Michael Donato,San Antonio Memorial,55.34,122.47,68.04,117.93,308.44,Single-ply,SBD,M
Boys,59.87,6,Daniel Martinez,Dilley,55.88,111.13,72.57,122.47,306.17,Single-ply,SBD,M
Boys,55.79,7,Rudy Rios,Devine,54.43,90.72,61.23,111.13,263.08,Single-ply,SBD,M
Boys,59.87,1,Rudy Martinez,Carrizo Springs,59.42,172.37,92.99,192.78,458.13,Single-ply,SBD,M
Boys,59.87,2,Allen Espinosa,Dilley,59.87,170.1,97.52,181.44,449.06,Single-ply,SBD,M
Boys,67.13,3,Robert Perez,Uvalde,60.1,136.08,88.45,167.83,392.36,Single-ply,SBD,M
Boys,59.87,4,Matthew Medrano,Pearsall,59.87,149.69,70.31,170.1,390.09,Single-ply,SBD,M
Boys,59.87,5,Nathan Pena,Dilley,59.87,145.15,88.45,149.69,383.29,Single-ply,SBD,M
Boys,59.87,6,Raul Cruz,Carrizo Springs,59.42,131.54,81.65,161.03,374.21,Single-ply,SBD,M
Boys,59.87,7,Robert Rendon,Crystal City,58.33,129.27,68.04,136.08,333.39,Single-ply,SBD,M
Boys,59.87,8,Daniel Cardenas,Uvalde,59.87,108.86,77.11,127.01,312.98,Single-ply,SBD,M
Boys,59.87,9,Jose Chapa,Castroville Medina Valley,58.56,102.06,86.18,104.33,292.57,Single-ply,SBD,M
Boys,59.87,10,Esai DeLuna,Carrizo Springs,59.42,108.86,68.04,115.67,292.57,Single-ply,SBD,M
Boys,59.87,DQ,Gil Garcia,Crystal City,59.1,120.2,,,,Single-ply,SBD,M
Boys,59.87,DQ,Dj Witt,La Pryor,58.97,117.93,,,,Single-ply,SBD,M
Boys,67.13,1,Felix Gutierrez,Crystal City,65.14,183.7,124.74,199.58,508.02,Single-ply,SBD,M
Boys,67.13,2,Martin Delgado,Pearsall,65.05,151.95,92.99,163.29,408.23,Single-ply,SBD,M
Boys,67.13,3,Eden Martinez,Carrizo Springs,67.13,142.88,102.06,158.76,403.7,Single-ply,SBD,M
Boys,67.13,4,Brandon De Los Santos,Jourdanton,63.55,149.69,83.91,163.29,396.89,Single-ply,SBD,M
Boys,67.13,5,Christian Cedeno,Lytle,66.72,151.95,83.91,154.22,390.09,Single-ply,SBD,M
Boys,67.13,6,Effrain Botello,Castroville Medina Valley,60.83,136.08,86.18,158.76,381.02,Single-ply,SBD,M
Boys,67.13,7,Rene Rodriguez,Pearsall,63.32,122.47,92.99,147.42,362.87,Single-ply,SBD,M
Boys,67.13,8,Joe Saldana,Crystal City,63.78,102.06,70.31,108.86,281.23,Single-ply,SBD,M
Boys,67.13,9,Alfonzo Cruz,Carrizo Springs,63.55,88.45,74.84,115.67,278.96,Single-ply,SBD,M
Boys,67.13,10,Micheal Camacho,San Antonio Memorial,62.6,79.38,43.09,120.2,242.67,Single-ply,SBD,M
Boys,67.13,11,Jesus Saldana,Carrizo Springs,63.96,79.38,70.31,68.04,217.72,Single-ply,SBD,M
Boys,67.13,DQ,Adrian Esquibel,Devine,61.96,142.88,,,,Single-ply,SBD,M
Boys,67.13,DQ,Morgan Olivarri,Jourdanton,60.83,111.13,63.5,,,Single-ply,SBD,M
Boys,67.13,DQ,Aaron Realme,Pearsall,61.51,,,,,Single-ply,SBD,M
Boys,74.84,1,Craig Wells,San Antonio Brooks Academy,74.43,183.7,124.74,210.92,519.36,Single-ply,SBD,M
Boys,74.84,2,Nathan Medrano,Lytle,70.81,197.31,115.67,176.9,489.88,Single-ply,SBD,M
Boys,74.84,3,Kutter Schmidt,Devine,68.08,197.31,113.4,174.63,485.34,Single-ply,SBD,M
Boys,74.84,4,Dean Santos,Lytle,73.48,176.9,102.06,138.35,417.3,Single-ply,SBD,M
Boys,74.84,5,Matt Fanno,Jourdanton,71.21,142.88,81.65,170.1,394.63,Single-ply,SBD,M
Boys,74.84,6,Isaac Gonzales,San Antonio Memorial,74.84,142.88,79.38,149.69,371.95,Single-ply,SBD,M
Boys,74.84,7,Eric Garcia,Lytle,72.62,140.61,79.38,138.35,358.34,Single-ply,SBD,M
Boys,74.84,8,Sol Rodriguez,Pearsall,68.49,122.47,68.04,122.47,312.98,Single-ply,SBD,M
Boys,74.84,9,Emilio Alvarado,Crystal City,73.3,90.72,81.65,113.4,285.76,Single-ply,SBD,M
Boys,74.84,DQ,Jaziel Brunestro,Carrizo Springs,70.35,,,,,Single-ply,SBD,M
Boys,74.84,DQ,Matt Esparza,San Antonio Memorial,68.49,83.91,,,,Single-ply,SBD,M
Boys,74.84,DQ,Leroy Torres,Castroville Medina Valley,73.07,167.83,,,,Single-ply,SBD,M
Boys,82.1,1,AJ Camacho,Hondo,81.19,226.8,120.2,192.78,539.77,Single-ply,SBD,M
Boys,82.1,2,Orlando Medrano,Lytle,79.88,195.04,124.74,206.38,526.17,Single-ply,SBD,M
Boys,82.1,3,Christopher Vinton,Pearsall,80.29,204.12,124.74,195.04,523.9,Single-ply,SBD,M
Boys,82.1,4,Dylan Aguinaga,Lytle,80.29,197.31,111.13,199.58,508.02,Single-ply,SBD,M
Boys,89.81,5,Demetri Molina,Somerset,82.15,188.24,108.86,210.92,508.02,Single-ply,SBD,M
Boys,82.1,6,Robert Castillo,La Pryor,82.1,190.51,111.13,170.1,471.74,Single-ply,SBD,M
Boys,82.1,7,Jonathan Darby,Lytle,80.74,167.83,97.52,195.04,460.4,Single-ply,SBD,M
Boys,82.1,8,Steve Medrano,Dilley,81.24,165.56,104.33,172.37,442.25,Single-ply,SBD,M
Boys,82.1,9,Baker Livingston,Jourdanton,79.42,163.29,92.99,165.56,421.84,Single-ply,SBD,M
Boys,82.1,10,Alex Pena,Somerset,79.88,158.76,92.99,161.03,412.77,Single-ply,SBD,M
Boys,82.1,11,Zachary Vylecka,Jourdanton,78.06,147.42,77.11,156.49,381.02,Single-ply,SBD,M
Boys,82.1,12,Estevan Rodriguez,Uvalde,80.33,124.74,72.57,174.63,371.95,Single-ply,SBD,M
Boys,82.1,13,Oscar de Luna,San Antonio Memorial,77.11,127.01,72.57,115.67,315.25,Single-ply,SBD,M
Boys,82.1,14,Daniel Mendez,Carrizo Springs,80.29,70.31,61.23,142.88,274.42,Single-ply,SBD,M
Boys,82.1,15,Demetrius Brown,San Antonio Memorial,76.7,88.45,65.77,108.86,263.08,Single-ply,SBD,M
Boys,82.1,DQ,Elliot Ramirez,San Antonio Memorial,78.52,,,,,Single-ply,SBD,M
Boys,82.1,DQ,Justin Villanuevo,La Pryor,82.1,167.83,,,,Single-ply,SBD,M
Boys,82.1,DQ,Jeremy Castillo,La Pryor,76.25,124.74,,,,Single-ply,SBD,M
Boys,82.1,DQ,Nick Zavala,Crystal City,77.7,79.38,79.38,,,Single-ply,SBD,M
Boys,89.81,1,John Valdez,Somerset,86.18,235.87,131.54,204.12,571.53,Single-ply,SBD,M
Boys,89.81,2,Fabian Huerta,Crystal City,89.18,199.58,120.2,213.19,532.97,Single-ply,SBD,M
Boys,89.81,3,Jacob Lopez,San Antonio Brooks Academy,88.5,190.51,115.67,188.24,494.42,Single-ply,SBD,M
Boys,89.81,4,Calvin Martinez,Carrizo Springs,85.73,174.63,113.4,183.7,471.74,Single-ply,SBD,M
Boys,89.81,5,Joey Sanchez,Somerset,88.04,174.63,102.06,176.9,453.59,Single-ply,SBD,M
Boys,89.81,6,Josh Guerra,Castroville Medina Valley,83.05,147.42,113.4,185.97,446.79,Single-ply,SBD,M
Boys,89.81,7,Daniel Mann,Devine,88.04,158.76,102.06,183.7,444.52,Single-ply,SBD,M
Boys,89.81,8,Robert Cervantez,Dilley,88.9,176.9,92.99,174.63,444.52,Single-ply,SBD,M
Boys,89.81,9,Rigo Hernandez,Uvalde,86.73,181.44,90.72,163.29,435.45,Single-ply,SBD,M
Boys,89.81,10,Derek Garcia,Uvalde,87.18,149.69,97.52,176.9,424.11,Single-ply,SBD,M
Boys,89.81,11,Joshua Cuevas,Pearsall,84.37,138.35,81.65,151.95,371.95,Single-ply,SBD,M
Boys,89.81,12,David Alvizo,La Pryor,87.36,113.4,79.38,142.88,335.66,Single-ply,SBD,M
Boys,89.81,13,Marc Flores,Jourdanton,89.81,124.74,68.04,113.4,306.17,Single-ply,SBD,M
Boys,89.81,DQ,Brandon Puente,Crystal City,85.55,176.9,,,,Single-ply,SBD,M
Boys,99.79,1,Joey Mendez,San Antonio Memorial,99.79,242.67,115.67,217.72,576.06,Single-ply,SBD,M
Boys,99.79,2,John Koch,Hondo,96.16,172.37,120.2,195.04,487.61,Single-ply,SBD,M
Boys,99.79,3,Thomas Duran,San Antonio Brooks Academy,93.44,156.49,111.13,208.65,476.27,Single-ply,SBD,M
Boys,99.79,4,Dallin Hack,Castroville Medina Valley,98.47,172.37,113.4,174.63,460.4,Single-ply,SBD,M
Boys,99.79,5,Jose Orellana,La Pryor,91.17,170.1,115.67,163.29,449.06,Single-ply,SBD,M
Boys,99.79,6,Isaac Guzmon,Castroville Medina Valley,95.25,158.76,97.52,185.97,442.25,Single-ply,SBD,M
Boys,99.79,7,Joseph Galyon,Castroville Medina Valley,94.39,158.76,106.59,163.29,428.64,Single-ply,SBD,M
Boys,99.79,8,Thomas Gaither,Jourdanton,94.89,163.29,97.52,163.29,424.11,Single-ply,SBD,M
Boys,109.77,9,Andrew Ortiz,Jourdanton,99.84,158.76,104.33,158.76,421.84,Single-ply,SBD,M
Boys,99.79,10,Jose Coronado,San Antonio Memorial,93.44,145.15,83.91,142.88,371.95,Single-ply,SBD,M
Boys,99.79,11,Dylan Lutz,Hondo,94.85,68.04,52.16,104.33,224.53,Single-ply,SBD,M
Boys,99.79,DQ,Antonio Ramirez,Crystal City,97.66,136.08,,,,Single-ply,SBD,M
Boys,109.77,1,Leo Perez,Devine,100.74,258.55,147.42,222.26,628.23,Single-ply,SBD,M
Boys,109.77,2,Darren Garcia,Crystal City,109.45,233.6,145.15,204.12,582.87,Single-ply,SBD,M
Boys,109.77,3,Eli Rejino,Devine,105.28,208.65,124.74,183.7,517.1,Single-ply,SBD,M
Boys,109.77,4,Jason Cortez,Uvalde,104.51,174.63,111.13,172.37,458.13,Single-ply,SBD,M
Boys,109.77,5,Ross Reynolds,Jourdanton,103.46,183.7,74.84,195.04,453.59,Single-ply,SBD,M
Boys,109.77,6,Andres Garzes,San Antonio Memorial,109.32,190.51,102.06,158.76,451.32,Single-ply,SBD,M
Boys,109.77,7,Juan Aguinaga,Uvalde,109.41,142.88,102.06,158.76,403.7,Single-ply,SBD,M
Boys,109.77,8,Fabian Morales,San Antonio Memorial,104.33,129.27,95.25,142.88,367.41,Single-ply,SBD,M
Boys,109.77,9,Jacob Esquibel,La Pryor,107.09,142.88,86.18,138.35,367.41,Single-ply,SBD,M
Boys,109.77,10,Gilbert Lara,San Antonio Memorial,102.51,113.4,70.31,111.13,294.84,Single-ply,SBD,M
Boys,109.77,DQ,Willie Friday,San Antonio Memorial,103.87,120.2,,,,Single-ply,SBD,M
Boys,109.77,DQ,Ray Palame,Pearsall,104.24,,,,,Single-ply,SBD,M
Boys,109.77,DQ,Ruben Molina,Dilley,101.6,174.63,,,,Single-ply,SBD,M
Boys,124.74,1,Joshua Macat,Lytle,112.54,240.4,124.74,226.8,591.94,Single-ply,SBD,M
Boys,124.74,2,Jonathan Ramirez,Lytle,114.35,213.19,129.27,210.92,553.38,Single-ply,SBD,M
Boys,124.74,3,Austin Wilson,Castroville Medina Valley,111.18,195.04,113.4,206.38,514.83,Single-ply,SBD,M
Boys,124.74,4,Juan Ramirez,Carrizo Springs,119.79,183.7,136.08,195.04,514.83,Single-ply,SBD,M
Boys,124.74,5,Carlos Perez #3,La Pryor,118.89,183.7,113.4,183.7,480.81,Single-ply,SBD,M
Boys,124.74,6,Tino Torres,Carrizo Springs,122.47,183.7,106.59,185.97,476.27,Single-ply,SBD,M
Boys,124.74,7,Jojo Mata,La Pryor,114.8,195.04,92.99,185.97,474,Single-ply,SBD,M
Boys,124.74,8,James Woods,Somerset,114.76,151.95,95.25,185.97,433.18,Single-ply,SBD,M
Boys,124.74,9,Miguel Garcia,Uvalde,115.76,142.88,68.04,195.04,405.97,Single-ply,SBD,M
Boys,124.74,10,Elias Torres,Carrizo Springs,118.39,140.61,92.99,131.54,365.14,Single-ply,SBD,M
Boys,124.74,11,Ceaser Morales,Somerset,115.67,124.74,81.65,142.88,349.27,Single-ply,SBD,M
Boys,124.74,12,Lupe Tellez,La Pryor,110.72,79.38,79.38,117.93,276.69,Single-ply,SBD,M
Boys,124.74+,1,Charest Inman,Castroville Medina Valley,148.82,258.55,192.78,249.48,700.8,Single-ply,SBD,M
Boys,124.74+,2,Austyn Carrizales,Dilley,140.61,215.46,104.33,254.01,573.79,Single-ply,SBD,M
Boys,124.74+,3,Julius Gonzales,Dilley,127.91,249.48,117.93,195.04,562.45,Single-ply,SBD,M
Boys,124.74+,4,Mike Romero,Somerset,146.96,192.78,138.35,165.56,496.68,Single-ply,SBD,M
Boys,124.74+,5,Mario Chavez,Carrizo Springs,184.61,188.24,104.33,197.31,489.88,Single-ply,SBD,M
Boys,124.74+,6,Jose Nuno,Devine,127.46,181.44,97.52,183.7,462.66,Single-ply,SBD,M
Boys,124.74+,7,Jay Sandoval,San Antonio Memorial,154.22,163.29,102.06,179.17,444.52,Single-ply,SBD,M
Boys,124.74+,8,Jesús Torres,Somerset,126.6,158.76,68.04,158.76,385.55,Single-ply,SBD,M
Boys,124.74+,9,Elijah Munoz,Carrizo Springs,131.09,95.25,68.04,117.93,281.23,Single-ply,SBD,M
Boys,124.74+,DQ,Chris Cobb,Somerset,137.44,,,,,Single-ply,SBD,M
Boys,124.74+,DQ,Carlos Ramirez-Garcia,San Antonio Memorial,155.58,192.78,95.25,,,Single-ply,SBD,M
Boys,124.74+,DQ,Drew Kirkpatrick,Uvalde,137.44,249.48,,192.78,,Single-ply,SBD,M
