Division,WeightClassKg,Place,Name,Team,BodyweightKg,Best3SquatKg,Best3BenchKg,Best3DeadliftKg,TotalKg,Equipment,Event,Sex
Boys,51.71,1,Justin Dowdy,Wills Point,50.8,147.42,97.52,161.03,405.97,Single-ply,SBD,M
Boys,51.71,2,Richard Lowrie,Kemp,50.26,111.13,70.31,122.47,303.91,Single-ply,SBD,M
Boys,51.71,3,Juan Hernández,Palmer,50.62,108.86,56.7,127.01,292.57,Single-ply,SBD,M
Boys,51.71,4,Tyler Lacy,South Garland,50.89,95.25,56.7,131.54,283.5,Single-ply,SBD,M
Boys,55.79,5,Simeon Blow,North Mesquite,51.89,90.72,52.16,117.93,260.82,Single-ply,SBD,M
Boys,51.71,6,Noah Vasquez,Palmer,45.9,88.45,52.16,90.72,231.33,Single-ply,SBD,M
Boys,51.71,7,Austin Siscoe,Commerce,51.44,81.65,49.9,81.65,213.19,Single-ply,SBD,M
Boys,51.71,8,Will Hooten,Red Oak Life,39.19,83.91,43.09,72.57,199.58,Single-ply,SBD,M
Boys,51.71,9,Trey Northcutt,Ferris,46.9,65.77,31.75,88.45,185.97,Single-ply,SBD,M
Boys,51.71,10,Beaux Eldred,Ferris,47.81,65.77,24.95,77.11,167.83,Single-ply,SBD,M
Boys,51.71,11,Cory Mcarth,Wills Point,39.37,43.09,38.56,68.04,149.69,Single-ply,SBD,M
Boys,55.79,1,Jordan Estell,North Mesquite,55.11,149.69,79.38,183.7,412.77,Single-ply,SBD,M
Boys,55.79,2,Arturo Jimenez,Ferris,53.71,120.2,61.23,129.27,310.71,Single-ply,SBD,M
Boys,55.79,3,Morgan Rhew,Sunnyvale,52.16,79.38,52.16,104.33,235.87,Single-ply,SBD,M
Boys,67.13,1,Jimmy Kimbrell,Kemp,60.06,142.88,77.11,167.83,387.82,Single-ply,SBD,M
Boys,59.87,2,Romandrey Manning,South Garland,58.15,127.01,79.38,147.42,353.8,Single-ply,SBD,M
Boys,59.87,3,Jordan Ramirez,Palmer,59.06,129.27,79.38,145.15,353.8,Single-ply,SBD,M
Boys,59.87,4,Christian Molales,Commerce,59.6,133.81,61.23,158.76,353.8,Single-ply,SBD,M
Boys,59.87,5,Cooper Gilliand,Royse City,57.33,115.67,74.84,158.76,349.27,Single-ply,SBD,M
Boys,67.13,6,Brayden Lopez,Commerce,60.1,131.54,68.04,133.81,333.39,Single-ply,SBD,M
Boys,59.87,7,Darius Jones,Dallas Life Oak Cliff,56.61,115.67,56.7,117.93,290.3,Single-ply,SBD,M
Boys,59.87,7,Darius Jones,Dallas Life Oak Cliff,56.61,115.67,56.7,117.93,290.3,Single-ply,SBD,M
Boys,67.13,1,A'Daireon Madlock,North Mesquite,66.22,199.58,79.38,210.92,489.88,Single-ply,SBD,M
Boys,67.13,2,Kacie Crossland,Kemp,66.68,188.24,97.52,195.04,480.81,Single-ply,SBD,M
Boys,67.13,3,Matt Rumbaugh,Commerce,64.14,176.9,97.52,176.9,451.32,Single-ply,SBD,M
Boys,67.13,4,Dominique Pierce,North Garland,66.22,161.03,90.72,165.56,417.3,Single-ply,SBD,M
Boys,67.13,5,Nick Matthews,Dallas Life Oak Cliff,66.68,149.69,77.11,181.44,408.23,Single-ply,SBD,M
Boys,67.13,5,Nick Matthews,Dallas Life Oak Cliff,66.68,149.69,77.11,181.44,408.23,Single-ply,SBD,M
Boys,67.13,6,Adrien Higginbothem,Mabank,63.68,156.49,92.99,154.22,403.7,Single-ply,SBD,M
Boys,67.13,7,Peter Garcia,South Garland,66.41,142.88,102.06,158.76,403.7,Single-ply,SBD,M
Boys,67.13,8,Andre Torres,Ferris,62.05,145.15,77.11,167.83,390.09,Single-ply,SBD,M
Boys,67.13,9,Denton Bridges,Terrell,65.86,133.81,102.06,151.95,387.82,Single-ply,SBD,M
Boys,67.13,10,Hector Crow,Palmer,64.23,124.74,90.72,167.83,383.29,Single-ply,SBD,M
Boys,67.13,11,Tim Lewis,North Mesquite,64.5,131.54,79.38,161.03,371.95,Single-ply,SBD,M
Boys,67.13,12,Albert Rheams,Ferris,63.23,136.08,77.11,151.95,365.14,Single-ply,SBD,M
Boys,67.13,13,Drayson Hipsher,Canton,66.95,117.93,63.5,174.63,356.07,Single-ply,SBD,M
Boys,67.13,14,Brady Manning,Mabank,66.32,124.74,83.91,138.35,347,Single-ply,SBD,M
Boys,67.13,15,Jackson Smith,Commerce,65.05,149.69,61.23,124.74,335.66,Single-ply,SBD,M
Boys,67.13,16,Ke'Un Mays,Terrell,63.96,106.59,83.91,142.88,333.39,Single-ply,SBD,M
Boys,67.13,17,Vernon Marrow,Wills Point,64.23,102.06,74.84,136.08,312.98,Single-ply,SBD,M
Boys,67.13,18,Trevor Harrell,Wills Point,61.96,92.99,74.84,136.08,303.91,Single-ply,SBD,M
Boys,67.13,19,Kelton Davis,South Garland,63.96,106.59,61.23,129.27,297.1,Single-ply,SBD,M
Boys,67.13,DQ,DeAndre Jones,Dallas Life Oak Cliff,62.78,,,,,Single-ply,SBD,M
Boys,67.13,DQ,DeAndre Jones,Dallas Life Oak Cliff,62.78,,,,,Single-ply,SBD,M
Boys,67.13,DQ,Calbert Hukil,Kemp,65.77,,,,,Single-ply,SBD,M
Boys,74.84,1,Cody Coldwell,Sunnyvale,74.39,233.6,120.2,206.38,560.19,Single-ply,SBD,M
Boys,74.84,2,Colt Conway,Mabank,74.84,215.46,122.47,197.31,535.24,Single-ply,SBD,M
Boys,74.84,3,Dominique McBride,North Mesquite,71.21,199.58,104.33,226.8,530.7,Single-ply,SBD,M
Boys,74.84,4,Jonathan Ennin,Sunnyvale,70.31,176.9,99.79,206.38,483.08,Single-ply,SBD,M
Boys,74.84,5,Tim Caradine,Terrell,74.3,163.29,102.06,190.51,455.86,Single-ply,SBD,M
Boys,74.84,6,Darrien Redd,Commerce,71.03,170.1,92.99,165.56,428.64,Single-ply,SBD,M
Boys,74.84,7,Frankie Mowete,South Garland,73.03,136.08,102.06,181.44,419.57,Single-ply,SBD,M
Boys,74.84,8,Tommy Norman,Mabank,69.31,151.95,106.59,158.76,417.3,Single-ply,SBD,M
Boys,74.84,9,Vincent Jordan,South Garland,68.31,140.61,90.72,181.44,412.77,Single-ply,SBD,M
Boys,74.84,10,Chris Pugh,Royse City,67.77,147.42,97.52,158.76,403.7,Single-ply,SBD,M
Boys,74.84,11,Bradley Brown,Canton,74.21,136.08,83.91,167.83,387.82,Single-ply,SBD,M
Boys,74.84,12,Alex Hernandez,Ferris,71.85,147.42,88.45,147.42,383.29,Single-ply,SBD,M
Boys,74.84,13,Kordell Tilley,Dallas Life Oak Cliff,72.76,142.88,79.38,154.22,376.48,Single-ply,SBD,M
Boys,74.84,13,Kordell Tilley,Dallas Life Oak Cliff,72.76,142.88,79.38,154.22,376.48,Single-ply,SBD,M
Boys,74.84,14,Desmond Boyd,Terrell,70.58,131.54,90.72,147.42,369.68,Single-ply,SBD,M
Boys,74.84,15,Michael Broyles,Canton,71.49,149.69,65.77,131.54,347,Single-ply,SBD,M
Boys,74.84,16,Tyler Hague,Canton,71.03,124.74,70.31,133.81,328.85,Single-ply,SBD,M
Boys,74.84,17,Dakota Hernandez,Palmer,74.03,108.86,74.84,142.88,326.59,Single-ply,SBD,M
Boys,74.84,18,Seth Massheder,Terrell,72.39,90.72,63.5,136.08,290.3,Single-ply,SBD,M
Boys,74.84,19,Jacob Smith,Red Oak Life,68.22,92.99,58.97,117.93,269.89,Single-ply,SBD,M
Boys,82.1,DQ,Brayton Lulloff,Wills Point,74.93,113.4,,,,Single-ply,SBD,M
Boys,82.1,1,Garrett Ferguson,Sunnyvale,78.02,204.12,122.47,215.46,542.04,Single-ply,SBD,M
Boys,82.1,2,Logan Thompson,Canton,82.01,174.63,131.54,185.97,492.15,Single-ply,SBD,M
Boys,82.1,3,Alan Quesada,Kemp,76.11,192.78,108.86,172.37,474,Single-ply,SBD,M
Boys,82.1,4,Mason Alcaraz,Red Oak Life,80.2,181.44,108.86,181.44,471.74,Single-ply,SBD,M
Boys,82.1,5,Austin Persons,North Garland,80.83,170.1,115.67,181.44,467.2,Single-ply,SBD,M
Boys,89.81,6,Thai Ton,North Garland,82.28,192.78,88.45,172.37,453.59,Single-ply,SBD,M
Boys,82.1,7,Daniel Secrease,Dallas Life Oak Cliff,81.01,170.1,106.59,165.56,442.25,Single-ply,SBD,M
Boys,82.1,7,Daniel Secrease,Dallas Life Oak Cliff,81.01,170.1,106.59,165.56,442.25,Single-ply,SBD,M
Boys,82.1,8,James Flowers,South Garland,77.29,142.88,113.4,181.44,437.72,Single-ply,SBD,M
Boys,82.1,9,Damien Garcia,Palmer,78.29,136.08,102.06,172.37,410.5,Single-ply,SBD,M
Boys,89.81,10,David Ramirez,Red Oak Life,82.19,156.49,83.91,163.29,403.7,Single-ply,SBD,M
Boys,82.1,11,Kelvin Ekhator,North Garland,76.93,154.22,79.38,163.29,396.89,Single-ply,SBD,M
Boys,82.1,12,Sean Minshew,Terrell,79.83,138.35,90.72,158.76,387.82,Single-ply,SBD,M
Boys,82.1,13,Josh Hull,Wills Point,75.84,113.4,79.38,145.15,337.93,Single-ply,SBD,M
Boys,82.1,DQ,Brian Black,Palmer,78.38,,,,,Single-ply,SBD,M
Boys,82.1,DQ,Dakota Marshall,Royse City,76.2,161.03,,,,Single-ply,SBD,M
Boys,82.1,DQ,Dillon Rayburn,Mabank,81.56,156.49,,,,Single-ply,SBD,M
Boys,89.81,1,Stacy Sublett,North Mesquite,82.92,231.33,106.59,233.6,571.53,Single-ply,SBD,M
Boys,89.81,2,Zane Koskelin,Mabank,86.36,215.46,138.35,215.46,569.26,Single-ply,SBD,M
Boys,99.79,3,Israel Delgadillo,Ferris,89.99,188.24,129.27,199.58,517.1,Single-ply,SBD,M
Boys,89.81,4,Maverick McDowell,Kemp,87.54,197.31,99.79,197.31,494.42,Single-ply,SBD,M
Boys,89.81,5,Harley Royal,Mabank,84.55,183.7,124.74,183.7,492.15,Single-ply,SBD,M
Boys,89.81,6,José Castillo,Sunnyvale,87.09,181.44,92.99,204.12,478.54,Single-ply,SBD,M
Boys,89.81,7,Taylor Little,Kemp,89.18,170.1,108.86,181.44,460.4,Single-ply,SBD,M
Boys,89.81,8,Kofi Obeng,North Garland,83.73,158.76,81.65,174.63,415.04,Single-ply,SBD,M
Boys,89.81,9,Desmund Brown,Terrell,85.82,149.69,92.99,172.37,415.04,Single-ply,SBD,M
Boys,89.81,10,Orlando Pineda,North Garland,86.55,161.03,88.45,149.69,399.16,Single-ply,SBD,M
Boys,89.81,11,Dalan Clowdus,Mabank,86.55,142.88,95.25,133.81,371.95,Single-ply,SBD,M
Boys,89.81,12,Blake Linscomb,Red Oak Life,84.28,142.88,70.31,154.22,367.41,Single-ply,SBD,M
Boys,89.81,13,Dustin Baker,Ferris,85,104.33,86.18,129.27,319.78,Single-ply,SBD,M
Boys,89.81,DQ,Nathaniel Lopez,Kemp,85.09,142.88,,,,Single-ply,SBD,M
Boys,89.81,DQ,Preston Stover,Red Oak Life,84.19,,,,,Single-ply,SBD,M
Boys,99.79,1,David Delgado,Kemp,97.52,204.12,136.08,185.97,526.17,Single-ply,SBD,M
Boys,99.79,2,Ezavian Franklin-Mosqueda,Dallas Life Oak Cliff,96.34,204.12,120.2,179.17,503.49,Single-ply,SBD,M
Boys,99.79,2,Ezavian Franklin-Mosqueda,Dallas Life Oak Cliff,96.34,204.12,120.2,179.17,503.49,Single-ply,SBD,M
Boys,99.79,3,Paxton Bertrand,Ferris,96.52,174.63,106.59,215.46,496.68,Single-ply,SBD,M
Boys,99.79,4,Kevin Poucil,North Mesquite,90.45,183.7,122.47,188.24,494.42,Single-ply,SBD,M
Boys,99.79,5,James Alanis,Ferris,94.71,170.1,102.06,215.46,487.61,Single-ply,SBD,M
Boys,99.79,6,Edwin Robles,North Garland,95.53,185.97,102.06,183.7,471.74,Single-ply,SBD,M
Boys,99.79,7,Tyrik Burton,Wills Point,91.72,154.22,117.93,192.78,464.93,Single-ply,SBD,M
Boys,99.79,8,Ben Settle,Sunnyvale,92.99,181.44,102.06,172.37,455.86,Single-ply,SBD,M
Boys,99.79,9,Kenny Jones,Ferris,98.97,156.49,117.93,163.29,437.72,Single-ply,SBD,M
Boys,99.79,10,Christian Alvarez,South Garland,97.52,149.69,106.59,165.56,421.84,Single-ply,SBD,M
Boys,99.79,11,Michael Banda,North Garland,93.08,158.76,99.79,142.88,401.43,Single-ply,SBD,M
Boys,99.79,12,Kade Norman,Mabank,92.53,151.95,102.06,142.88,396.89,Single-ply,SBD,M
Boys,99.79,DQ,Domingo Lucius,North Garland,98.61,174.63,,,,Single-ply,SBD,M
Boys,109.77,1,Jalon Scott,North Mesquite,106.59,265.35,131.54,272.16,669.05,Single-ply,SBD,M
Boys,109.77,2,Antonio Harris,Terrell,109.41,219.99,142.88,231.33,594.21,Single-ply,SBD,M
Boys,109.77,3,Chauncey Rich,Red Oak Life,106.05,238.14,142.88,210.92,591.94,Single-ply,SBD,M
Boys,109.77,4,Jermal Warren,Dallas Life Oak Cliff,104.51,201.85,156.49,183.7,542.04,Single-ply,SBD,M
Boys,109.77,4,Jermal Warren,Dallas Life Oak Cliff,104.51,201.85,156.49,183.7,542.04,Single-ply,SBD,M
Boys,109.77,5,Salvador Romero,North Garland,102.51,197.31,113.4,213.19,523.9,Single-ply,SBD,M
Boys,109.77,6,James Medley,Canton,104.14,204.12,120.2,197.31,521.63,Single-ply,SBD,M
Boys,109.77,7,Andrew Hardman,Wills Point,101.33,192.78,106.59,176.9,476.27,Single-ply,SBD,M
Boys,109.77,8,Elliot Lopez,Kemp,106.78,183.7,106.59,163.29,453.59,Single-ply,SBD,M
Boys,109.77,9,Oscar Marin,North Garland,102.69,170.1,99.79,179.17,449.06,Single-ply,SBD,M
Boys,109.77,10,Cesar Mancera,Ferris,103.78,161.03,97.52,154.22,412.77,Single-ply,SBD,M
Boys,124.74,11,Nick Handy,Commerce,109.86,142.88,61.23,158.76,362.87,Single-ply,SBD,M
Boys,109.77,12,Jacob Kinney,Ferris,105.14,156.49,70.31,127.01,353.8,Single-ply,SBD,M
Boys,124.74,1,Victor Mejia,Palmer,116.21,249.48,158.76,254.01,662.24,Single-ply,SBD,M
Boys,124.74,2,David Hogue,North Mesquite,122.02,231.33,131.54,219.99,582.87,Single-ply,SBD,M
Boys,124.74,3,Marquis Engrum,South Garland,118.12,208.65,124.74,235.87,569.26,Single-ply,SBD,M
Boys,124.74,4,Dameyon Howard,South Garland,111.22,188.24,129.27,226.8,544.31,Single-ply,SBD,M
Boys,124.74,5,Ja'Coby Paul,Terrell,119.48,197.31,142.88,199.58,539.77,Single-ply,SBD,M
Boys,124.74,6,Jiovanny Rubio,Sunnyvale,123.38,181.44,108.86,197.31,487.61,Single-ply,SBD,M
Boys,124.74,7,Noel Rojo,Mabank,115.3,183.7,117.93,183.7,485.34,Single-ply,SBD,M
Boys,124.74,8,Jonathan Amaro,Wills Point,120.02,185.97,113.4,181.44,480.81,Single-ply,SBD,M
Boys,124.74,9,Kamari Strong,South Garland,111.4,172.37,106.59,197.31,476.27,Single-ply,SBD,M
Boys,124.74,10,Nic Smith,Commerce,116.39,158.76,81.65,199.58,439.98,Single-ply,SBD,M
Boys,124.74,11,Juan Gomez,Ferris,122.47,167.83,83.91,163.29,415.04,Single-ply,SBD,M
Boys,124.74,12,Christian Jordan,Dallas Life Oak Cliff,123.83,147.42,92.99,154.22,394.63,Single-ply,SBD,M
Boys,124.74,12,Christian Jordan,Dallas Life Oak Cliff,123.83,147.42,92.99,154.22,394.63,Single-ply,SBD,M
Boys,124.74,13,Taylon Jackson,Commerce,117.03,142.88,79.38,149.69,371.95,Single-ply,SBD,M
Boys,124.74,DQ,Like Linebaugh,Kemp,113.31,226.8,,,,Single-ply,SBD,M
Boys,124.74+,1,Wade Cookston,Sunnyvale,138.35,249.48,183.7,249.48,682.66,Single-ply,SBD,M
Boys,124.74+,2,Eric Roberts,Terrell,138.8,247.21,140.61,208.65,596.47,Single-ply,SBD,M
Boys,124.74+,3,Keenan Ivory,Canton,146.15,240.4,124.74,215.46,580.6,Single-ply,SBD,M
Boys,124.74+,4,Dazmyne Coleman,North Mesquite,132.45,195.04,129.27,192.78,517.1,Single-ply,SBD,M
Boys,124.74+,5,Austin Fry,Royse City,141.52,183.7,113.4,183.7,480.81,Single-ply,SBD,M
Boys,124.74+,6,Troy Pemberton,Commerce,141.16,183.7,72.57,158.76,415.04,Single-ply,SBD,M
Boys,124.74+,7,Daveyon Barnes,Dallas Life Oak Cliff,156.22,151.95,70.31,161.03,383.29,Single-ply,SBD,M
Boys,124.74+,7,Daveyon Barnes,Dallas Life Oak Cliff,156.22,151.95,70.31,161.03,383.29,Single-ply,SBD,M
Boys,124.74+,8,Ruben Garcia,Ferris,144.97,120.2,72.57,147.42,340.19,Single-ply,SBD,M
Boys,124.74+,DQ,Tyler Roberson,Dallas Life Oak Cliff,159.21,,,,,Single-ply,SBD,M
Boys,124.74+,DQ,Tyler Roberson,Dallas Life Oak Cliff,159.21,,,,,Single-ply,SBD,M
Boys,124.74+,DQ,Alfredo Cervantes,Royse City,140.43,222.26,,,,Single-ply,SBD,M
