Division,WeightClassKg,Place,Name,Team,BodyweightKg,Best3SquatKg,Best3BenchKg,Best3DeadliftKg,TotalKg,Equipment,Event,Sex
Boys,51.71,1,Robert Barajas,Laredo Martin,51.26,172.37,77.11,190.51,439.98,Single-ply,SBD,M
Boys,51.71,2,Gilbert Sanchez,San Diego,51.26,154.22,99.79,145.15,399.16,Single-ply,SBD,M
Boys,51.71,3,Thomas Soto,Corpus Christi Calallen,50.8,147.42,65.77,163.29,376.48,Single-ply,SBD,M
Boys,51.71,4,Edward Davidson,Alice,51.62,102.06,65.77,124.74,292.57,Single-ply,SBD,M
Boys,51.71,5,Robert Ramos,Corpus Christi Tuloso-Midway,49.21,106.59,54.43,117.93,278.96,Single-ply,SBD,M
Boys,51.71,6,Bryan Priddy,Skidmore-Tynan,49.21,95.25,65.77,113.4,274.42,Single-ply,SBD,M
Boys,51.71,7,Jesse Maya,Carrizo Springs,49.21,97.52,56.7,90.72,244.94,Single-ply,SBD,M
Boys,51.71,8,Andy Torres,Gregory-Portland,49.9,90.72,43.09,99.79,233.6,Single-ply,SBD,M
Boys,51.71,DQ,Rafael Morales,Carrizo Springs,51.48,,,,,Single-ply,SBD,M
Boys,51.71,DQ,Martin Villareal,Laredo United South,51.26,,,,,Single-ply,SBD,M
Boys,55.79,1,Enrique Alvarez,Laredo Cigarroa,55.79,183.7,99.79,185.97,469.47,Single-ply,SBD,M
Boys,55.79,2,Amado De La Fuente,Laredo United South,55.57,149.69,92.99,174.63,417.3,Single-ply,SBD,M
Boys,55.79,3,Justin Breland,Banquete,55.57,149.69,99.79,165.56,415.04,Single-ply,SBD,M
Boys,55.79,4,Jeff Kearns,Gregory-Portland,55.79,145.15,86.18,172.37,403.7,Single-ply,SBD,M
Boys,59.87,5,Rogelio Santiago,Corpus Christi Calallen,56.02,117.93,79.38,181.44,378.75,Single-ply,SBD,M
Boys,55.79,6,Andrew Garlin,Skidmore-Tynan,55.57,136.08,92.99,142.88,371.95,Single-ply,SBD,M
Boys,59.87,7,David Saenz,Hebbronville,56.02,136.08,77.11,151.95,365.14,Single-ply,SBD,M
Boys,55.79,8,Robert Seward,Corpus Christi Calallen,53.98,113.4,74.84,167.83,356.07,Single-ply,SBD,M
Boys,55.79,9,Josh Lomas,Crystal City,54.2,113.4,77.11,127.01,317.51,Single-ply,SBD,M
Boys,55.79,10,Israel Granades,Laredo Nixon,55.79,108.86,58.97,127.01,294.84,Single-ply,SBD,M
Boys,55.79,11,Victor Vera,Kingsville King,53.75,70.31,43.09,106.59,219.99,Single-ply,SBD,M
Boys,55.79,DQ,Steven Garza,Crystal City,55.11,,,,,Single-ply,SBD,M
Boys,59.87,DQ,Felipe Medina,Zapata,56.02,,,,,Single-ply,SBD,M
Boys,55.79,DQ,Ediberto Vera,Mathis,54.43,,,,,Single-ply,SBD,M
Boys,59.87,1,William O'Bryan,Aransas Pass,59.65,192.78,120.2,174.63,487.61,Single-ply,SBD,M
Boys,59.87,2,Edgar Martinez,Laredo Cigarroa,59.78,188.24,92.99,190.51,471.74,Single-ply,SBD,M
Boys,59.87,3,Patrick Montellano,Crystal City,58.97,174.63,90.72,188.24,453.59,Single-ply,SBD,M
Boys,59.87,4,Austin Munoz,Freer,59.19,145.15,97.52,204.12,446.79,Single-ply,SBD,M
Boys,59.87,5,Marquis Barrolle,Ingleside,58.97,165.56,102.06,156.49,424.11,Single-ply,SBD,M
Boys,59.87,6,Aaron Gonzales,Mathis,59.42,156.49,81.65,176.9,415.04,Single-ply,SBD,M
Boys,59.87,7,Rico Rodriguez,San Diego,59.42,113.4,88.45,172.37,374.21,Single-ply,SBD,M
Boys,59.87,8,Justin Gonzalez,San Diego,58.51,158.76,83.91,129.27,371.95,Single-ply,SBD,M
Boys,59.87,9,Albert Salinas,Bishop,59.87,142.88,74.84,142.88,360.61,Single-ply,SBD,M
Boys,59.87,10,Jairo Morales,Laredo Cigarroa,58.97,136.08,56.7,158.76,351.53,Single-ply,SBD,M
Boys,59.87,11,Arnold Bueno,Banquete,59.19,131.54,79.38,133.81,344.73,Single-ply,SBD,M
Boys,59.87,12,Benito Salazar,Carrizo Springs,58.29,136.08,63.5,136.08,335.66,Single-ply,SBD,M
Boys,59.87,13,Matt Sanchez,Kingsville King,57.83,102.06,72.57,136.08,310.71,Single-ply,SBD,M
Boys,59.87,DQ,Raymond Lopez,Taft,59.65,,,,,Single-ply,SBD,M
Boys,67.13,1,Dalton Torres,Beeville Jones,66.45,224.53,122.47,197.31,544.31,Single-ply,SBD,M
Boys,67.13,2,Ryan Gomez,Corpus Christi Calallen,64.86,181.44,127.01,199.58,508.02,Single-ply,SBD,M
Boys,67.13,3,David Guzman,Taft,66.45,163.29,108.86,215.46,487.61,Single-ply,SBD,M
Boys,67.13,4,Rene Molina,Hebbronville,66.68,195.04,99.79,185.97,480.81,Single-ply,SBD,M
Boys,67.13,5,Eddie Garcia,Banquete,65.77,170.1,99.79,197.31,467.2,Single-ply,SBD,M
Boys,67.13,6,Arturo Cervantez,Crystal City,66.22,179.17,113.4,172.37,464.93,Single-ply,SBD,M
Boys,67.13,7,Vinny Flores,Zapata,67.04,156.49,113.4,195.04,464.93,Single-ply,SBD,M
Boys,74.84,8,Jp Escobar,Bishop,67.22,172.37,108.86,181.44,462.66,Single-ply,SBD,M
Boys,67.13,9,Matt Buentello,Corpus Christi Tuloso-Midway,66.9,181.44,97.52,176.9,455.86,Single-ply,SBD,M
Boys,67.13,10,Jared Reilly,Corpus Christi Calallen,66.68,176.9,92.99,181.44,451.32,Single-ply,SBD,M
Boys,67.13,11,Jay Trevino,Banquete,67.13,156.49,104.33,170.1,430.91,Single-ply,SBD,M
Boys,67.13,12,Moses Rios,Mathis,66.9,167.83,88.45,170.1,426.38,Single-ply,SBD,M
Boys,67.13,13,Eluid Renteria,Laredo Cigarroa,66.22,172.37,97.52,154.22,424.11,Single-ply,SBD,M
Boys,67.13,14,Andrew Cavazos,Corpus Christi West Oso,66.68,163.29,74.84,167.83,405.97,Single-ply,SBD,M
Boys,67.13,15,Josh Stich,Corpus Christi Tuloso-Midway,62.05,136.08,81.65,158.76,376.48,Single-ply,SBD,M
Boys,67.13,16,JD White,Skidmore-Tynan,66.68,147.42,81.65,147.42,376.48,Single-ply,SBD,M
Boys,67.13,17,Lorenzo Landin,Gregory-Portland,66.22,127.01,70.31,142.88,340.19,Single-ply,SBD,M
Boys,67.13,18,Adam Corvera,Falfurrias,61.6,115.67,95.25,122.47,333.39,Single-ply,SBD,M
Boys,67.13,19,Kyle Halderman,Gregory-Portland,63.5,108.86,77.11,142.88,328.85,Single-ply,SBD,M
Boys,67.13,20,Justin Sobczak,Corpus Christi Tuloso-Midway,67.13,131.54,61.23,131.54,324.32,Single-ply,SBD,M
Boys,67.13,21,Vincent Valdez,Aransas Pass,67.13,115.67,61.23,124.74,301.64,Single-ply,SBD,M
Boys,67.13,DQ,Roger Garcia,Banquete,61.23,,,,,Single-ply,SBD,M
Boys,67.13,DQ,Eliezer Gomez,Laredo United South,67.13,,,,,Single-ply,SBD,M
Boys,67.13,DQ,Cody Salinas,Riviera Kaufer,63.05,102.06,,,,Single-ply,SBD,M
Boys,67.13,DQ,Paul Lopez,Laredo United South,66.9,163.29,124.74,,,Single-ply,SBD,M
Boys,74.84,1,Ryan Torres,Gregory-Portland,74.16,208.65,133.81,222.26,564.72,Single-ply,SBD,M
Boys,74.84,2,Brandon Castillo,Corpus Christi Calallen,73.48,206.38,129.27,226.8,562.45,Single-ply,SBD,M
Boys,74.84,3,Carlton Ballard,Floresville,74.16,192.78,117.93,238.14,548.85,Single-ply,SBD,M
Boys,74.84,4,Javi Rojas,Kingsville King,74.16,188.24,115.67,229.06,532.97,Single-ply,SBD,M
Boys,74.84,5,Eduardo Salinas,Laredo Cigarroa,73.03,192.78,113.4,208.65,514.83,Single-ply,SBD,M
Boys,74.84,6,Andy Mohl,Corpus Christi Tuloso-Midway,72.12,195.04,133.81,183.7,512.56,Single-ply,SBD,M
Boys,74.84,7,Mario Davila,Aransas Pass,73.26,183.7,111.13,188.24,483.08,Single-ply,SBD,M
Boys,74.84,8,Alfredo Castillo,Zapata,74.03,179.17,122.47,181.44,483.08,Single-ply,SBD,M
Boys,82.1,9,Brandon Garza,Falfurrias,75.07,165.56,113.4,204.12,483.08,Single-ply,SBD,M
Boys,74.84,10,Jordon Boone,Kingsville King,73.71,165.56,108.86,190.51,464.93,Single-ply,SBD,M
Boys,74.84,11,Robert Leal,Corpus Christi Tuloso-Midway,73.71,174.63,106.59,172.37,453.59,Single-ply,SBD,M
Boys,74.84,12,Rey Lopez,Woodsboro,68.72,174.63,111.13,165.56,451.32,Single-ply,SBD,M
Boys,74.84,13,Austin Lofthouse,Corpus Christi Tuloso-Midway,71.67,156.49,83.91,185.97,426.38,Single-ply,SBD,M
Boys,74.84,14,Beto Chavaria,Alice,68.04,158.76,102.06,158.76,419.57,Single-ply,SBD,M
Boys,74.84,15,David Perez,Bishop,74.39,174.63,88.45,147.42,410.5,Single-ply,SBD,M
Boys,74.84,16,Noberto Garcia,Laredo Nixon,71.44,149.69,83.91,170.1,403.7,Single-ply,SBD,M
Boys,74.84,17,Jose Gonzalez,Alice,72.12,136.08,74.84,167.83,378.75,Single-ply,SBD,M
Boys,74.84,18,Pedro Garcia,Corpus Christi Tuloso-Midway,73.94,131.54,83.91,140.61,356.07,Single-ply,SBD,M
Boys,74.84,19,Tyler Vela,Riviera Kaufer,74.84,113.4,79.38,142.88,335.66,Single-ply,SBD,M
Boys,74.84,20,Dylan Vasquez,Falfurrias,72.12,99.79,74.84,131.54,306.17,Single-ply,SBD,M
Boys,74.84,DQ,Phillip Alvarez,George West,68.72,158.76,,,,Single-ply,SBD,M
Boys,74.84,DQ,Jose Cerda,Laredo Cigarroa,73.71,,,,,Single-ply,SBD,M
Boys,74.84,DQ,Matt Meave,Corpus Christi West Oso,70.31,,,,,Single-ply,SBD,M
Boys,74.84,DQ,Ryan Cisneros,Woodsboro,74.84,,,,,Single-ply,SBD,M
Boys,74.84,DQ,Alex Hernandez,Zapata,74.39,181.44,,,,Single-ply,SBD,M
Boys,74.84,DQ,Jermaih Puentes,Beeville Jones,73.03,210.92,122.47,217.72,,Single-ply,SBD,M
Boys,82.1,1,Justin Garcia,Alice,81.19,272.16,140.61,226.8,639.57,Single-ply,SBD,M
Boys,82.1,2,Marty Saenz,San Diego,75.98,231.33,120.2,247.21,598.74,Single-ply,SBD,M
Boys,82.1,3,Ryan Rodriguez,Odem,79.61,226.8,147.42,224.53,598.74,Single-ply,SBD,M
Boys,82.1,4,Jacob Castillo,Alice,81.19,224.53,142.88,208.65,576.06,Single-ply,SBD,M
Boys,82.1,5,Nocky Garza,Bishop,75.52,226.8,131.54,213.19,571.53,Single-ply,SBD,M
Boys,82.1,6,Kirk Salinas,Banquete,80.51,222.26,124.74,201.85,548.85,Single-ply,SBD,M
Boys,82.1,7,Ryan de la Cruz,Ben Bolt-Palito Blanco,82.1,213.19,120.2,215.46,548.85,Single-ply,SBD,M
Boys,82.1,8,Alex Tanguma,Corpus Christi Calallen,80.97,185.97,124.74,206.38,517.1,Single-ply,SBD,M
Boys,89.81,9,Ramsey Rivera,Corpus Christi West Oso,82.33,190.51,104.33,204.12,498.95,Single-ply,SBD,M
Boys,82.1,10,Fernando Flores,Corpus Christi Tuloso-Midway,82.1,151.95,97.52,204.12,453.59,Single-ply,SBD,M
Boys,82.1,11,Angel Pena,Falfurrias,79.38,161.03,95.25,156.49,412.77,Single-ply,SBD,M
Boys,82.1,12,Jesus Perez,Laredo Nixon,76.66,145.15,70.31,183.7,399.16,Single-ply,SBD,M
Boys,82.1,13,Joe Castillo,Corpus Christi West Oso,81.42,165.56,77.11,156.49,399.16,Single-ply,SBD,M
Boys,82.1,14,Faustino Alaniz,Banquete,77.56,131.54,92.99,163.29,387.82,Single-ply,SBD,M
Boys,82.1,15,Riley Richardson,Gregory-Portland,78.02,136.08,70.31,149.69,356.07,Single-ply,SBD,M
Boys,82.1,DQ,Joey Guana,Floresville,75.98,,,,,Single-ply,SBD,M
Boys,82.1,DQ,Jesus Espinoza,Alice,82.1,247.21,133.81,,,Single-ply,SBD,M
Boys,82.1,DQ,Cameron Handy,Corpus Christi Tuloso-Midway,79.83,224.53,,,,Single-ply,SBD,M
Boys,82.1,DQ,Philip Barrentos,Bishop,79.15,,,,,Single-ply,SBD,M
Boys,89.81,1,John Baldwin,Corpus Christi West Oso,85.96,263.08,138.35,226.8,628.23,Single-ply,SBD,M
Boys,89.81,2,Colton Williams,Port Lavaca Calhoun,88,247.21,142.88,233.6,623.69,Single-ply,SBD,M
Boys,89.81,3,Jose Saucedo,Port Lavaca Calhoun,86.64,238.14,156.49,215.46,610.08,Single-ply,SBD,M
Boys,89.81,4,Enrique Olachia,Port Lavaca Calhoun,87.09,213.19,127.01,219.99,560.19,Single-ply,SBD,M
Boys,89.81,5,Steven Chavez,Aransas Pass,87.09,233.6,129.27,190.51,553.38,Single-ply,SBD,M
Boys,89.81,6,Joey Perez,Crystal City,83.46,217.72,138.35,183.7,539.77,Single-ply,SBD,M
Boys,89.81,7,Chris Castillo,Corpus Christi Tuloso-Midway,85.73,199.58,108.86,206.38,514.83,Single-ply,SBD,M
Boys,89.81,8,Nick Pacheco,Bishop,87.32,215.46,83.91,204.12,503.49,Single-ply,SBD,M
Boys,89.81,9,Marco Balboa,Alice,89.81,188.24,113.4,197.31,498.95,Single-ply,SBD,M
Boys,89.81,10,Justin DeLeon,Mathis,88,201.85,92.99,197.31,492.15,Single-ply,SBD,M
Boys,89.81,11,Carlos Hernandez,Corpus Christi West Oso,83.91,185.97,117.93,185.97,489.88,Single-ply,SBD,M
Boys,89.81,12,Juan Rios,Crystal City,89.81,190.51,88.45,183.7,462.66,Single-ply,SBD,M
Boys,89.81,13,Joseph Garcia,Laredo Nixon,88,151.95,97.52,204.12,453.59,Single-ply,SBD,M
Boys,89.81,14,Ivan Gonzalez,Ben Bolt-Palito Blanco,88.68,163.29,104.33,181.44,449.06,Single-ply,SBD,M
Boys,89.81,15,Adrian Garcia,Corpus Christi West Oso,89.36,165.56,104.33,167.83,437.72,Single-ply,SBD,M
Boys,89.81,16,Luis Guerra,Bishop,83.91,165.56,88.45,181.44,435.45,Single-ply,SBD,M
Boys,89.81,17,JJ Vela,Falfurrias,82.78,147.42,88.45,154.22,390.09,Single-ply,SBD,M
Boys,89.81,DQ,David Carvajal,George West,82.55,167.83,,,,Single-ply,SBD,M
Boys,89.81,DQ,Carlos Munoz,Laredo Nixon,89.36,,92.99,,,Single-ply,SBD,M
Boys,89.81,DQ,Adrian Arredondo,Riviera Kaufer,89.36,136.08,,,,Single-ply,SBD,M
Boys,99.79,1,Alex Costilla,Falfurrias,90.26,265.35,163.29,235.87,664.51,Single-ply,SBD,M
Boys,99.79,2,Nathan Westbrook,Kingsville King,97.07,260.82,158.76,238.14,657.71,Single-ply,SBD,M
Boys,99.79,3,Lazaro Smith,Beeville Jones,90.49,265.35,142.88,242.67,650.91,Single-ply,SBD,M
Boys,99.79,4,Andres Castellanos,Corpus Christi Tuloso-Midway,96.84,267.62,133.81,249.48,650.91,Single-ply,SBD,M
Boys,99.79,5,Andres Costilla,Falfurrias,98.88,265.35,142.88,226.8,635.03,Single-ply,SBD,M
Boys,99.79,6,Jerry Nino,Laredo Martin,98.43,226.8,163.29,231.33,621.42,Single-ply,SBD,M
Boys,109.77,7,Tim Hicks,Port Lavaca Calhoun,100.02,249.48,149.69,219.99,619.15,Single-ply,SBD,M
Boys,99.79,8,Jesus Benavides,Ben Bolt-Palito Blanco,99.11,233.6,161.03,219.99,614.62,Single-ply,SBD,M
Boys,99.79,9,Justin Sosa,Zapata,92.99,233.6,145.15,222.26,601.01,Single-ply,SBD,M
Boys,99.79,10,Richy Lopez,Laredo United South,95.48,229.06,136.08,219.99,585.13,Single-ply,SBD,M
Boys,99.79,11,Israel Garcia,Kingsville King,97.98,226.8,120.2,210.92,557.92,Single-ply,SBD,M
Boys,99.79,12,Lucas Lopez,Ben Bolt-Palito Blanco,95.48,204.12,133.81,197.31,535.24,Single-ply,SBD,M
Boys,99.79,13,Jamie Menchaca,Carrizo Springs,91.85,195.04,136.08,192.78,523.9,Single-ply,SBD,M
Boys,99.79,14,Ruben Ramirez,Aransas Pass,94.12,192.78,115.67,197.31,505.76,Single-ply,SBD,M
Boys,99.79,15,Josh Perez,Sinton,96.16,197.31,138.35,165.56,501.22,Single-ply,SBD,M
Boys,99.79,16,Jon Garcia,Ben Bolt-Palito Blanco,99.34,190.51,124.74,183.7,498.95,Single-ply,SBD,M
Boys,99.79,17,Jesse Gomez,Kingsville King,95.93,176.9,117.93,195.04,489.88,Single-ply,SBD,M
Boys,99.79,18,Heriberto Canales,Hebbronville,91.17,176.9,102.06,201.85,480.81,Single-ply,SBD,M
Boys,99.79,19,Nick Trevino,Kingsville King,95.71,161.03,97.52,217.72,476.27,Single-ply,SBD,M
Boys,99.79,20,Eric Viafranco,Mathis,93.89,190.51,86.18,174.63,451.32,Single-ply,SBD,M
Boys,99.79,21,Donato Salinas,Skidmore-Tynan,99.79,174.63,117.93,158.76,451.32,Single-ply,SBD,M
Boys,99.79,22,Tony Ledesma,Riviera Kaufer,90.72,142.88,90.72,183.7,417.3,Single-ply,SBD,M
Boys,99.79,DQ,Joshua Pena,Odem,96.84,188.24,138.35,,,Single-ply,SBD,M
Boys,99.79,DQ,George Gonzalez,Laredo United South,91.85,,,,,Single-ply,SBD,M
Boys,99.79,DQ,Erick Fernandez,Laredo Nixon,99.34,,,,,Single-ply,SBD,M
Boys,109.77,DQ,Freddy Chavarria,Laredo Martin,100.02,267.62,,,,Single-ply,SBD,M
Boys,99.79,DQ,Bryan Chesser,George West,90.72,156.49,,,,Single-ply,SBD,M
Boys,99.79,DQ,Joseph Moore,George West,93.89,165.56,129.27,,,Single-ply,SBD,M
Boys,99.79,DQ,Zach Garcia,Alice,97.07,,,,,Single-ply,SBD,M
Boys,99.79,DQ,Marc Hinojosa,Bishop,90.49,136.08,,,,Single-ply,SBD,M
Boys,99.79,DQ,Dj Cowger,Bishop,99.34,210.92,,,,Single-ply,SBD,M
Boys,109.77,1,Cecilio Zarate,Corpus Christi West Oso,106.82,258.55,149.69,235.87,644.1,Single-ply,SBD,M
Boys,109.77,2,John Herrera,Banquete,104.78,256.28,140.61,244.94,641.83,Single-ply,SBD,M
Boys,109.77,3,Aaron Liserio,Mathis,107.95,272.16,122.47,222.26,616.89,Single-ply,SBD,M
Boys,109.77,4,Michael Dominguez,Hebbronville,107.5,233.6,124.74,244.94,603.28,Single-ply,SBD,M
Boys,124.74,5,Wylie Tisdale,Zapata,110,226.8,138.35,238.14,603.28,Single-ply,SBD,M
Boys,109.77,6,Cody Morris,Corpus Christi Calallen,102.74,249.48,115.67,235.87,601.01,Single-ply,SBD,M
Boys,124.74,7,Rafael Vasquez,Laredo United South,110,249.48,129.27,222.26,601.01,Single-ply,SBD,M
Boys,109.77,8,Jarred Longerot,Mathis,102.29,226.8,122.47,238.14,587.4,Single-ply,SBD,M
Boys,109.77,9,Steven Chapa,Kingsville King,106.59,247.21,149.69,188.24,585.13,Single-ply,SBD,M
Boys,109.77,10,Danny Cruz,Alice,108.18,235.87,111.13,233.6,580.6,Single-ply,SBD,M
Boys,124.74,11,Victor Martinez,Laredo Martin,110,247.21,136.08,195.04,578.33,Single-ply,SBD,M
Boys,109.77,12,Raul Hinojosa,Zapata,106.14,226.8,127.01,217.72,571.53,Single-ply,SBD,M
Boys,109.77,13,Justin Ybarra,Corpus Christi West Oso,108.18,249.48,113.4,192.78,555.65,Single-ply,SBD,M
Boys,109.77,14,Harley Vickers,Alice,106.14,226.8,131.54,181.44,539.77,Single-ply,SBD,M
Boys,109.77,15,Joseph Avitia,Ingleside,100.7,219.99,133.81,181.44,535.24,Single-ply,SBD,M
Boys,109.77,16,Esteban Resendez,Alice,103.87,206.38,120.2,195.04,521.63,Single-ply,SBD,M
Boys,109.77,17,Matt Watson,Corpus Christi Tuloso-Midway,105.01,188.24,113.4,181.44,483.08,Single-ply,SBD,M
Boys,109.77,18,Christian Garcia,Sinton,109.32,167.83,106.59,172.37,446.79,Single-ply,SBD,M
Boys,109.77,19,Michael Gortemiller,Aransas Pass,103.42,170.1,104.33,154.22,428.64,Single-ply,SBD,M
Boys,109.77,DQ,Trey Munoz,Ben Bolt-Palito Blanco,109.54,197.31,136.08,,,Single-ply,SBD,M
Boys,124.74,1,Frank Perez,Odem,116.12,226.8,183.7,204.12,614.62,Single-ply,SBD,M
Boys,124.74,2,Jose Molina,Skidmore-Tynan,117.03,240.4,145.15,215.46,601.01,Single-ply,SBD,M
Boys,124.74,3,Rudy Martinez,Laredo Nixon,122.47,229.06,124.74,206.38,560.19,Single-ply,SBD,M
Boys,124.74,4,Adrian Trinidad,Laredo United South,114.31,208.65,127.01,217.72,553.38,Single-ply,SBD,M
Boys,124.74,5,Jerrod Grantz,Aransas Pass,116.57,188.24,120.2,206.38,514.83,Single-ply,SBD,M
Boys,124.74,6,Antonio Galvan,Aransas Pass,110.45,231.33,106.59,174.63,512.56,Single-ply,SBD,M
Boys,124.74,7,Jamie Cardona,Laredo Nixon,112.94,217.72,97.52,192.78,508.02,Single-ply,SBD,M
Boys,124.74,8,Justin Trevino,Robstown,119.29,183.7,115.67,195.04,494.42,Single-ply,SBD,M
Boys,124.74,DQ,Daniel Gonzales,Robstown,121.11,,,,,Single-ply,SBD,M
Boys,124.74+,1,Matt Hernandez,Skidmore-Tynan,134.72,238.14,190.51,215.46,644.1,Single-ply,SBD,M
Boys,124.74+,2,Carlos Gomez,Laredo Martin,126.33,254.01,145.15,226.8,625.96,Single-ply,SBD,M
Boys,124.74+,3,Nune Perez,Crystal City,134.72,256.28,142.88,226.8,625.96,Single-ply,SBD,M
Boys,124.74+,4,Dylan Strickland,Corpus Christi Calallen,127.23,238.14,136.08,219.99,594.21,Single-ply,SBD,M
Boys,124.74+,5,Jonathan Saldana,Floresville,131.09,258.55,124.74,208.65,591.94,Single-ply,SBD,M
Boys,124.74+,6,Adam Aleman,Beeville Jones,149.01,254.01,136.08,197.31,587.4,Single-ply,SBD,M
Boys,124.74+,7,Larry Martinez,Floresville,138.35,240.4,129.27,210.92,580.6,Single-ply,SBD,M
Boys,124.74+,8,Blake Griffith,Floresville,127.01,258.55,122.47,192.78,573.79,Single-ply,SBD,M
Boys,124.74+,9,Steven Rodriguez,Corpus Christi Calallen,129.73,238.14,122.47,204.12,564.72,Single-ply,SBD,M
Boys,124.74+,10,Mario Alaniz,San Diego,125.19,210.92,115.67,226.8,553.38,Single-ply,SBD,M
Boys,124.74+,11,Joey Ybanez,Freer,138.35,190.51,129.27,222.26,542.04,Single-ply,SBD,M
Boys,124.74+,12,Gerardo Cadena,Laredo Cigarroa,162.84,181.44,102.06,170.1,453.59,Single-ply,SBD,M
Boys,124.74+,13,Arturo Pena,Robstown,151.05,179.17,99.79,140.61,419.57,Single-ply,SBD,M
