Division,WeightClassKg,Place,Name,Team,BodyweightKg,Best3SquatKg,Best3BenchKg,Best3DeadliftKg,TotalKg,Equipment,Event,Sex
Boys,51.71,1,Cody Henson,Abernathy,49.44,124.74,70.31,147.42,342.46,Single-ply,SBD,M
Boys,51.71,2,Toby Crabb,Slaton,50.53,88.45,65.77,106.59,260.82,Single-ply,SBD,M
Boys,55.79,1,Pablo Mendoza,Sundown,54.88,142.88,70.31,156.49,369.68,Single-ply,SBD,M
Boys,55.79,2,Brennan Riker,Post,54.7,147.42,83.91,129.27,360.61,Single-ply,SBD,M
Boys,55.79,3,Tay Tay Flowers,Slaton,55.25,113.4,61.23,136.08,310.71,Single-ply,SBD,M
Boys,55.79,4,Robert Soliz,Sundown,52.12,115.67,56.7,115.67,288.03,Single-ply,SBD,M
Boys,55.79,5,Haidin LeClear,Farwell,55.79,99.79,49.9,108.86,258.55,Single-ply,SBD,M
Boys,59.87,1,Truman Richerson,Abernathy,59.78,142.88,81.65,147.42,371.95,Single-ply,SBD,M
Boys,59.87,2,Landon Simmons,Slaton,59.69,142.88,83.91,142.88,369.68,Single-ply,SBD,M
Boys,59.87,3,Carlos Perez #3,Sundown,56.84,124.74,68.04,154.22,347,Single-ply,SBD,M
Boys,59.87,4,Aaron Cortez,Abernathy,58.97,120.2,68.04,138.35,326.59,Single-ply,SBD,M
Boys,59.87,5,Mark Reyna,Sundown,59.87,108.86,65.77,131.54,306.17,Single-ply,SBD,M
Boys,59.87,6,Neftali Valdez,Post,56.93,108.86,54.43,124.74,288.03,Single-ply,SBD,M
Boys,59.87,7,Lane Wilson,Sudan,57.33,95.25,58.97,120.2,274.42,Single-ply,SBD,M
Boys,59.87,8,AJ Gonzales,Olton,57.83,70.31,45.36,113.4,229.06,Single-ply,SBD,M
Boys,67.13,1,Ben Flores,Abernathy,66.68,170.1,97.52,176.9,444.52,Single-ply,SBD,M
Boys,67.13,2,Grayson Drake,Sundown,66.63,165.56,79.38,172.37,417.3,Single-ply,SBD,M
Boys,67.13,3,Chris Rader,Slaton,65.86,145.15,86.18,167.83,399.16,Single-ply,SBD,M
Boys,67.13,4,Eddy Betencourt,Slaton,65.54,127.01,88.45,181.44,396.89,Single-ply,SBD,M
Boys,67.13,5,Zach Gallarneau,Lubbock Cooper,66.59,145.15,79.38,145.15,369.68,Single-ply,SBD,M
Boys,67.13,6,Case Garrett,Lubbock Roosevelt,65.41,108.86,97.52,147.42,353.8,Single-ply,SBD,M
Boys,67.13,7,Avel Sinklier,Abernathy,61.69,133.81,77.11,127.01,337.93,Single-ply,SBD,M
Boys,67.13,8,Noah Reilly,Abernathy,63.46,131.54,72.57,131.54,335.66,Single-ply,SBD,M
Boys,67.13,9,Pablo Guerrero,Olton,65.73,113.4,74.84,136.08,324.32,Single-ply,SBD,M
Boys,67.13,10,Paxtyn Gwin,Tahoka,62.46,117.93,72.57,131.54,322.05,Single-ply,SBD,M
Boys,67.13,11,Adrian Bustillos,Muleshoe,63.05,124.74,70.31,120.2,315.25,Single-ply,SBD,M
Boys,67.13,12,Mark Casias,Lubbock Roosevelt,61.64,106.59,68.04,122.47,297.1,Single-ply,SBD,M
Boys,67.13,13,Fabian Lozano,Farwell,61.96,104.33,72.57,120.2,297.1,Single-ply,SBD,M
Boys,67.13,14,Joseph George,Tahoka,66.59,99.79,54.43,127.01,281.23,Single-ply,SBD,M
Boys,67.13,15,Thomas Sullivan,Tahoka,62.14,90.72,49.9,122.47,263.08,Single-ply,SBD,M
Boys,67.13,16,Gavin Rutherford,Farwell,63.37,95.25,54.43,111.13,260.82,Single-ply,SBD,M
Boys,74.84,1,Blake Hulse,Sundown,74.84,226.8,117.93,229.06,573.79,Single-ply,SBD,M
Boys,74.84,2,Alexander Herevia,Tahoka,74.12,188.24,111.13,210.92,510.29,Single-ply,SBD,M
Boys,74.84,3,Kingsley Rodriguez,Seagraves,72.53,192.78,111.13,204.12,508.02,Single-ply,SBD,M
Boys,74.84,4,Cade Conway,Sundown,67.9,174.63,108.86,170.1,453.59,Single-ply,SBD,M
Boys,74.84,5,Izaih Landa,Post,73.62,174.63,111.13,167.83,453.59,Single-ply,SBD,M
Boys,74.84,6,Jesus Rivera,Abernathy,69.9,176.9,111.13,142.88,430.91,Single-ply,SBD,M
Boys,74.84,7,Malik Hamilton,Tahoka,71.03,151.95,83.91,192.78,428.64,Single-ply,SBD,M
Boys,74.84,8,George Flores,Abernathy,72.57,151.95,111.13,165.56,428.64,Single-ply,SBD,M
Boys,74.84,9,Omar Rodriguez,Sundown,71.89,156.49,104.33,165.56,426.38,Single-ply,SBD,M
Boys,74.84,10,Israel Vasquez,Muleshoe,71.44,161.03,90.72,170.1,421.84,Single-ply,SBD,M
Boys,74.84,11,Diego Hernandez,Sundown,72.94,142.88,99.79,174.63,417.3,Single-ply,SBD,M
Boys,74.84,12,Diego Maldonado,Slaton,73.39,156.49,90.72,156.49,403.7,Single-ply,SBD,M
Boys,74.84,13,Brandon Kenley,Sundown,70.4,138.35,79.38,167.83,385.55,Single-ply,SBD,M
Boys,74.84,14,Michael Scoggin,Tahoka,72.94,120.2,74.84,156.49,351.53,Single-ply,SBD,M
Boys,74.84,15,Nick Quintana,Post,74.53,127.01,72.57,129.27,328.85,Single-ply,SBD,M
Boys,74.84,16,Bradley Baldridge,Sundown,72.71,115.67,70.31,133.81,319.78,Single-ply,SBD,M
Boys,74.84,17,Ethan Fox,Post,72.62,108.86,70.31,111.13,290.3,Single-ply,SBD,M
Boys,74.84,18,Carlos Castillo,Farwell,69.17,106.59,70.31,111.13,288.03,Single-ply,SBD,M
Boys,74.84,19,Nick Caffey,Lubbock Roosevelt,73.62,88.45,63.5,120.2,272.16,Single-ply,SBD,M
Boys,74.84,20,Landon Pevey,Post,67.99,88.45,70.31,102.06,260.82,Single-ply,SBD,M
Boys,82.1,1,Keanu Villareal,Lockney,82.05,183.7,145.15,183.7,512.56,Single-ply,SBD,M
Boys,82.1,2,Carson Rush,Lubbock Cooper,80.6,192.78,90.72,174.63,458.13,Single-ply,SBD,M
Boys,82.1,3,Silas Urrurtia,Lockney,79.61,165.56,120.2,167.83,453.59,Single-ply,SBD,M
Boys,82.1,4,Sergio Guerrero,Olton,81.01,176.9,104.33,167.83,449.06,Single-ply,SBD,M
Boys,82.1,5,Alex Conley,Sudan,81.92,165.56,117.93,161.03,444.52,Single-ply,SBD,M
Boys,82.1,6,Jj Diaz,Lubbock Roosevelt,79.61,147.42,108.86,172.37,428.64,Single-ply,SBD,M
Boys,82.1,7,Beto Diaz,Sudan,76.43,149.69,92.99,172.37,415.04,Single-ply,SBD,M
Boys,82.1,8,Manual Soto,Tahoka,79.2,149.69,79.38,176.9,405.97,Single-ply,SBD,M
Boys,82.1,9,John Cortez,Abernathy,79.38,156.49,81.65,158.76,396.89,Single-ply,SBD,M
Boys,82.1,10,Nehemiah Montoya,Lockney,76.11,142.88,83.91,147.42,374.21,Single-ply,SBD,M
Boys,82.1,11,Dylan Quintero,Tahoka,76.11,133.81,74.84,154.22,362.87,Single-ply,SBD,M
Boys,82.1,12,Justin Self,Post,77.66,124.74,86.18,147.42,358.34,Single-ply,SBD,M
Boys,82.1,13,Caleb Pritchard,Lockney,81.47,147.42,77.11,117.93,342.46,Single-ply,SBD,M
Boys,82.1,14,Alex Tew,Tahoka,78.52,111.13,68.04,145.15,324.32,Single-ply,SBD,M
Boys,89.81,1,Nicodemus Ayala,Tahoka,88.72,204.12,124.74,195.04,523.9,Single-ply,SBD,M
Boys,89.81,2,Manuel Ramos,Bovina,84.37,181.44,127.01,208.65,517.1,Single-ply,SBD,M
Boys,89.81,3,Logan Pipkin,Lubbock Cooper,86.73,192.78,115.67,195.04,503.49,Single-ply,SBD,M
Boys,89.81,4,Tyler Hairston,Lubbock Cooper,82.83,192.78,106.59,190.51,489.88,Single-ply,SBD,M
Boys,89.81,5,Logan Duncan,Lubbock Cooper,88.68,190.51,111.13,188.24,489.88,Single-ply,SBD,M
Boys,89.81,6,Diego Azua,Lockney,89.77,170.1,124.74,190.51,485.34,Single-ply,SBD,M
Boys,89.81,7,Gavin Richardson,Sundown,86.14,170.1,113.4,197.31,480.81,Single-ply,SBD,M
Boys,89.81,8,Austin Callaway,Abernathy,89.58,163.29,95.25,183.7,442.25,Single-ply,SBD,M
Boys,89.81,9,Jonathan Golightly,Sundown,86.86,170.1,102.06,165.56,437.72,Single-ply,SBD,M
Boys,89.81,10,Tj Payne,Slaton,89.36,167.83,79.38,172.37,419.57,Single-ply,SBD,M
Boys,89.81,11,Cole Boren,Post,89.18,158.76,115.67,142.88,417.3,Single-ply,SBD,M
Boys,89.81,12,Stephen Cortez,Abernathy,88,149.69,97.52,165.56,412.77,Single-ply,SBD,M
Boys,89.81,13,Rj Gatica,Abernathy,85.05,154.22,77.11,165.56,396.89,Single-ply,SBD,M
Boys,89.81,14,Nathaniel Resendez,Tahoka,82.6,154.22,70.31,158.76,383.29,Single-ply,SBD,M
Boys,89.81,15,Colton McCarty,Tahoka,89.54,124.74,74.84,151.95,351.53,Single-ply,SBD,M
Boys,99.79,1,Zach Bocanegra,Lubbock Cooper,97.66,249.48,154.22,226.8,630.49,Single-ply,SBD,M
Boys,99.79,2,Jeremy L Hernandez,Sundown,99.7,219.99,115.67,233.6,569.26,Single-ply,SBD,M
Boys,99.79,3,JR Paiz,Sundown,94.71,219.99,122.47,199.58,542.04,Single-ply,SBD,M
Boys,99.79,4,Bryson Leaks,Abernathy,97.52,192.78,117.93,192.78,503.49,Single-ply,SBD,M
Boys,99.79,5,Gabe Cisneros,Sudan,99.34,181.44,102.06,170.1,453.59,Single-ply,SBD,M
Boys,99.79,6,Adrian Sital,Sudan,92.35,142.88,106.59,181.44,430.91,Single-ply,SBD,M
Boys,99.79,7,Brian Davilla,Sudan,94.53,142.88,99.79,158.76,401.43,Single-ply,SBD,M
Boys,99.79,8,Shipley Callahan,Abernathy,96.16,142.88,95.25,138.35,376.48,Single-ply,SBD,M
Boys,99.79,9,Ramon Guerrero,Olton,91.53,92.99,61.23,90.72,244.94,Single-ply,SBD,M
Boys,109.77,1,Gabriel Chavez,Olton,101.65,254.01,136.08,213.19,603.28,Single-ply,SBD,M
Boys,109.77,2,Miguel Lara,Lockney,108.5,217.72,122.47,222.26,562.45,Single-ply,SBD,M
Boys,109.77,3,JC Pedroza,Olton,107.05,204.12,124.74,206.38,535.24,Single-ply,SBD,M
Boys,109.77,4,Andrew Sanchez,Lockney,107.46,170.1,127.01,188.24,485.34,Single-ply,SBD,M
Boys,109.77,5,Christian Reyna,Tahoka,108.77,170.1,79.38,172.37,421.84,Single-ply,SBD,M
Boys,109.77,6,Eli Alvarez,Lockney,102.1,136.08,90.72,131.54,358.34,Single-ply,SBD,M
Boys,109.77,7,Javier Flowers,Slaton,104.19,122.47,77.11,127.01,326.59,Single-ply,SBD,M
Boys,124.74,1,Jacob Vasquez,Lubbock Cooper,111.22,219.99,136.08,224.53,580.6,Single-ply,SBD,M
Boys,124.74,2,Isaiah Sanchez,Lubbock Cooper,117.71,188.24,111.13,183.7,483.08,Single-ply,SBD,M
Boys,124.74,3,Juan Herrera,Sundown,122.2,183.7,92.99,176.9,453.59,Single-ply,SBD,M
Boys,124.74,4,Jj Garcia,Sundown,111.49,188.24,106.59,154.22,449.06,Single-ply,SBD,M
Boys,124.74,5,Chris Jackson,Post,124.47,142.88,120.2,165.56,428.64,Single-ply,SBD,M
Boys,124.74,6,Will Mott,Slaton,113.9,124.74,79.38,124.74,328.85,Single-ply,SBD,M
Boys,124.74,7,Ryan Olivan,Tahoka,116.07,104.33,65.77,117.93,288.03,Single-ply,SBD,M
Boys,124.74+,1,Taye Perez,Post,130.73,215.46,117.93,206.38,539.77,Single-ply,SBD,M
Boys,124.74+,2,Cameron Hastings,Sundown,143.52,226.8,124.74,174.63,526.17,Single-ply,SBD,M
Boys,124.74+,3,Javen Diaz,Post,140.52,206.38,108.86,190.51,505.76,Single-ply,SBD,M
Boys,124.74+,4,Ayden Visage,Lubbock Cooper,136.62,188.24,120.2,185.97,494.42,Single-ply,SBD,M
Boys,124.74+,5,Jose Ibarra,Lubbock Cooper,135.13,208.65,106.59,172.37,487.61,Single-ply,SBD,M
Boys,124.74+,6,Chase Rodriguez,Lubbock Cooper,147.46,188.24,108.86,163.29,460.4,Single-ply,SBD,M
Boys,124.74+,DQ,Jacob Obenhaus,Tahoka,135.94,181.44,,,,Single-ply,SBD,M
