Division,WeightClassKg,Place,Name,Team,BodyweightKg,Best3SquatKg,Best3BenchKg,Best3DeadliftKg,TotalKg,Equipment,Event,Sex
Freshmen,51.71,1,Jose Cantu,Rio Grande City,44.18,63.5,38.56,86.18,188.24,Single-ply,SBD,M
Freshmen,51.71,2,Juan Martinez,Laredo Nixon,49.26,56.7,38.56,81.65,176.9,Single-ply,SBD,M
Freshmen,51.71,DQ,Joseph Saucedo,Laredo United,49.35,74.84,,,,Single-ply,SBD,M
Freshmen,51.71,DQ,Jaime Garcia,Laredo United,51.44,90.72,,,,Single-ply,SBD,M
Freshmen,55.79,1,Josh Baez,Falfurrias,53.89,92.99,68.04,102.06,263.08,Single-ply,SBD,M
Freshmen,55.79,DQ,Trey White,Laredo United South,55.34,79.38,,,,Single-ply,SBD,M
Freshmen,59.87,1,Jonathan Pena,Laredo United South,57.24,104.33,79.38,138.35,322.05,Single-ply,SBD,M
Freshmen,59.87,2,Hector de la Rosa,Laredo United South,59.06,106.59,58.97,142.88,308.44,Single-ply,SBD,M
Freshmen,59.87,3,Ramon Huerta,Falfurrias,59.87,102.06,63.5,138.35,303.91,Single-ply,SBD,M
Freshmen,59.87,4,Courtney Anderson,San Marcos,57.61,102.06,68.04,120.2,290.3,Single-ply,SBD,M
Freshmen,67.13,5,Rudy Ramos,Laredo Nixon,60.1,65.77,56.7,122.47,244.94,Single-ply,SBD,M
Freshmen,59.87,6,Kevin Davila,Falfurrias,59.6,79.38,52.16,104.33,235.87,Single-ply,SBD,M
Freshmen,67.13,1,David Herrera,Laredo United South,64.05,108.86,63.5,147.42,319.78,Single-ply,SBD,M
Freshmen,67.13,2,Ricardo Torres,Rio Grande City,63.87,108.86,72.57,108.86,290.3,Single-ply,SBD,M
Freshmen,67.13,3,David Marquez,Laredo Nixon,63.41,106.59,54.43,124.74,285.76,Single-ply,SBD,M
Freshmen,67.13,4,Damian Selvera,Laredo Nixon,65.14,81.65,65.77,115.67,263.08,Single-ply,SBD,M
Freshmen,67.13,5,Joel Benavides,Laredo United South,60.42,79.38,54.43,124.74,258.55,Single-ply,SBD,M
Freshmen,67.13,6,Marc Cerda,Laredo United,65.05,90.72,52.16,115.67,258.55,Single-ply,SBD,M
Freshmen,74.84,1,Enrique Gonzalez,Laredo United,74.66,108.86,97.52,151.95,358.34,Single-ply,SBD,M
Freshmen,74.84,2,Gavino Perez,Falfurrias,73.03,106.59,79.38,142.88,328.85,Single-ply,SBD,M
Freshmen,74.84,3,Jesus Barrera,Laredo United South,70.76,106.59,43.09,136.08,285.76,Single-ply,SBD,M
Freshmen,74.84,4,Lucas Mora,Falfurrias,72.85,90.72,47.63,142.88,281.23,Single-ply,SBD,M
Freshmen,74.84,5,Heraldo Solis,Rio Grande City,68.76,86.18,56.7,117.93,260.82,Single-ply,SBD,M
Freshmen,82.1,1,Joshua Mercado,San Marcos,80.74,133.81,102.06,151.95,387.82,Single-ply,SBD,M
Freshmen,82.1,2,Greg Diaz,Rio Grande City,77.2,138.35,81.65,149.69,369.68,Single-ply,SBD,M
Freshmen,82.1,3,Jorge Cardenas,Laredo United,78.02,136.08,74.84,147.42,358.34,Single-ply,SBD,M
Freshmen,82.1,4,Jose Fuentes,Laredo United,77.29,136.08,61.23,140.61,337.93,Single-ply,SBD,M
Freshmen,89.81,1,Andrew Garza,Falfurrias,85.91,124.74,97.52,170.1,392.36,Single-ply,SBD,M
Freshmen,89.81,DQ,Danny Cardona,Laredo United,89.36,113.4,,,,Single-ply,SBD,M
Freshmen,99.79,1,Marco Banda,Laredo Nixon,95.8,183.7,108.86,142.88,435.45,Single-ply,SBD,M
Freshmen,99.79,2,Agustin Lara,Laredo United South,96.34,90.72,95.25,167.83,353.8,Single-ply,SBD,M
Freshmen,99.79,DQ,Anthony Flores,Laredo United,98.88,124.74,,,,Single-ply,SBD,M
Freshmen,109.77,1,Elhim Hernandez,Laredo United,108.32,158.76,95.25,170.1,424.11,Single-ply,SBD,M
Freshmen,109.77,2,Juan Gonzalez,Laredo United,107.59,102.06,83.91,140.61,326.59,Single-ply,SBD,M
Freshmen,124.74,1,Bobby Pulido,Falfurrias,119.93,170.1,124.74,181.44,476.27,Single-ply,SBD,M
Freshmen,124.74,2,Gerardo Gonzalez,Laredo Nixon,121.11,142.88,95.25,147.42,385.55,Single-ply,SBD,M
Freshmen,124.74,3,Joshua Urrutia,San Marcos,110.22,90.72,70.31,113.4,274.42,Single-ply,SBD,M
Freshmen,124.74+,1,Rudy Flores,Laredo United South,134.26,183.7,120.2,204.12,508.02,Single-ply,SBD,M
Freshmen,124.74+,2,Homero Tuscano,Rio Grande City,133.17,183.7,79.38,183.7,446.79,Single-ply,SBD,M
Freshmen,,NS,Jimmy Garza,Rio Grande City,,,,,,Single-ply,SBD,M
Freshmen,,NS,David Garza,Rio Grande City,,,,,,Single-ply,SBD,M
Freshmen,,NS,Daniel Hernandez,Rio Grande City,,,,,,Single-ply,SBD,M
Freshmen,,NS,Ruben Morales,Rio Grande City,,,,,,Single-ply,SBD,M
Freshmen,,NS,Santos Bautista,Rio Grande City,,,,,,Single-ply,SBD,M
Freshmen,,NS,Jaime Lopez,Rio Grande City,,,,,,Single-ply,SBD,M
Freshmen,,NS,Quintin Bumgardner,San Marcos,,,,,,Single-ply,SBD,M
Freshmen,,NS,Joshua Heiser,San Marcos,,,,,,Single-ply,SBD,M
Boys,55.79,1,Martin Villarreal,Laredo United South,51.89,145.15,79.38,176.9,401.43,Single-ply,SBD,M
Boys,51.71,NS,Ramirez Luis,Laredo Cigarroa,,,,,,Single-ply,SBD,M
Boys,55.79,1,Thomas Mascorro,San Marcos,55.43,158.76,102.06,170.1,430.91,Single-ply,SBD,M
Boys,55.79,2,Edgar Barbosa,Laredo Cigarroa,55.16,181.44,83.91,142.88,408.23,Single-ply,SBD,M
Boys,55.79,3,Eric Oliva,Laredo United South,53.98,151.95,90.72,154.22,396.89,Single-ply,SBD,M
Boys,55.79,4,Fidel Quiroz,Laredo United,55.43,113.4,63.5,113.4,290.3,Single-ply,SBD,M
Boys,59.87,1,David Lopez,Laredo United South,59.6,154.22,113.4,181.44,449.06,Single-ply,SBD,M
Boys,67.13,2,Mario Cantu,Laredo Cigarroa,60.06,163.29,92.99,181.44,437.72,Single-ply,SBD,M
Boys,67.13,3,Carlos Vedarte,Laredo United South,60.06,167.83,90.72,165.56,424.11,Single-ply,SBD,M
Boys,67.13,4,Ted Crain,Falfurrias,60.06,170.1,74.84,170.1,415.04,Single-ply,SBD,M
Boys,67.13,5,Jairo Morales,Laredo Cigarroa,60.06,140.61,81.65,174.63,396.89,Single-ply,SBD,M
Boys,67.13,6,Luis Mendoza,Laredo Martin,59.96,136.08,74.84,163.29,374.21,Single-ply,SBD,M
Boys,67.13,1,Cesar Alfaro,Laredo United South,64.68,185.97,129.27,192.78,508.02,Single-ply,SBD,M
Boys,74.84,2,Fermin Rendon,Laredo Nixon,67.22,181.44,99.79,195.04,476.27,Single-ply,SBD,M
Boys,67.13,3,Jose Mosqueda,Laredo Cigarroa,67.13,147.42,72.57,174.63,394.63,Single-ply,SBD,M
Boys,67.13,4,Alex Villarreal,Laredo Nixon,65.14,151.95,83.91,154.22,390.09,Single-ply,SBD,M
Boys,67.13,5,Marcos Casas,Falfurrias,61.33,136.08,79.38,158.76,374.21,Single-ply,SBD,M
Boys,67.13,6,Robert Hernandez,San Marcos,66.04,124.74,81.65,154.22,360.61,Single-ply,SBD,M
Boys,74.84,7,Jose Carrillo,Laredo Johnson,67.36,136.08,83.91,122.47,342.46,Single-ply,SBD,M
Boys,67.13,8,Alex Rincon,Laredo Nixon,66.77,90.72,65.77,115.67,272.16,Single-ply,SBD,M
Boys,67.13,NS,Albert Estrada,Laredo Martin,,,,,,Single-ply,SBD,M
Boys,74.84,DQ,Eddie Suarez,San Marcos,69.67,,,,,Single-ply,SBD,M
Boys,74.84,2,Edgar Mendiola,Laredo Nixon,74.3,188.24,127.01,217.72,532.97,Single-ply,SBD,M
Boys,74.84,3,Elijio Montalvo,Falfurrias,69.49,204.12,106.59,217.72,528.44,Single-ply,SBD,M
Boys,74.84,4,Rudy Leon,Laredo United South,74.75,179.17,104.33,226.8,510.29,Single-ply,SBD,M
Boys,74.84,5,Edgar Trejo,Laredo United South,74.84,165.56,113.4,192.78,471.74,Single-ply,SBD,M
Boys,74.84,6,Felipe Hernández,Laredo United,70.67,195.04,106.59,163.29,464.93,Single-ply,SBD,M
Boys,74.84,7,Estevan Alfaro,Bruni,72.67,163.29,88.45,201.85,453.59,Single-ply,SBD,M
Boys,74.84,8,Marcus Cortez,Falfurrias,74.3,156.49,120.2,172.37,449.06,Single-ply,SBD,M
Boys,74.84,9,David Reyes,Laredo Martin,74.57,176.9,88.45,174.63,439.98,Single-ply,SBD,M
Boys,82.1,10,Sergio Garcia,Laredo Nixon,74.93,172.37,92.99,158.76,424.11,Single-ply,SBD,M
Boys,74.84,11,Javier Botello,Laredo Nixon,73.21,115.67,79.38,147.42,342.46,Single-ply,SBD,M
Boys,74.84,DQ,Cesar Cortez,Laredo Nixon,74.3,147.42,,,,Single-ply,SBD,M
Boys,74.84,DQ,Frank Saucedo,Laredo United,73.48,188.24,,,,Single-ply,SBD,M
Boys,82.1,1,Joel Elizondo,Zapata,78.83,185.97,115.67,204.12,505.76,Single-ply,SBD,M
Boys,82.1,2,Victor Ramos,Laredo United South,81.92,183.7,113.4,206.38,503.49,Single-ply,SBD,M
Boys,82.1,3,Dylan Vasquez,Falfurrias,78.11,192.78,102.06,206.38,501.22,Single-ply,SBD,M
Boys,82.1,4,Daniel Briones,Laredo United South,79.38,181.44,104.33,195.04,480.81,Single-ply,SBD,M
Boys,82.1,5,Christian Garza,Falfurrias,78.38,158.76,106.59,185.97,451.32,Single-ply,SBD,M
Boys,82.1,6,Diego Chapa,Laredo Cigarroa,80.29,170.1,86.18,181.44,437.72,Single-ply,SBD,M
Boys,82.1,7,Juan Guerra,Laredo Nixon,76.75,142.88,104.33,163.29,410.5,Single-ply,SBD,M
Boys,82.1,NS,Adrian Munoz,Laredo Martin,,,,,,Single-ply,SBD,M
Boys,82.1,NS,Benito Orozco,Laredo Martin,,,,,,Single-ply,SBD,M
Boys,99.79,1,Jose Jr Vela,Falfurrias,89.9,249.48,117.93,222.26,589.67,Single-ply,SBD,M
Boys,89.81,2,Alfredo Ibarra,Laredo United,86.09,235.87,117.93,201.85,555.65,Single-ply,SBD,M
Boys,89.81,3,Oscar Mohammed,Laredo United,88,192.78,108.86,185.97,487.61,Single-ply,SBD,M
Boys,89.81,4,David Galvan,Laredo Cigarroa,83.64,165.56,92.99,195.04,453.59,Single-ply,SBD,M
Boys,89.81,5,Frank Garcia,Laredo Martin,82.78,181.44,83.91,174.63,439.98,Single-ply,SBD,M
Boys,99.79,6,Zachary Smith,Bruni,89.99,138.35,88.45,154.22,381.02,Single-ply,SBD,M
Boys,99.79,1,Jose Coreas,Laredo Cigarroa,94.8,254.01,124.74,229.06,607.81,Single-ply,SBD,M
Boys,109.77,2,Guadalupe Gonzalez,Zapata,99.97,240.4,122.47,219.99,582.87,Single-ply,SBD,M
Boys,99.79,3,Mark Duron,Laredo Martin,98.97,226.8,136.08,210.92,573.79,Single-ply,SBD,M
Boys,99.79,4,Carlos Munoz,Laredo Nixon,94.98,204.12,104.33,222.26,530.7,Single-ply,SBD,M
Boys,99.79,5,John Vargas,Falfurrias,98.52,190.51,122.47,183.7,496.68,Single-ply,SBD,M
Boys,99.79,6,Angel Pena,Falfurrias,92.26,185.97,104.33,192.78,483.08,Single-ply,SBD,M
Boys,109.77,7,Silvestre Bustamante,Zapata,99.97,174.63,117.93,174.63,467.2,Single-ply,SBD,M
Boys,99.79,8,Hector Mendoza,Laredo Nixon,90.9,163.29,117.93,102.06,383.29,Single-ply,SBD,M
Boys,109.77,1,Victor Martinez,Laredo Martin,109.68,281.23,165.56,215.46,662.24,Single-ply,SBD,M
Boys,109.77,2,Leron Hutto,San Marcos,101.24,226.8,113.4,242.67,582.87,Single-ply,SBD,M
Boys,109.77,3,Ricky Martinez,Laredo United,108.14,254.01,133.81,181.44,569.26,Single-ply,SBD,M
Boys,109.77,4,Clarence Burdett,Falfurrias,108.05,206.38,147.42,197.31,551.11,Single-ply,SBD,M
Boys,109.77,5,Edgar Martinez,Laredo United South,100.33,195.04,108.86,219.99,523.9,Single-ply,SBD,M
Boys,109.77,6,Jesse Benavides,San Marcos,108.77,206.38,113.4,192.78,512.56,Single-ply,SBD,M
Boys,109.77,7,Orlando Rodriguez,Laredo Cigarroa,101.42,190.51,102.06,190.51,483.08,Single-ply,SBD,M
Boys,109.77,8,Paul Gonzalez,Laredo United South,101.7,154.22,129.27,197.31,480.81,Single-ply,SBD,M
Boys,109.77,9,Victor Nenque,Laredo Nixon,104.87,185.97,99.79,158.76,444.52,Single-ply,SBD,M
Boys,109.77,10,Miguel Davila,Falfurrias,101.97,115.67,81.65,131.54,328.85,Single-ply,SBD,M
Boys,109.77,NS,Justin Hernandez,Laredo Nixon,,,,,,Single-ply,SBD,M
Boys,109.77,DQ,Santos Alvarado,Laredo United,102.6,208.65,,,,Single-ply,SBD,M
Boys,124.74,1,Frank Villareal,Laredo Martin,111.31,272.16,136.08,210.92,619.15,Single-ply,SBD,M
Boys,124.74,2,Francisco Moreno,Zapata,112.13,238.14,104.33,226.8,569.26,Single-ply,SBD,M
Boys,124.74,3,Gilbert Hernandez,Laredo Cigarroa,117.66,185.97,111.13,174.63,471.74,Single-ply,SBD,M
Boys,124.74,NS,Jaime Cardona,Laredo Nixon,,,,,,Single-ply,SBD,M
Boys,124.74+,1,Jose Flores,Laredo Cigarroa,143.52,276.69,136.08,222.26,635.03,Single-ply,SBD,M
Boys,124.74+,2,Eduardo Sanchez,Zapata,130.09,217.72,138.35,192.78,548.85,Single-ply,SBD,M
Boys,124.74+,3,Edward Garza,Laredo Johnson,136.08,213.19,122.47,208.65,544.31,Single-ply,SBD,M
Boys,124.74+,4,Jacob Chapa,Bruni,126.37,231.33,108.86,183.7,523.9,Single-ply,SBD,M
Boys,124.74+,5,Cam Menchaca,Falfurrias,147.78,99.79,83.91,136.08,319.78,Single-ply,SBD,M
Boys,,NS,Oliver Chapa,Bruni,,,,,,Single-ply,SBD,M
Boys,,NS,Randy Castillo,Bruni,,,,,,Single-ply,SBD,M
Boys,,NS,Joel Lopez,Bruni,,,,,,Single-ply,SBD,M
Boys,,NS,Liam McMahon,Bruni,,,,,,Single-ply,SBD,M
Boys,,NS,Eliseo Bernal,Laredo Johnson,,,,,,Single-ply,SBD,M
Boys,,NS,Jesus Vasquez,Laredo Johnson,,,,,,Single-ply,SBD,M
Boys,,NS,Cesar Segeda,Laredo Johnson,,,,,,Single-ply,SBD,M
Boys,,NS,Jorge Gutierrez,Zapata,,,,,,Single-ply,SBD,M
Boys,,NS,Juan Jasso,Zapata,,,,,,Single-ply,SBD,M
Boys,,NS,Jake Gutierrez,Zapata,,,,,,Single-ply,SBD,M
Boys,,NS,Francisco Fuentes,Zapata,,,,,,Single-ply,SBD,M
Boys,,NS,Mike Alvarez,Zapata,,,,,,Single-ply,SBD,M
Boys,,NS,Joseph Reyes,Falfurrias,,,,,,Single-ply,SBD,M
Boys,,NS,Jorge Martinez,Laredo United,,,,,,Single-ply,SBD,M
Boys,,NS,Ac Martinez,Laredo United,,,,,,Single-ply,SBD,M
Boys,,NS,Jose Herrera,Laredo United,,,,,,Single-ply,SBD,M
Boys,,NS,Jj Cadena,Laredo United,,,,,,Single-ply,SBD,M
Boys,,NS,Rudy Davila,Laredo United,,,,,,Single-ply,SBD,M
