Division,WeightClassKg,Place,Name,Team,BodyweightKg,Best3SquatKg,Best3BenchKg,Best3DeadliftKg,TotalKg,Equipment,Event,Sex
Girls,44.23,1,Rebekah Bratcher,Canton,43.36,111.13,47.63,102.06,260.82,Single-ply,SBD,F
Girls,44.23,2,Jade Buckley,Rusk,42.46,83.91,40.82,88.45,213.19,Single-ply,SBD,F
Girls,44.23,3,Caley Starkes,Mabank,43.45,70.31,29.48,70.31,170.1,Single-ply,SBD,F
Girls,44.23,4,Lindsey Hendricks,Crandall,38.19,58.97,20.41,79.38,158.76,Single-ply,SBD,F
Girls,44.23,5,Maddie Marlor,Mabank,42.55,61.23,31.75,61.23,154.22,Single-ply,SBD,F
Girls,44.23,6,Genesis Loredo,Brownsboro,40.1,54.43,20.41,61.23,136.08,Single-ply,SBD,F
Girls,44.23,7,Myrka Diaz,Ferris,38.37,49.9,22.68,61.23,133.81,Single-ply,SBD,F
Girls,47.85,1,Kelsey Green,Bullard,47.63,127.01,61.23,111.13,299.37,Single-ply,SBD,F
Girls,47.85,2,Marci Whittington,Canton,47.17,108.86,56.7,111.13,276.69,Single-ply,SBD,F
Girls,47.85,3,Kelsey Clark,Mabank,46.99,102.06,47.63,99.79,249.48,Single-ply,SBD,F
Girls,47.85,4,Meghan Phillips,Wills Point,47.81,95.25,47.63,106.59,249.48,Single-ply,SBD,F
Girls,47.85,5,Gena Stotts,Mabank,47.08,104.33,47.63,92.99,244.94,Single-ply,SBD,F
Girls,47.85,6,Marisol Ariciaga,Athens,46.9,97.52,47.63,97.52,242.67,Single-ply,SBD,F
Girls,47.85,7,Katelynn Shehane,Quinlan Ford,47.45,102.06,43.09,90.72,235.87,Single-ply,SBD,F
Girls,47.85,8,Kerstin Knight,Crandall,47.63,79.38,34.02,90.72,204.12,Single-ply,SBD,F
Girls,47.85,9,Nikki Lira,Athens,47.63,77.11,36.29,90.72,204.12,Single-ply,SBD,F
Girls,47.85,10,Michaela Redding,Canton,46.45,72.57,36.29,74.84,183.7,Single-ply,SBD,F
Girls,47.85,DQ,Chloe Wilson,Fairfield,46.99,74.84,43.09,,,Single-ply,SBD,F
Girls,47.85,DQ,Lucy Reveles,Mabank,45.63,,,,,Single-ply,SBD,F
Girls,51.94,1,Sydney Stewart,Canton,50.53,115.67,61.23,115.67,292.57,Single-ply,SBD,F
Girls,51.94,2,Megan Ellis,Canton,51.8,108.86,52.16,120.2,281.23,Single-ply,SBD,F
Girls,51.94,3,Katerionna Gary,Paris,51.53,113.4,47.63,108.86,269.89,Single-ply,SBD,F
Girls,51.94,4,Callie Wycough,Canton,51.07,106.59,52.16,106.59,265.35,Single-ply,SBD,F
Girls,51.94,5,Shelby Vestal,Canton,51.17,102.06,43.09,106.59,251.74,Single-ply,SBD,F
Girls,51.94,6,Sam O'Bier,Wills Point,50.44,99.79,43.09,106.59,249.48,Single-ply,SBD,F
Girls,51.94,7,Rachel Green,Brownsboro,51.71,102.06,47.63,99.79,249.48,Single-ply,SBD,F
Girls,51.94,8,Jacee Callens,Bullard,50.89,97.52,38.56,106.59,242.67,Single-ply,SBD,F
Girls,51.94,9,Erin Reeder,Mabank,48.44,92.99,49.9,88.45,231.33,Single-ply,SBD,F
Girls,51.94,DQ,Libby Berry,Rusk,50.26,,,,,Single-ply,SBD,F
Girls,51.94,DQ,Kayla Honea,Brownsboro,51.44,,,,,Single-ply,SBD,F
Girls,56.02,1,Mallorie Sander,Palestine,55.79,151.95,56.7,129.27,337.93,Single-ply,SBD,F
Girls,56.02,2,Bri Alexander,Paris,55.79,131.54,68.04,127.01,326.59,Single-ply,SBD,F
Girls,56.02,3,Madi Bass,Canton,54.52,127.01,54.43,136.08,317.51,Single-ply,SBD,F
Girls,56.02,4,Bea Colunga,Emory Rains,54.16,115.67,58.97,124.74,299.37,Single-ply,SBD,F
Girls,56.02,5,Savannah Robinson,Fairfield,53.98,127.01,49.9,117.93,294.84,Single-ply,SBD,F
Girls,56.02,6,Kadeja Jefferson,Rusk,54.61,117.93,54.43,122.47,294.84,Single-ply,SBD,F
Girls,56.02,7,Katy Neystel,Canton,55.52,120.2,47.63,111.13,278.96,Single-ply,SBD,F
Girls,56.02,8,Tiffanie Haan,Paris,53.89,117.93,58.97,95.25,272.16,Single-ply,SBD,F
Girls,56.02,DQ,Justice Storey,Canton,54.7,117.93,58.97,,,Single-ply,SBD,F
Girls,56.02,DQ,Kenzee Sanders,Canton,54.98,,,,,Single-ply,SBD,F
Girls,56.02,DQ,Emily Millender,Brownsboro,55.43,,,,,Single-ply,SBD,F
Girls,56.02,DQ,Wendi Pacheco,Athens,55.52,,,,,Single-ply,SBD,F
Girls,60.1,1,Kylie Conner,Canton,59.33,122.47,54.43,142.88,319.78,Single-ply,SBD,F
Girls,60.1,2,Coy Cambridge,Kaufman,58.33,120.2,54.43,120.2,294.84,Single-ply,SBD,F
Girls,60.1,3,Justice Oates,Fairfield,58.6,124.74,47.63,106.59,278.96,Single-ply,SBD,F
Girls,60.1,4,Candace Jackson,Crandall,56.7,108.86,56.7,111.13,276.69,Single-ply,SBD,F
Girls,60.1,5,Gabby Willis,Rusk,59.96,113.4,47.63,113.4,274.42,Single-ply,SBD,F
Girls,60.1,6,Lorna Henderson,Canton,57.06,108.86,47.63,111.13,267.62,Single-ply,SBD,F
Girls,60.1,7,Claudia Young,Bullard,58.51,104.33,49.9,111.13,265.35,Single-ply,SBD,F
Girls,60.1,8,Emilee Rogers,Canton,59.87,106.59,49.9,108.86,265.35,Single-ply,SBD,F
Girls,60.1,9,Michaela Rowan,Mabank,57.52,108.86,49.9,102.06,260.82,Single-ply,SBD,F
Girls,60.1,10,Madison Schick,Fairfield,58.79,102.06,49.9,104.33,256.28,Single-ply,SBD,F
Girls,60.1,DQ,Bre Rose,Canton,59.24,151.95,77.11,,,Single-ply,SBD,F
Girls,60.1,DQ,Kristi Dooley,Quinlan Ford,59.33,,,,,Single-ply,SBD,F
Girls,67.36,1,Taylor Spiller,Bullard,65.23,170.1,65.77,149.69,385.55,Single-ply,SBD,F
Girls,67.36,2,Talor Parker,Emory Rains,64.68,161.03,63.5,154.22,378.75,Single-ply,SBD,F
Girls,67.36,3,Kennedy Key,Bullard,63.41,158.76,65.77,149.69,374.21,Single-ply,SBD,F
Girls,67.36,4,Ashley Hernandez,Brownsboro,65.59,147.42,72.57,113.4,333.39,Single-ply,SBD,F
Girls,67.36,5,Emily Pittman,Bullard,63.23,131.54,49.9,136.08,317.51,Single-ply,SBD,F
Girls,67.36,6,Shelby Haley,Mabank,65.05,122.47,65.77,129.27,317.51,Single-ply,SBD,F
Girls,67.36,7,Rylee Hudspeth,Center,64.68,104.33,54.43,131.54,290.3,Single-ply,SBD,F
Girls,67.36,8,Lori Neil,Fairfield,65.86,113.4,61.23,106.59,281.23,Single-ply,SBD,F
Girls,67.36,9,Madi Lindsey,Canton,64.86,111.13,52.16,115.67,278.96,Single-ply,SBD,F
Girls,67.36,10,Brennan Barnett,Crandall,64.95,113.4,49.9,113.4,276.69,Single-ply,SBD,F
Girls,67.36,11,Deja Sikes,Paris,64.77,95.25,58.97,108.86,263.08,Single-ply,SBD,F
Girls,67.36,DQ,Lacey Boney,Fairfield,65.95,,,,,Single-ply,SBD,F
Girls,67.36,DQ,LeAndra Bevans,Brownsboro,66.95,,,,,Single-ply,SBD,F
Girls,75.07,1,Stephanie Brown,Wills Point,74.66,181.44,74.84,181.44,437.72,Single-ply,SBD,F
Girls,75.07,2,Lyndsey Pate,Emory Rains,68.22,136.08,77.11,142.88,356.07,Single-ply,SBD,F
Girls,75.07,3,Riley Clifton,Emory Rains,73.48,154.22,65.77,133.81,353.8,Single-ply,SBD,F
Girls,75.07,4,TaDasia Anderson,Bullard,69.4,147.42,52.16,138.35,337.93,Single-ply,SBD,F
Girls,75.07,5,Taylor Stone,Quinlan Ford,73.21,138.35,68.04,131.54,337.93,Single-ply,SBD,F
Girls,75.07,6,Alyssa Spence,Canton,72.03,136.08,58.97,136.08,331.12,Single-ply,SBD,F
Girls,75.07,7,Sarah Martin,Canton,70.67,127.01,58.97,138.35,324.32,Single-ply,SBD,F
Girls,75.07,8,Sherra Holt,Tyler Chapel Hill,73.94,133.81,47.63,138.35,319.78,Single-ply,SBD,F
Girls,75.07,9,Michaela McGeary,Fairfield,72.76,129.27,56.7,131.54,317.51,Single-ply,SBD,F
Girls,75.07,10,Romie Castilleja,Diboll,69.67,124.74,49.9,131.54,306.17,Single-ply,SBD,F
Girls,75.07,11,Chandler UpChurch,Pollok Central,73.21,108.86,54.43,142.88,306.17,Single-ply,SBD,F
Girls,75.07,12,Breanna Vasquez,Palestine,68.04,120.2,54.43,115.67,290.3,Single-ply,SBD,F
Girls,82.33,1,Erica Vellinga,Quinlan Ford,80.1,149.69,70.31,151.95,371.95,Single-ply,SBD,F
Girls,82.33,2,Lexie Selman,Crandall,79.92,138.35,70.31,149.69,358.34,Single-ply,SBD,F
Girls,82.33,3,Zariah Vinson,Diboll,78.2,117.93,61.23,149.69,328.85,Single-ply,SBD,F
Girls,82.33,4,Hannah Darter,Emory Rains,75.3,124.74,65.77,131.54,322.05,Single-ply,SBD,F
Girls,82.33,5,Kay'd Lamar,Paris,81.1,129.27,65.77,111.13,306.17,Single-ply,SBD,F
Girls,82.33,6,Alene Ramos,Ferris,80.56,127.01,56.7,117.93,301.64,Single-ply,SBD,F
Girls,82.33,7,Rachel Grubbs,Brownsboro,81.56,138.35,52.16,99.79,290.3,Single-ply,SBD,F
Girls,82.33,8,Bree Thompson,Athens,75.21,108.86,56.7,122.47,288.03,Single-ply,SBD,F
Girls,82.33,9,Azlynn Mitchell,Emory Rains,79.02,108.86,61.23,113.4,283.5,Single-ply,SBD,F
Girls,82.33,10,Meagan Galan,Pollok Central,79.83,97.52,47.63,124.74,269.89,Single-ply,SBD,F
Girls,82.33,DQ,Kameron Rogers,Ferris,78.38,124.74,49.9,,,Single-ply,SBD,F
Girls,82.33,DQ,Arlinda Luckey,Texarkana Liberty-Eylau,78.02,,,,,Single-ply,SBD,F
Girls,90.04,1,Lacey Tillis,Palestine,88.72,154.22,70.31,179.17,403.7,Single-ply,SBD,F
Girls,90.04,2,Olivia Rodriguez,Bullard,83.01,174.63,72.57,142.88,390.09,Single-ply,SBD,F
Girls,90.04,3,Cheyenne Huddleston,Wills Point,88.72,147.42,56.7,142.88,347,Single-ply,SBD,F
Girls,90.04,4,Kirbee Taylor,Emory Rains,88,133.81,77.11,131.54,342.46,Single-ply,SBD,F
Girls,90.04,5,Sarah Mayne,Van,88.36,147.42,65.77,129.27,342.46,Single-ply,SBD,F
Girls,90.04,6,Mariah Castillo,Palestine,85.64,129.27,52.16,115.67,297.1,Single-ply,SBD,F
Girls,90.04,7,Mia McGill,Tyler Chapel Hill,88.45,113.4,54.43,117.93,285.76,Single-ply,SBD,F
Girls,90.04,8,Ashlynn Stewart,Athens,87.63,106.59,56.7,120.2,283.5,Single-ply,SBD,F
Girls,90.04,9,Payton Ditmars,Crandall,88.54,102.06,45.36,124.74,272.16,Single-ply,SBD,F
Girls,90.04,10,Ingrid Castaneda,Athens,87,111.13,56.7,102.06,269.89,Single-ply,SBD,F
Girls,90.04,11,Tatum Aguilar,Huntington,87,102.06,47.63,115.67,265.35,Single-ply,SBD,F
Girls,90.04,12,Jennifer Arreola,Ferris,88.27,104.33,56.7,102.06,263.08,Single-ply,SBD,F
Girls,100.02,1,Ashlyn Reece,Huntington,98.61,201.85,79.38,161.03,442.25,Single-ply,SBD,F
Girls,100.02,2,Deana Lane,Mabank,97.89,154.22,90.72,140.61,385.55,Single-ply,SBD,F
Girls,100.02,3,Sierra McCoy,Crandall,95.44,161.03,63.5,147.42,371.95,Single-ply,SBD,F
Girls,100.02,4,Jessica Hill,Fairfield,97.89,158.76,70.31,142.88,371.95,Single-ply,SBD,F
Girls,100.02,5,Rachel Andrews,Center,99.06,147.42,65.77,133.81,347,Single-ply,SBD,F
Girls,100.02,6,Teresa Tudor,Mineola,97.43,120.2,65.77,136.08,322.05,Single-ply,SBD,F
Girls,100.02,7,Brianna Bussey,Diboll,95.35,120.2,47.63,131.54,299.37,Single-ply,SBD,F
Girls,100.02,8,Alex Hieden,Crandall,95.07,111.13,43.09,127.01,281.23,Single-ply,SBD,F
Girls,100.02,9,Callie Eubanks,Van,97.7,113.4,47.63,102.06,263.08,Single-ply,SBD,F
Girls,100.02,DQ,Hailey Stanford,Rusk,99.88,,,,,Single-ply,SBD,F
Girls,100.02,DQ,Alishia Garcia,Huntington,97.61,,,,,Single-ply,SBD,F
Girls,100.02,DQ,Savanna Wilson,Brownsboro,97.61,140.61,61.23,,,Single-ply,SBD,F
Girls,100.02,DQ,Analhi Martinez,Crandall,98.34,,,,,Single-ply,SBD,F
Girls,100.02+,1,Adaija Criss,Tyler Chapel Hill,110.68,183.7,86.18,170.1,439.98,Single-ply,SBD,F
Girls,100.02+,2,Priscilla Wallace,Tyler Chapel Hill,138.8,185.97,86.18,165.56,437.72,Single-ply,SBD,F
Girls,100.02+,3,Becca Roberts,Van,141.25,204.12,79.38,154.22,437.72,Single-ply,SBD,F
Girls,100.02+,4,Ali Lombas,Emory Rains,152.68,195.04,70.31,149.69,415.04,Single-ply,SBD,F
Girls,100.02+,5,CeCe Monmouth,Athens,129.18,158.76,83.91,147.42,390.09,Single-ply,SBD,F
Girls,100.02+,6,ShaTerra Swint,Diboll,121.11,145.15,68.04,108.86,322.05,Single-ply,SBD,F
Girls,100.02+,7,Ashley Coleman,Diboll,103.24,131.54,52.16,136.08,319.78,Single-ply,SBD,F
Girls,100.02+,8,Leigha Enslow,Van,122.11,131.54,52.16,133.81,317.51,Single-ply,SBD,F
Girls,100.02+,9,Ariana Josiah,Crandall,122.92,122.47,49.9,124.74,297.1,Single-ply,SBD,F
Girls,100.02+,10,Chelsea Lawerence,Center,147.05,95.25,65.77,106.59,267.62,Single-ply,SBD,F
