Place,Sex,Event,Equipment,Tested,WeightClassKg,CyrillicName,Name,Division,BirthDate,BodyweightKg,Country,Squat1Kg,Squat2Kg,Squat3Kg,Squat4Kg,Best3SquatKg,Bench1Kg,Bench2Kg,Bench3Kg,Bench4Kg,Best3BenchKg,Deadlift1Kg,Deadlift2Kg,Deadlift3Kg,Deadlift4Kg,Best3DeadliftKg,TotalKg
1,F,SBD,Wraps,Yes,48,Екатерина Романова,Yekaterina Romanova,18-19,1990-08-28,44.6,Russia,50,60,67.5,,67.5,35,-40,-40,,35,65,-77.5,-80,,65,167.5
1,F,SBD,Wraps,Yes,48,Марина Савенкова,Marina Savenkova,Open,1979-07-03,47.7,Russia,-67.5,70,77.5,,77.5,37.5,40,-42.5,,40,117.5,125,-132.5,,125,242.5
1,F,SBD,Wraps,Yes,52,Юлиана Куксевич,Yuliana Kuksevich,20-23,1987-04-19,49.8,Russia,60,65,70,72.5,70,30,32.5,-35,,32.5,85,90,95,97.5,95,197.5
1,F,SBD,Wraps,Yes,52,Елена Ткачева,Yelena Tkacheva,Open,1984-03-18,49.6,Russia,75,-85,85,,85,45,50,52.5,,52.5,85,100,-105,,100,237.5
2,F,SBD,Wraps,Yes,52,Олеся Коротаева,Olesia Korotaeva,Open,1983-03-22,51.95,Russia,60,65,70,,70,35,40,-42.5,,40,85,90,-95,,90,200
1,F,SBD,Wraps,Yes,56,Светлана Малецкая,Svetlana Maletskaya,Open,1983-06-04,54.8,Russia,85,-90.5,-90.5,,85,47.5,50,-52.5,,50,95,100.5,102.5,105.5,102.5,237.5
1,F,SBD,Wraps,Yes,67.5,Юлия Семенова,Yuliya Semenova,20-23,1988-05-03,67.5,Russia,85,90,92.5,,92.5,37.5,40,-42.5,,40,115,-125,-125,,115,247.5
1,F,SBD,Wraps,Yes,67.5,Алина Михайлова,Alina Mikhailova,Open,1983-02-09,66.4,Russia,82.5,87.5,90,,90,35,37.5,-40,,37.5,100,107.5,112.5,,112.5,240
1,M,SBD,Wraps,Yes,52,Дмитрий Кучерявенко,Dmitry Kucheryavenko,13-15,1994-04-18,44.5,Russia,65,70,75.5,,75.5,37.5,40,-42.5,,40,-105.5,105.5,,,105.5,221
1,M,SBD,Wraps,Yes,60,Алексей Сорокин,Alexei Sorokin,16-17,1992-10-12,59.4,Russia,100,105,-112.5,,105,65,70,72.5,,72.5,140,150,160.5,,160.5,337.5
2,M,SBD,Wraps,Yes,60,Михаил Ткаченко,Mikhail Tkachenko,16-17,1993-06-13,60,Russia,-105,110,-115,,110,75,80,85,,85,120,130,135,,135,330
1,M,SBD,Wraps,Yes,60,Игорь Кузнецов,Igor Kuznetsov,20-23,1989-08-17,59.15,Russia,125,135,137.5,141,137.5,80,90,-95,,90,165,175,-177.5,,175,402.5
1,M,SBD,Wraps,Yes,60,Максим Сухобок,Maxim Sukhobok,45-49,1965-01-01,59.9,Russia,-135,140,150,,150,92.5,-100.5,100.5,,100.5,175,187.5,-195,,187.5,437.5
1,M,SBD,Wraps,Yes,60,Максим Сухобок,Maxim Sukhobok,Open,1965-01-01,59.9,Russia,-135,140,150,,150,92.5,-100.5,100.5,,100.5,175,187.5,-195,,187.5,437.5
1,M,SBD,Wraps,Yes,67.5,Евгений Авдеев,Yevgeny Avdeev,13-15,1994-09-30,66.8,Russia,125,130,135,,135,67.5,72.5,-75,,72.5,167.5,177.5,-182.5,,177.5,385
1,M,SBD,Wraps,Yes,67.5,Евгений Булахтин,Yevgeny Bulakhtin,16-17,1992-05-10,67.2,Russia,147.5,-155,155,,155,105,110,112.5,,112.5,190,195,-200.5,,195,462.5
2,M,SBD,Wraps,Yes,67.5,Константин Половников,Konstantin Polovnikov,16-17,1992-06-11,65.65,Russia,-140,140,150,,150,100,105,107.5,,107.5,180,192.5,200,,200,457.5
3,M,SBD,Wraps,Yes,67.5,Игорь Дейкин,Igor Deykin,16-17,1992-03-23,67.4,Russia,115,120,-125,,120,-67.5,67.5,-72.5,,67.5,170,-177.5,182.5,,182.5,370
1,M,SBD,Wraps,Yes,67.5,Иван Безруков,Ivan Bezrukov,20-23,1989-01-05,66.75,Russia,130,-135,140,,140,75,80,85,,85,170,180,-185.5,,180,405
1,M,SBD,Wraps,Yes,67.5,Сергей Алампиев,Sergei Alampiev,50-54,1957-04-07,65.5,Russia,-145,145,155,,155,100,-110,-110,,100,190,205,220,,220,475
1,M,SBD,Wraps,Yes,67.5,Сергей Алампиев,Sergei Alampiev,Open,1957-04-07,65.5,Russia,-145,145,155,,155,100,-110,-110,,100,190,205,220,,220,475
DQ,M,SBD,Wraps,Yes,67.5,Михаил Герасимов,Mikhail Gerasimov,Open,1983-08-06,60.75,Russia,170,180,190,,190,125,-130,130,,130,-225,-225,-225,,,
DQ,M,SBD,Wraps,Yes,67.5,Алексей Окунев,Alexei Okunev,Open,1975-11-16,65.7,Russia,-170,-170,-170,,,,,,,,,,,,,
1,M,SBD,Wraps,Yes,75,Владимир Бабин,Vladimir Babin,16-17,1992-08-09,74.5,Russia,170,177.5,182.5,,182.5,110,115,-117.5,,115,250,-255,-257.5,,250,547.5
2,M,SBD,Wraps,Yes,75,Бетал Губжев,Betal Gubzhev,16-17,1992-07-13,71.9,Russia,140,-150,160,,160,80,-85,90,,90,160,170,180,,180,430
1,M,SBD,Wraps,Yes,75,Дмитрий Гуров,Dmitry Gurov,18-19,1991-01-24,74.35,Russia,-140,150,-160,,150,110,-120,120,,120,180,190,-200,,190,460
1,M,SBD,Wraps,Yes,75,Никита Ефимов,Nikita Yefimov,20-23,1988-09-18,72.5,Russia,180,190,200,,200,115,125,,,125,235,-245,245,,245,570
2,M,SBD,Wraps,Yes,75,Денис Куликов,Denis Kulikov,20-23,1987-10-03,74,Russia,-190,190,-200,,190,135,-140,140,,140,-200,200,-225,,200,530
3,M,SBD,Wraps,Yes,75,Сергей Тарасов,Sergei Tarasov,20-23,1986-06-29,74.95,Russia,-145,-155,155,,155,115,122.5,127.5,,127.5,180,-195,-195,,180,462.5
1,M,SBD,Wraps,Yes,75,Владимир Пряженцев,Vladimir Pryazhentsev,40-44,1965-12-04,73.7,Russia,160,180,-190.5,,180,110,120,125,130.5,125,170,200,210,-223,210,515
2,M,SBD,Wraps,Yes,75,Александр Куманченко,Alexander Kumanchenko,40-44,1969-08-11,68.6,Russia,130,140,-150,,140,125,130,-132.5,,130,-170,180,190,,190,460
1,M,SBD,Wraps,Yes,75,Родион Пучковский,Rodion Puchkovsky,Open,1980-05-13,74.15,Russia,180,195,200,,200,125,130,132.5,,132.5,230,250,252.5,,252.5,585
2,M,SBD,Wraps,Yes,75,Никита Ефимов,Nikita Yefimov,Open,1988-09-18,72.5,Russia,180,190,200,,200,115,125,,,125,235,-245,245,,245,570
1,M,SBD,Wraps,Yes,82.5,Евгений Артемов,Yevgeny Artemov,18-19,1992-02-15,79,Russia,160,-167.5,-167.5,,160,125,127.5,130,-132.5,130,175,-185,,,175,465
1,M,SBD,Wraps,Yes,82.5,Никита Рябченко,Nikita Ryabchenko,20-23,1989-05-18,81,Russia,160,167.5,175,,175,120,125,127.5,,127.5,217.5,225,235,,235,537.5
2,M,SBD,Wraps,Yes,82.5,Николай Балугин,Nikolai Balugin,20-23,1987-07-24,78.05,Russia,175,182.5,187.5,,187.5,122.5,127.5,-130,,127.5,185,-192.5,192.5,,192.5,507.5
1,M,SBD,Wraps,Yes,82.5,Григорий Саруханян,Grigory Sarukhanyan,40-44,1965-10-30,82.25,Russia,-210,210,-217.5,,210,135,140,-145,,140,260,270,280,,280,630
1,M,SBD,Wraps,Yes,82.5,Володимир Василенко,Volodymyr Vasylenko,65-69,1943-11-12,77.4,Ukraine,100,-110,110,,110,60,-65,,,60,120,130,,,130,300
DQ,M,SBD,Wraps,Yes,82.5,Вячеслав Чевордаев,Vyacheslav Chevordaev,60-64,1948-04-06,81.7,Russia,-175,-175,-175,,,,,,,,,,,,,
1,M,SBD,Wraps,Yes,82.5,Вячеслав Терзов,Vyacheslav Terzov,70-74,1938-06-11,81.8,Russia,140,-150,,,140,75,80,,,80,150,170,-190.5,,170,390
1,M,SBD,Wraps,Yes,82.5,Алексей Кокухин,Alexei Kokukhin,Open,1984-11-22,79.6,Russia,-235,237.5,242.5,,242.5,150,162.5,-165,,162.5,280,-300,300,,300,705
2,M,SBD,Wraps,Yes,82.5,Александр Шунин,Alexander Shunin,Open,1978-11-07,81.6,Russia,200,210,215,,215,150,160,-165,,160,225,-240,250,,250,625
3,M,SBD,Wraps,Yes,82.5,Астемир Молов,Astemir Molov,Open,1985-08-09,82.35,Russia,-150,160,-180,,160,90,100,115,,115,180,195,205,,205,480
1,M,SBD,Wraps,Yes,90,Борис Долженко,Boris Dolzhenko,16-17,1992-08-06,83.4,Russia,125,135,140,,140,85,90,92.5,,92.5,155,160,170,,170,402.5
1,M,SBD,Wraps,Yes,90,Евгений Собянин,Yevgeny Sobyanin,18-19,1990-07-24,87.55,Russia,150,160,170,,170,125,132.5,-137.5,,132.5,-170,185,-200,,185,487.5
1,M,SBD,Wraps,Yes,90,Антон Зенин,Anton Zenin,20-23,1987-08-04,89.35,Russia,175,190,205,,205,125,135,140,,140,220,240,255,,255,600
2,M,SBD,Wraps,Yes,90,Алексей Мамонтов,Alexei Mamontov,20-23,1986-05-28,87.1,Russia,-180,190,200,,200,-130,-137.5,145,,145,190,200,205,,205,550
1,M,SBD,Wraps,Yes,90,Сергей Талалаев,Sergei Talalaev,40-44,1968-09-07,89,Russia,-150,155,170,,170,125,132.5,-140,,132.5,160,180,190,,190,492.5
2,M,SBD,Wraps,Yes,90,Бахтияр Мухаметов,Bahtiyar Mukhametov,40-44,1970-02-18,87.55,Kyrgyzstan,110,130,-150,,130,130,140,-150,,140,130,150,,,150,420
1,M,SBD,Wraps,Yes,90,Бакыт Керимбеков,Bakyt Kerimbekov,45-49,1961-07-07,88.2,Kyrgyzstan,100,-120,-130,,100,110,120,-130,,120,160,170,180,,180,400
1,M,SBD,Wraps,Yes,90,Мурат Токуев,Murat Tokuev,Open,1980-08-10,83,Russia,160,180,190,,190,115,125,,,125,-200,210,215,,215,530
1,M,SBD,Wraps,Yes,100,Игорь Миненков,Igor Minenkov,16-17,1992-08-21,98.3,Russia,-145,-150,150,,150,90,95,-97.5,,95,170,180,187.5,,187.5,432.5
1,M,SBD,Wraps,Yes,100,Георгий Заборовский,Georgy Zaborovsky,18-19,1992-03-01,93.1,Russia,-190,190,205,,205,142.5,150,160,,160,190,210,235,,235,600
2,M,SBD,Wraps,Yes,100,Руслан Кулебякин,Ruslan Kulebyakin,18-19,1991-02-26,94.65,Russia,160,-175,180,,180,130,-140,145,,145,200,-225,-230,,200,525
1,M,SBD,Wraps,Yes,100,Сергей Колесник,Sergiy Kolesnyk,45-49,1963-01-03,96.15,Ukraine,160,170,,,170,120,135,-142.5,,135,180,195,,,195,500
1,M,SBD,Wraps,Yes,100,Михаил Бобков,Mikhail Bobkov,60-64,1947-11-21,95.3,Russia,-225,-225,225,,225,80,-90,-90,,80,200,-220,-220,,200,505
1,M,SBD,Wraps,Yes,100,Сергей Зайцев,Sergei Zaitsev,Open,1977-10-13,96.4,Russia,225,235,245,,245,180,190,205,,205,260,280,-290,,280,730
2,M,SBD,Wraps,Yes,100,Андрей Устюгов,Andrei Ustyugov,Open,1971-04-09,99.15,Russia,-225,225,250,,250,160,170,-175,,170,-240,250,262.5,,262.5,682.5
3,M,SBD,Wraps,Yes,100,Николай Соловьев,Nikolai Solovyov,Open,1968-06-21,97.95,Russia,225,-235,237.5,,237.5,162.5,175,-177.5,,175,-245,260,-267.5,,260,672.5
1,M,SBD,Wraps,Yes,110,Константин Комелин,Konstantin Komelin,20-23,1986-03-31,105.6,Russia,225,-240,247.5,,247.5,135,142.5,145,,145,265,-277.5,277.5,,277.5,670
1,M,SBD,Wraps,Yes,110,Владимир Минин,Vladimir Minin,40-44,1967-08-29,101.95,Russia,270,277.5,-280,,277.5,150,155,-157.5,,155,270,280,285,,285,717.5
1,M,SBD,Wraps,Yes,110,Владимир Чернышев,Vladimir Chernyshev,60-64,1948-09-04,107.8,Russia,-165,165,-175,,165,100,-110,-110,,100,180,190,200,-205,200,465
1,M,SBD,Wraps,Yes,110,Владимир Минин,Vladimir Minin,Open,1967-08-29,101.95,Russia,270,277.5,-280,,277.5,150,155,-157.5,,155,270,280,285,,285,717.5
2,M,SBD,Wraps,Yes,110,Андрей Федосеев,Andrei Fedoseev,Open,1974-03-03,108.3,Russia,230,-245,-245,,230,175,-185,185,,185,255,-265,272.5,,272.5,687.5
3,M,SBD,Wraps,Yes,110,Максим Суховиенко,Maxim Sukhoviyenko,Open,1980-06-22,108.85,Russia,200,210,-215,,210,170,180,190,,190,230,240,250,,250,650
1,M,SBD,Wraps,Yes,125,Экбер Курбанов,Ekber Kurbanov,40-44,1968-02-21,115,Russia,225,240,,,240,160,168,,,168,250,-260,262.5,,262.5,670
1,M,SBD,Wraps,Yes,125,Александр Бурлаков,Alexander Burlakov,50-54,1959-01-07,124.2,Russia,-190,190,-205,,190,150,160,-167.5,,160,170,180,,,180,530
1,M,SBD,Wraps,Yes,125,Александр Зайцев,Alexander Zaitsev,Open,1980-04-06,115.6,Russia,250,280,-300,,280,190,205,215,,215,270,290,-305,,290,785
2,M,SBD,Wraps,Yes,125,Александр Луцкевич,Alexander Lutskevich,Open,1972-09-10,116.45,Russia,250,-260,260,,260,175,185,-190,,185,260,275,-285,,275,720
3,M,SBD,Wraps,Yes,125,Игорь Ремишевский,Igor Remishevsky,Open,1979-12-02,119.1,Russia,195,-205,205,,205,130,137.5,140,,140,220,230,235,,235,580
1,M,SBD,Wraps,Yes,140,Олег Васюченко,Oleg Vasyuchenko,40-44,1968-03-01,129.2,Russia,-255,-255,255,,255,150,165,,,165,-270,270,300,,300,720
1,M,SBD,Wraps,Yes,140,Александр Эсаулов,Alexander Esaulov,Open,1982-02-08,126.6,Russia,200,225,250,,250,100,120,,,120,260,290,310,,310,680
DQ,M,SBD,Wraps,Yes,140,Сергей Доронин,Sergei Doronin,20-23,1986-06-14,135.05,Russia,,,,,,,,,,,,,,,,
1,F,SBD,Multi-ply,Yes,48,Ольга Веселова,Olga Veselova,Open,1979-05-16,47.8,Russia,-105,110,115,120.5,115,35,-37.5,37.5,,37.5,115,125,130.5,133,130.5,282.5
1,F,SBD,Multi-ply,Yes,52,Надежда Реутова,Nadezhda Reutova,16-17,1993-01-30,50.6,Russia,100,110,115,,115,60,-62.5,-62.5,,60,105,110,-120,,110,285
1,F,SBD,Multi-ply,Yes,56,Анастасия Ладыгина,Anastasia Ladygina,18-19,1990-09-25,54.5,Russia,100,110,115,,115,55,57.5,-60,,57.5,110,120,-125,,120,292.5
1,F,SBD,Multi-ply,Yes,60,Ольга Тельпова,Olga Telpova,Open,1986-03-18,59.4,Russia,-120,120,130,,130,85,-90,90,,90,130,-140,140,,140,360
1,M,SBD,Multi-ply,Yes,60,Виталий Михин,Vitaly Mikhin,16-17,1993-12-11,60,Russia,-145,145,160,170,160,90,97.5,105,,105,160,180,190,,190,455
1,M,SBD,Multi-ply,Yes,67.5,Иван Безруков,Ivan Bezrukov,20-23,1989-01-05,67.3,Russia,180,-200,-200,,180,80,85,,,85,-180,180,185.5,187.5,185.5,450
1,M,SBD,Multi-ply,Yes,67.5,Сергей Алампиев,Sergei Alampiev,50-54,1957-04-07,65.65,Russia,160,180,190,,190,-135,135,-140,,135,190,210,220,,220,545
3,M,SBD,Multi-ply,Yes,67.5,Юрий Киселев,Yuri Kiselyov,70-74,1937-11-12,65.3,Russia,115,-135,145,,145,75,-80,80,,80,150,185,,,185,410
1,M,SBD,Multi-ply,Yes,67.5,Сергей Алампиев,Sergei Alampiev,Open,1957-04-07,65.65,Russia,160,180,190,,190,-135,135,-140,,135,190,210,220,,220,545
2,M,SBD,Multi-ply,Yes,67.5,Иван Безруков,Ivan Bezrukov,Open,1989-01-05,67.3,Russia,180,-200,-200,,180,80,85,,,85,-180,180,185.5,187.5,185.5,450
1,M,SBD,Multi-ply,Yes,75,Александр Карпенко,Alexander Karpenko,16-17,1992-04-25,74.6,Russia,270,-280,280,,280,-160,160,170,175.5,170,-250,255,-262.5,,255,705
1,M,SBD,Multi-ply,Yes,75,Александр Карпенко,Alexander Karpenko,Open,1992-04-25,74.6,Russia,270,-280,280,,280,-160,160,170,175.5,170,-250,255,-262.5,,255,705
DQ,M,SBD,Multi-ply,Yes,75,Сергей Стахеев,Sergei Stakheev,Open,1984-11-22,72.55,Russia,-210,-210,-210,,,,,,,,,,,,,
1,M,SBD,Multi-ply,Yes,82.5,Степан Сивцев,Stepan Sivtsev,18-19,1991-10-22,80.85,Russia,165,175,185,,185,115,-125,130,,130,165,180,-190,,180,495
1,M,SBD,Multi-ply,Yes,82.5,Станислав Кумсков,Stanislav Kumskov,20-23,1989-11-11,81.15,Russia,-280,280,292.5,,292.5,160,167.5,-172.5,,167.5,275,-292.5,-292.5,,275,735
2,M,SBD,Multi-ply,Yes,82.5,Александр Семейко,Alexander Semeiko,20-23,1988-04-24,79.45,Russia,200,-220,220,,220,105,110,115,,115,190,-205,-215,,190,525
1,M,SBD,Multi-ply,Yes,82.5,Вячеслав Терзов,Vyacheslav Terzov,70-74,1938-06-11,81.8,Russia,130,150,-180,,150,-70,75,-80,,75,130,150,,,150,375
1,M,SBD,Multi-ply,Yes,82.5,Алексей Сафонов,Alexei Safonov,Open,1976-10-03,81.5,Russia,265,290,310,327.5,310,145,160,-170,,160,230,250,267.5,,267.5,737.5
2,M,SBD,Multi-ply,Yes,82.5,Максим Синецкин,Maxim Sinetskin,Open,1978-06-04,80.8,Russia,240,260,,,260,170,-190.5,-190.5,,170,200,240,-270,,240,670
3,M,SBD,Multi-ply,Yes,82.5,Ринат Галеев,Rinat Galeev,Open,1974-09-28,79.1,Russia,190,200,215,,215,115,122.5,127.5,,127.5,185,200,-210,,200,542.5
1,M,SBD,Multi-ply,Yes,90,Евгений Дяченко,Yevgeny Dyachenko,16-17,1992-10-07,88.7,Belarus,190,205,,,205,130,137.5,140,,140,215,227.5,-237.5,,227.5,572.5
1,M,SBD,Multi-ply,Yes,90,Евгений Есаулков,Yevgeny Esaulkov,20-23,1989-08-06,86,Russia,202.5,210,215,,215,-150,150,155,-160,155,220,235,-245,,235,605
2,M,SBD,Multi-ply,Yes,90,Илья Селиванов,Ilya Selivanov,20-23,1989-03-02,89.45,Russia,-205,-205,205,,205,-150,150,-160,,150,170,185,-200,,185,540
1,M,SBD,Multi-ply,Yes,90,Бахтияр Мухаметов,Bahtiyar Mukhametov,40-44,1970-02-18,87.6,Kyrgyzstan,100,,,,100,130,160,,,160,130,,,,130,390
1,M,SBD,Multi-ply,Yes,90,Бакыт Керимбеков,Bakyt Kerimbekov,45-49,1961-07-07,88.45,Kyrgyzstan,205,-230,240,,240,110,161,-170,,161,160,180,-200,,180,581
1,M,SBD,Multi-ply,Yes,90,Василий Фурса,Vasily Fursa,Open,1979-08-05,89.45,Russia,270,285,300,,300,170,-177.5,177.5,,177.5,240,245,250,,250,727.5
2,M,SBD,Multi-ply,Yes,90,Антон Лунин,Anton Lunin,Open,1980-02-26,89.5,Russia,250,265,280,,280,170,180,185,,185,235,255,262.5,,262.5,727.5
1,M,SBD,Multi-ply,Yes,100,Олег Писаченко,Oleg Pisachenko,40-44,1965-11-12,99.8,Russia,-265,275,-287.5,,275,165,175,187.5,,187.5,235,245,250,,250,712.5
1,M,SBD,Multi-ply,Yes,125,Денис Макеев,Denis Makeev,Open,1983-04-22,124.8,Russia,215,230,240,,240,-175,-175,175,,175,245,260,270,,270,685
1,M,SBD,Multi-ply,Yes,140,Александр Эсаулов,Alexander Esaulov,Open,1982-02-08,126.6,Russia,210,,,,210,100,,,,100,270,300,-320,,300,610
1,F,SBD,Multi-ply,No,56,Маргарита Гасс,Margarita Gass,20-23,1988-02-11,55.4,Russia,-140,145,-155,,145,80,-85,-85,,80,100,120,-127.5,,120,345
1,F,SBD,Multi-ply,No,56,Ирина Игнатович,Irina Ignatovich,Open,1982-07-20,54.9,Russia,-165,170,-177.5,,170,90,95,-100,,95,155,-160,160,,160,425
1,F,SBD,Multi-ply,No,60,Марина Медведева,Marina Medvedeva,Open,1974-09-05,59.95,Russia,-200,210,230,,230,120,130,140,,140,170,190,202.5,,202.5,572.5
1,F,SBD,Multi-ply,No,67.5,Мария Егоренкова,Maria Yegorenkova,20-23,1989-05-26,62.9,Russia,155,165,175,,175,100,-110,-110,,100,110,-130,-140,,110,385
1,F,SBD,Multi-ply,No,75,Елена Поволоцкая,Yelena Povolotskaya,Open,1978-02-16,75,Russia,240,-260,-262.5,,240,-140,140,-150,,140,210,225,232.5,,232.5,612.5
DQ,F,SBD,Multi-ply,No,75,Юлия Медведева,Yulia Medvedeva,Open,1979-07-08,75,Russia,220,240,-250,,240,165,-175,-175,,165,-200,-200,,,,
1,M,SBD,Multi-ply,No,75,Андрей Куляев,Andrei Kulyaev,20-23,1986-10-07,69.1,Russia,125,135,140,,140,100,-105,105,,105,-135,135,145,,145,390
1,M,SBD,Multi-ply,No,75,Юрий Чепец,Yuriy Chepets,65-69,1943-04-19,75,Russia,215,-230,-241,,215,165,175,-178,,175,170,190,,,190,580
1,M,SBD,Multi-ply,No,75,Анатолий Глазунов,Anatoly Glazunov,Open,1972-02-09,75,Russia,290,320,-330,,320,170,190,-210,,190,240,260,270,,270,780
2,M,SBD,Multi-ply,No,75,Константин Горюнов,Konstantin Goryunov,Open,1985-08-24,74.2,Russia,250,270,285,,285,-170,175,190,,190,220,240,-250,,240,715
1,M,SBD,Multi-ply,No,82.5,Сергей Блинов,Sergei Blinov,20-23,1987-06-26,82.2,Russia,310,-325,-330,,310,-205,205,215,,215,275,-290,-290,,275,800
1,M,SBD,Multi-ply,No,82.5,Геннадий Богданов,Gennady Bogdanov,40-44,1968-01-12,82.5,Russia,-270,-270,270,,270,190,200,-205,,200,250,270,,,270,740
1,M,SBD,Multi-ply,No,82.5,Валерий Глазунов,Valery Glazunov,60-64,1948-12-18,81.8,Russia,270,300,315,,315,160,175,185,,185,220,245,250,,250,750
1,M,SBD,Multi-ply,No,82.5,Юрий Шульга,Yuri Shulga,Open,1983-10-24,81.6,Russia,-310,310,330,,330,-155,155,-165,,155,270,-285,-285,,270,755
2,M,SBD,Multi-ply,No,82.5,Олег Валиев,Oleg Valiev,Open,1985-03-09,82.5,Russia,265,280,290,,290,-180,-180,180,,180,230,250,-262.5,,250,720
3,M,SBD,Multi-ply,No,82.5,Юрий Волков,Yuri Volkov,Open,1984-09-05,80.05,Russia,-240,245,-250,,245,190,-200,-200,,190,220,-230,-230,,220,655
4,M,SBD,Multi-ply,No,82.5,Андрей Дарбинян,Andrei Darbinyan,Open,1977-03-03,79.5,Russia,230,-257.5,-257.5,,230,147.5,-157.5,-157.5,,147.5,240,260,-267.5,,260,637.5
1,M,SBD,Multi-ply,No,90,Василий Лудин,Vasily Ludin,20-23,1988-04-20,86.7,Russia,,-305,305,,305,-180,180,187.5,,187.5,-260,260,290,,290,782.5
DQ,M,SBD,Multi-ply,No,90,Василий Вологдин,Vasily Vologdin,20-23,1988-12-13,85.2,Russia,190,210,-230,,210,-130,-130,-130,,,,,,,,
1,M,SBD,Multi-ply,No,90,Владимир Копчук,Vladimir Kopchuk,50-54,1957-03-23,85.6,Russia,-200,200,,,200,140,150,-155,,150,190,220,245.5,,245.5,595
DQ,M,SBD,Multi-ply,No,90,Евгений Худолеев,Yevgeny Khudoleev,60-64,1946-09-10,88,Russia,220,240,260,,260,-160,-160,-160,,,,,,,,
1,M,SBD,Multi-ply,No,90,Валерий Филиппов,Valery Filippov,65-69,1943-07-17,86.35,Russia,195,205,,,205,-105,105,110,,110,-220,230,-240,,230,545
1,M,SBD,Multi-ply,No,90,Максим Пискунов,Maxim Piskunov,Open,1982-07-24,90,Russia,-370,370,-390,,370,210,215,220,,220,-275,275,300,,300,890
2,M,SBD,Multi-ply,No,90,Владимир Жабин,Vladimir Zhabin,Open,1980-06-27,89.85,Russia,320,335,350,,350,190,210,-220,,210,290,310,-330,,310,870
3,M,SBD,Multi-ply,No,90,Виктор Петухов,Viktor Petukhov,Open,1979-07-08,89.8,Russia,-300,-300,300,,300,190,-200,-200,,190,260,270,280,,280,770
4,M,SBD,Multi-ply,No,90,Тимофей Марков,Timofei Markov,Open,1982-03-07,87.65,Russia,-230,-230,230,,230,125,-145,145,,145,240,250,-260,,250,625
DQ,M,SBD,Multi-ply,No,90,Андрей Шарапов,Andrei Sharapov,Open,1978-11-25,89.15,Russia,-400,-400,-425,,,,,,,,,,,,,
DQ,M,SBD,Multi-ply,No,90,Илья Лебедь,Ilya Lebed',Open,1972-02-12,89.3,Russia,,,,,,,,,,,,,,,,
1,M,SBD,Multi-ply,No,100,Александр Панаскин,Alexander Pamaskin,18-19,1991-06-27,95.9,Russia,300,-320,-330,,300,180,200,215,,215,260,280,-300,,280,795
1,M,SBD,Multi-ply,No,100,Евгений Соколов,Yevgeny Sokolov,20-23,1988-02-11,95.4,Russia,-280,280,310,,310,215,-230,,,215,250,290,310,,310,835
1,M,SBD,Multi-ply,No,100,Павел Лаптенок,Pavel Laptenok,55-59,1953-01-26,97.95,Russia,180,192.5,200,,200,135,145,,,145,190,205,,,205,550
1,M,SBD,Single-ply,No,100,Андрей Беляев,Andrey Belyaev,Open,1983-03-16,96.55,Russia,400,415,430,,430,280,-300,-300.5,,280,330,350,370,,370,1080
2,M,SBD,Multi-ply,No,100,Эдуард Максимов,Eduard Maximov,Open,1971-11-20,98.1,Russia,320,-330,-330,,320,245,250,-255,,250,270,290,-300,,290,860
3,M,SBD,Multi-ply,No,100,Никита Байдак,Nikita Baydak,Open,1985-09-18,99.05,Russia,-290,-290,290,,290,-220,,220,,220,270,285,295,,295,805
4,M,SBD,Multi-ply,No,100,Сергей Власов,Sergei Vlasov,Open,1980-08-25,91.2,Russia,280,290,300,,300,195,-205,-205,,195,270,285,-292.5,,285,780
DQ,M,SBD,Multi-ply,No,100,Гегам Какоян,Gegam Kakoyan,Open,1984-04-02,97.7,Russia,330,-340,-340,,330,-230,-230,-230,,,,,,,,
1,M,SBD,Multi-ply,No,110,Олег Гевко,Oleg Gevko,18-19,1991-01-27,110,Russia,330,350,371,,371,170,190,-200,,190,265,285,295,,295,856
1,M,SBD,Multi-ply,No,110,Алексей Алексеев,Alexei Alexeev,20-23,1988-04-15,107.85,Russia,370,-380,,,370,-235,235,-242.5,,235,310,325,335,,335,940
2,M,SBD,Multi-ply,No,110,Артем Савельев,Artem Savelyev,20-23,1988-11-02,109.7,Russia,350,-372.5,-372.5,,350,-200,-200,200,,200,-325,325,-340,,325,875
DQ,M,SBD,Multi-ply,No,110,Константин Маковский,Konstantin Makovsky,50-54,1957-12-10,109.7,Russia,-260,-280,-280,,,,,,,,,,,,,
1,M,SBD,Multi-ply,No,110,Тимур Андреев,Timur Andreev,Open,1983-07-17,108.7,Russia,400,420.5,-435,,420.5,-260,260,-270,,260,350,-370,370,,370,1050
2,M,SBD,Multi-ply,No,110,Дмитрий Сорокин,Dmitry Sorokin,Open,1971-03-22,108.45,Russia,330,345,362.5,,362.5,235,-250,250,,250,280,295,-302.5,,295,907.5
DQ,M,SBD,Multi-ply,No,110,Николай Кривенко,Nikolai Krivenko,Open,1982-08-16,108.75,Russia,-330,,,,,,,,,,,,,,,
1,M,SBD,Multi-ply,No,125,Вячеслав Шадрин,Vyacheslav Shadrin,40-44,1968-02-21,121.6,Russia,260,290,315,,315,180,200,-210,,200,260,295,,,295,810
1,M,SBD,Multi-ply,No,125,Михаил Глазунов,Mikhail Glazunov,Open,1974-02-09,121.35,Russia,380,410,430,,430,260,-280,280,,280,340,370,-390,,370,1080
2,M,SBD,Multi-ply,No,125,Александр Серегин,Alexander Seregin,Open,1980-09-16,121.9,Russia,270,290,-310,,290,-250,250,-260,,250,270,290,300,,300,840
1,M,SBD,Multi-ply,No,140,Виктор Малюгин,Viktor Malyugin,18-19,1990-08-18,128.45,Russia,380,410,,,410,-275,280,-290,,280,290,310,-320,,310,1000
DQ,M,SBD,Multi-ply,No,140+,Игорь Настынов,Igor Nastynov,Open,1961-09-14,150.8,Russia,,,,,,,,,,,,,,,,
1,F,SBD,Wraps,No,67.5,Екатерина Калюжная,Yekaterina Kalyuzhnaya,20-23,1987-11-05,63.9,Russia,70,-80,-85,,70,-50,50,-55,,50,100,115,120,,120,240
1,F,SBD,Wraps,No,75,Оксана Лужина,Oxana Luzhina,Open,1983-08-19,69.9,Russia,110,115,120,,120,50,55,-60,,55,130,140,-145,,140,315
1,M,SBD,Wraps,No,52,Николай Грачев,Nikolay Grachev,50-54,1956-04-16,51.9,Russia,85,92.5,95,,95,65,67.5,70,,70,125,135,140,,140,305
1,M,SBD,Wraps,No,56,Николай Ваничев,Nikolai Vanichev,Open,1978-10-09,56,Russia,-110,115,-135,,115,-105,105,110,,110,150,175,185,,185,410
1,M,SBD,Wraps,No,67.5,Владимир Устинов,Vladimir Ustinov,Open,1986-03-16,66.8,Russia,180,190,200,,200,135,145,150,,150,200,215,-225,,215,565
2,M,SBD,Wraps,No,,Мухтар Мамчуев,Mukhtar Mamchuev,Open,1982-07-23,66,Russia,140,-160,,,140,90,105,-115,,105,170,190,200,,200,445
1,M,SBD,Wraps,No,75,Игорь Поважнюк,Igor Povazhnyuk,Open,1974-12-21,74.4,Ukraine,165,180,190,,190,-135,140,-145,,140,190,210,-230,,210,540
1,M,SBD,Wraps,No,90,Павел Борисов,Pavel Borisov,18-19,1990-03-18,85.4,Russia,150,165,175,,175,130,-140,-140,,130,-180,180,200,,200,505
1,M,SBD,Wraps,No,90,Евгений Кравченко,Yevgeny Kravchenko,20-23,1986-11-03,87.8,Russia,230,240,250,,250,145,160,165,,165,310,332.5,-340,,332.5,747.5
1,M,SBD,Wraps,No,90,Дмитрий Гореликов,Dmitry Gorelikov,40-44,1968-06-20,87.7,Russia,185,197.5,205,,205,130,-135,135,,135,220,240,250,,250,590
1,M,SBD,Wraps,No,90,Асламбек Абаев,Aslambek Abayev,50-54,1959-06-28,89.9,Russia,220,240,,,240,-170,170,-175,,170,240,-250,250,,250,660
2,M,SBD,Wraps,No,90,Александр Цветков,Alexander Tsvetkov,50-54,1957-04-10,87.1,Russia,180,192.5,-197.5,,192.5,95,-102.5,-105,,95,185,197.5,207.5,,207.5,495
1,M,SBD,Wraps,No,90,Сергей Дружков,Sergei Druzhkov,60-64,1950-01-01,85.45,Russia,160,180,185,190,185,130,135,137.5,140,137.5,160,180,200,-205,200,522.5
1,M,SBD,Wraps,No,90,Сергей Власов,Sergei Vlasov,Open,1980-08-25,90,Russia,180,195,,,195,135,,,,135,200,,,,200,530
2,M,SBD,Wraps,No,90,Андрей Франк,Andrei Frank,Open,1984-12-17,88.3,Russia,160,-170,-180,,160,120,130,-135,,130,-185,195,-200,,195,485
1,M,SBD,Wraps,No,100,Константин Немыкин,Konstantin Nemykin,20-23,1988-07-10,99.5,Russia,-260,260,280.5,-290,280.5,180,190,195,,195,275,295,-302.5,,295,770
2,M,SBD,Wraps,No,100,Заурбек Бугулов,Zaurbek Bugulov,20-23,1986-04-05,99.9,Russia,175,185,-200,,185,160,170,-175,,170,200,230,-250,,230,585
1,M,SBD,Wraps,No,100,Вячеслав Франк,Vyacheslav Frank,45-49,1962-03-03,96.2,Russia,-140,150,-170,,150,120,-130,-130,,120,180,195,202.5,,202.5,472.5
1,M,SBD,Wraps,No,100,Павел Лаптенок,Pavel Laptenok,55-59,1953-01-26,98.6,Russia,170,182.5,190,,190,125,135,-140,,135,180,200,212.5,,212.5,537.5
1,M,SBD,Wraps,No,100,Андрей Беляев,Andrey Belyaev,Open,1983-03-16,95.9,Russia,260,290,310,,310,220,-237.5,-237.5,,220,345,360,,,360,890
DQ,M,SBD,Wraps,No,110,Михаил Секов,Mikhail Sekov,20-23,1986-09-01,110,Russia,-290,-290,-290,,,,,,,,,,,,,
1,M,SBD,Wraps,No,110,Юрий Усольцев,Yuri Usoltsev,45-49,1964-08-07,109.95,Russia,200,220,230,,230,170,-180,185,,185,215,-230,-235,,215,630
1,M,SBD,Wraps,No,110,Павел Костырко,Pavel Kostyrko,50-54,1959-05-04,101.4,Russia,170,190,210,,210,110,120,-130,,120,230,252.5,,,252.5,582.5
1,M,SBD,Wraps,No,110,Сергей Стародубский,Sergei Starodubsky,Open,1977-12-20,109.3,Russia,310,323,330,,330,227.5,-232.5,-232.5,,227.5,280,320,342.5,,342.5,900
DQ,M,SBD,Wraps,No,110,Михаил Секов,Mikhail Sekov,Open,1986-09-01,110,Russia,-290,-290,-290,,,,,,,,,,,,,
1,M,SBD,Wraps,No,125,Станислав Севостьянов,Stanislav Sevostyanov,20-23,1986-10-29,110.9,Russia,-215,215,230,,230,160,170,-172.5,,170,270,-285,-290,,270,670
DQ,M,SBD,Wraps,No,125,Амирхан Шомахов,Amirkhan Shomakhov,40-44,1965-11-23,117.1,Russia,-250,-250,250,,250,-170,-170,,,,,,,,,
1,M,SBD,Wraps,No,125,Камо Симонян,Kamo Simonyan,Open,1971-02-25,115.95,Russia,320,352.5,360,,360,-215,225,230,,230,320,340,,,340,930
1,M,SBD,Wraps,No,140,Игорь Ломов,Igor Lomov,Open,1970-10-29,133.7,Russia,-280,280,-300,,280,210,220,-230,,220,290,315,320,,320,820
1,F,B,Raw,Yes,44,Марьяна Наумова,Martana Naumova,T 13-15,1999-04-22,44,Russia,,,,,,35,42.5,45,46,45,,,,,,45
1,F,B,Raw,Yes,44,Мария Лапшова,Maria Lapshova,T 18-19,1991-03-19,43.8,Russia,,,,,,40,45,47.5,,47.5,,,,,,47.5
1,F,B,Raw,Yes,52,Алла Семенова,Alla Semenova,O,1983-04-12,49.45,Russia,,,,,,55,57.5,-60,,57.5,,,,,,57.5
2,F,B,Raw,Yes,52,Мария Дюкова,Maria Dyukova,O,1984-06-18,50.75,Russia,,,,,,50,57.5,-60,,57.5,,,,,,57.5
1,F,B,Raw,Yes,56,Анастасия Максимова,Anastasia Maximova,T 13-15,1994-06-08,53.15,Russia,,,,,,50,55,60,,60,,,,,,60
1,F,B,Raw,Yes,56,Ирина Морозова,Irina Morozova,Ю 20-23,1987-01-24,55.45,Russia,,,,,,55,60,62.5,,62.5,,,,,,62.5
1,F,B,Raw,Yes,56,Татьяна Солоненко,Tatyana Solonenko,O,1981-05-20,55,Russia,,,,,,42.5,-47.5,50,,50,,,,,,50
1,F,B,Raw,Yes,60,Надежда Зайцева,Nadezhda Zaitseva,Ю 20-23,1989-04-22,59.9,Russia,,,,,,30,32.5,-35,,32.5,,,,,,32.5
1,F,B,Raw,Yes,60,Анастасия Яблонская,Anastasia Yablonskaya,O,1989-04-22,59,Russia,,,,,,72.5,-77.5,77.5,,77.5,,,,,,77.5
2,F,B,Raw,Yes,60,Полина Турыгина,Polina Turygina,O,1985-10-19,59.2,Russia,,,,,,55,62.5,-65,,62.5,,,,,,62.5
1,F,B,Raw,Yes,67.5,Юлия Шведова-Виардо,Yuliya Shvedova-Viardo,O,1984-09-07,67.35,Russia,,,,,,75,80,82.5,-85,82.5,,,,,,82.5
1,F,B,Raw,Yes,82.5,Светлана Синачева,Svetlana Sinacheva,O,1966-12-15,75.6,Russia,,,,,,87.5,92.5,95,97.5,95,,,,,,95
1,M,B,Raw,Yes,52,Виталий Старилов,Vitaly Starilov,T 13-15,1994-11-01,50,Russia,,,,,,77.5,82.5,-85,,82.5,,,,,,82.5
1,M,B,Raw,Yes,52,Александр Медведчук,Alexander Medvedchuk,O,1986-01-01,51.65,Russia,,,,,,100,-110,-110,,100,,,,,,100
1,M,B,Raw,Yes,56,Владимир Пономарев,Vladimir Ponomarev,Ю 20-23,1986-07-31,53.7,Russia,,,,,,110,115,120,-122.5,120,,,,,,120
2,M,B,Raw,Yes,56,Олег Кащавцев,Oleg Kashchaev,Ю 20-23,1987-06-11,56,Russia,,,,,,97.5,105,-107.5,,105,,,,,,105
1,M,B,Raw,Yes,56,Никита Меньщиков,Nikita Menshchikov,O,1983-03-08,54.15,Russia,,,,,,110,128,-130,,128,,,,,,127.5
1,M,B,Raw,Yes,60,Руслан Беленький,Ruslan Belenky,T 13-15,1994-07-07,58.9,Russia,,,,,,80,-85,-85,,80,,,,,,80
1,M,B,Raw,Yes,60,Михаил Косюк,Mikhail Kosyuk,T 16-17,1992-10-07,58.4,Russia,,,,,,100,105,107.5,,107.5,,,,,,107.5
DQ,M,B,Raw,Yes,60,Максим Просвирин,Maxim Prosvirin,T 16-17,1993-09-04,59.9,Russia,,,,,,-80,-85,-85,,,,,,,,
1,M,B,Raw,Yes,60,Сергей Каразия,Sergei Karaziya,Ю 20-23,1987-11-30,58.8,Russia,,,,,,127.5,132.5,-140,,132.5,,,,,,132.5
1,M,B,Raw,Yes,60,Игорь Ястребцов,Igor Yastrebtsov,O,1993-02-24,60,Russia,,,,,,-85,-90,90,,90,,,,,,90
1,M,B,Raw,Yes,67.5,Александр Захаренко,Alexander Zakharenko,T 16-17,1993-03-24,66,Russia,,,,,,-100,-105,105,,105,,,,,,105
2,M,B,Raw,Yes,67.5,Константин Соколовский,Konstantin Sokolovsky,T 13-15,1995-04-30,64.9,Russia,,,,,,80,87.5,92.5,,92.5,,,,,,92.5
3,M,B,Raw,Yes,67.5,Дмитрий Баженов,Dmitry Bazhenov,T 13-15,1995-12-31,62.8,Russia,,,,,,80,85,90,,90,,,,,,90
4,M,B,Raw,Yes,67.5,Владислав Денисенко,Vladislav Denisenko,T 13-15,1995-11-17,67.3,Russia,,,,,,85,90,-92.5,,90,,,,,,90
5,M,B,Raw,Yes,67.5,Вадим Скиперский,Vadim Skipersky,T 13-15,1994-12-18,64.2,Russia,,,,,,77.5,87.5,-90,,87.5,,,,,,87.5
1,M,B,Raw,Yes,67.5,Вячеслав Шиндин,Vyacheslav Shindin,T 16-17,1993-03-06,65.1,Russia,,,,,,122.5,-130,-130,,122.5,,,,,,122.5
2,M,B,Raw,Yes,67.5,Евгений Шерматюк,Yevgeny Shermatyuk,T 16-17,1992-11-19,66.7,Russia,,,,,,-100,100,-107.5,,100,,,,,,100
3,M,B,Raw,Yes,67.5,Евгений Калашников,Yevgeny Kalashnikov,T 16-17,1992-05-06,66.1,Russia,,,,,,67.5,72.5,-77.5,,72.5,,,,,,72.5
1,M,B,Raw,Yes,67.5,Илья Козлов,Ilya Kozlov,T 18-19,1991-12-29,66.6,Russia,,,,,,100,107.5,110,,110,,,,,,110
1,M,B,Raw,Yes,67.5,Иван Безруков,Ivan Bezrukov,Ю 20-23,1989-01-05,66.5,Russia,,,,,,80,85,87.5,,87.5,,,,,,87.5
1,M,B,Raw,Yes,67.5,Николай Киреев,Nikolai Kireev,М 45-49,1963-09-02,65.6,Russia,,,,,,115,-122.5,-125,,115,,,,,,115
1,M,B,Raw,Yes,67.5,Сергей Алампиев,Sergei Alampiev,50-54,1957-04-07,65.5,Russia,,,,,,100,105,110,,110,,,,,,110
1,M,B,Raw,Yes,67.5,Юрий Киселев,Yuri Kiselyov,70-74,1937-11-12,65.3,Russia,,,,,,70,75,,,75,,,,,,75
1,M,B,Raw,Yes,67.5,Руслан Коротков,Ruslan Korotkov,O,1980-12-19,65.7,Kazakhstan,,,,,,135,140,145,,145,,,,,,145
2,M,B,Raw,Yes,67.5,Дмитрий Мелехин,Dmitry Melekhin,O,1980-09-24,65.9,Russia,,,,,,125,-130,130,,130,,,,,,130
3,M,B,Raw,Yes,67.5,Юрий Хлистун,Yuri Khlystun,O,1985-07-05,67.3,Russia,,,,,,-125,130,-135,,130,,,,,,130
4,M,B,Raw,Yes,67.5,Роман Петраков,Roman Petrakov,O,1981-06-13,65.65,Russia,,,,,,-120,122.5,125,,125,,,,,,125
DQ,M,B,Raw,Yes,75,Владислав Машнев,Vladislav Mashnev,T 13-15,1994-07-10,74.3,Russia,,,,,,,,,,,,,,,,
1,M,B,Raw,Yes,75,Максим Маркушин,Maxim Markushin,T 16-17,1992-12-27,73.4,Russia,,,,,,90,-95,-95,,90,,,,,,90
1,M,B,Raw,Yes,75,Дмитрий Ушаков,Dmitry Ushakov,T 18-19,1990-08-06,72.8,Russia,,,,,,140,145,-150,,145,,,,,,145
2,M,B,Raw,Yes,75,Сергей Гурковский,Sergei Gurkovsky,T 18-19,1990-08-17,72.9,Russia,,,,,,130,-140,-140,,130,,,,,,130
1,M,B,Raw,Yes,75,Антон Фоменко,Anton Fomenko,Ю 20-23,1989-01-07,73,Russia,,,,,,100,110,112.5,,112.5,,,,,,112.5
1,M,B,Raw,Yes,75,Станислав Милостной,Stanislav Milostnoy,O,1978-12-19,72.75,Russia,,,,,,180,185,190.5,,190.5,,,,,,190
2,M,B,Raw,Yes,75,Дмитрий Прозоров,Dmitry Prozorov,O,1985-03-12,74.1,Russia,,,,,,132.5,-140,-140,,132.5,,,,,,132.5
3,M,B,Raw,Yes,75,Игорь Амелин,Igor Amelin,O,1975-07-22,73.55,Russia,,,,,,115,120,-125,,120,,,,,,120
4,M,B,Raw,Yes,75,Юрий Волков,Yuri Volkov,O,1984-09-05,69.5,Russia,,,,,,115,-120,-120,,115,,,,,,115
1,M,B,Raw,Yes,82.5,Александр Бережной,Alexander Berezhnoy,T 13-15,1994-05-18,76.4,Russia,,,,,,100,-107.5,107.5,,107.5,,,,,,107.5
1,M,B,Raw,Yes,82.5,Григорий Кембике,Grigory Kembike,T 16-17,1993-04-18,78.9,Russia,,,,,,125,130,135,,135,,,,,,135
2,M,B,Raw,Yes,82.5,Виталий Ловецкий,Vitaly Lovetsky,T 16-17,1993-01-19,77.45,Russia,,,,,,110,112.5,115,,115,,,,,,115
3,M,B,Raw,Yes,82.5,Владимир Долгих,Vladimir Dolgikh,T 16-17,1993-07-02,80.4,Russia,,,,,,-105,105,115,,115,,,,,,115
4,M,B,Raw,Yes,82.5,Никита Лебедев,Nikita Lebedev,T 16-17,1993-06-29,79.3,Russia,,,,,,90,95,-97.5,,95,,,,,,95
1,M,B,Raw,Yes,82.5,Егор Клецко,Yegor Kletsko,T 18-19,1992-01-20,80.65,Russia,,,,,,142.5,150,157.5,,157.5,,,,,,157.5
1,M,B,Raw,Yes,82.5,Дмитрий Карпенко,Dmitry Karpenko,T 18-19 Пода,1990-09-23,81,Russia,,,,,,85,90,95,,95,,,,,,95
1,M,B,Raw,Yes,82.5,Иван Акимкин,Ivan Akimkin,Ю 20-23,1988-11-23,79.6,Russia,,,,,,145,150,155,,155,,,,,,155
2,M,B,Raw,Yes,82.5,Олег Хохлов,Oleg Khokhlov,Ю 20-23,1988-06-14,80,Russia,,,,,,140,145,-150,,145,,,,,,145
3,M,B,Raw,Yes,82.5,Николай Балугин,Nikolai Balugin,Ю 20-23,1987-07-24,77.95,Russia,,,,,,122.5,127.5,-130,,127.5,,,,,,127.5
DQ,M,B,Raw,Yes,82.5,Алексей Кривошеенко,Alexei Krovosheenko,Ю 20-23,1988-12-09,78.6,Russia,,,,,,-135,,-135,,,,,,,,
1,M,B,Raw,Yes,82.5,Александр Воробьев,Alexander Vorobyov,М 40-44,1967-02-18,80.9,Russia,,,,,,-142.5,147.5,152.5,,152.5,,,,,,152.5
2,M,B,Raw,Yes,82.5,Эдуард Сотников,Eduard Sotnikov,М 40-44,1967-09-12,81.3,Russia,,,,,,135,140,-145,,140,,,,,,140
DQ,M,B,Raw,Yes,82.5,Владимир Захаров,Vladimir Zakharov,М 40-44,1969-05-29,81.9,Russia,,,,,,-190,-192.5,-192.5,,,,,,,,
1,M,B,Raw,Yes,82.5,Владимир Решетников,Vladimir Reshetnikov,М 45-49,1960-04-16,82.2,Russia,,,,,,-172.5,172.5,182.5,,182.5,,,,,,182.5
1,M,B,Raw,Yes,82.5,Владимир Корнишин,Vladimir Kornishin,М 55-59,1952-01-04,79.1,Russia,,,,,,115,120,-122.5,,120,,,,,,120
1,M,B,Raw,Yes,82.5,Леонид Дворкин,Leonid Dvorkin,М 65-69,1941-01-23,76.7,Russia,,,,,,-100,100,107.5,-110,107.5,,,,,,107.5
1,M,B,Raw,Yes,82.5,Андрей Нерубенко,Andrei Nerubenko,O,1979-11-28,79.1,Russia,,,,,,175,185,191,-195.5,191,,,,,,191
2,M,B,Raw,Yes,82.5,Алексей Голионко,Alexei Golionko,O,1979-07-25,81.95,Kyrgyzstan,,,,,,170,177.5,-187.5,,177.5,,,,,,177.5
3,M,B,Raw,Yes,82.5,Роман Фадеев,Roman Fadeev,O,1977-03-19,79.25,Russia,,,,,,142.5,150,152.5,,152.5,,,,,,152.5
4,M,B,Raw,Yes,82.5,Павел Белый,Pavel Bely,O,1978-06-03,78.1,Russia,,,,,,145,-150,150,,150,,,,,,150
5,M,B,Raw,Yes,82.5,Александр Григоров,Alexander Grigorov,O,1984-07-29,78.5,Russia,,,,,,132.5,145,-150,,145,,,,,,145
6,M,B,Raw,Yes,82.5,Денис Добрянский,Denis Dobryansky,O,1977-12-06,81.35,Russia,,,,,,145,-150,-150,,145,,,,,,145
7,M,B,Raw,Yes,82.5,Руслан Путивский,Ruslan Putivsky,O,1977-06-03,78.9,Russia,,,,,,115,125,132.5,,132.5,,,,,,132.5
1,M,B,Raw,Yes,90,Сергей Чернявский,Sergei Chernyavsky,T 13-15,1994-06-07,84.1,Russia,,,,,,100,105,-107.5,,105,,,,,,105
1,M,B,Raw,Yes,90,Артем Логунов,Artem Logunov,T 18-19,1991-01-30,88.9,Russia,,,,,,175,180.5,185,,185,,,,,,185
2,M,B,Raw,Yes,90,Иван Анучин,Ivan Anuchin,T 18-19,1990-04-17,82.1,Russia,,,,,,140,145,147.5,,147.5,,,,,,147.5
1,M,B,Raw,Yes,90,Андрей Сапожонков,Andrei Sapozhonkov,Ю 20-23,1987-06-26,87.9,Russia,,,,,,190,-195,-197.5,,190,,,,,,190
1,M,B,Raw,Yes,90,Бахтияр Мухаметов,Bahtiyar Mukhametov,М 40-44,1970-02-18,88,Kyrgyzstan,,,,,,140,-150,-150,,140,,,,,,140
1,M,B,Raw,Yes,90,Бакыт Керимбеков,Bakyt Kerimbekov,М 45-49,1961-07-07,88.7,Kyrgyzstan,,,,,,115,-125,-130,,115,,,,,,115
1,M,B,Raw,Yes,90,Евгений Малышев,Yevgeny Malyshev,60-64,1949-03-04,87.85,Russia,,,,,,90,95,,,95,,,,,,95
1,M,B,Raw,Yes,90,Вадим Собанин,Vadim Sobanin,O,1975-06-09,86.7,Russia,,,,,,155,160,-165,,160,,,,,,160
2,M,B,Raw,Yes,90,Евгений Малов,Yevgeny Malov,O,1979-11-14,86.3,Russia,,,,,,-155,-155,155,,155,,,,,,155
3,M,B,Raw,Yes,90,Андрей Чехонадских,Andrei Chekhanadskikh,O,1975-11-19,87.2,Russia,,,,,,150,155,-157.5,,155,,,,,,155
4,M,B,Raw,Yes,90,Алексей Кузин,Alexei Kuzin,O,1972-07-16,88.6,Russia,,,,,,147.5,150,-155,,150,,,,,,150
5,M,B,Raw,Yes,90,Сергей Гирявенко,Sergei Giryavenko,O,1978-01-07,88.2,Russia,,,,,,132.5,137.5,145,,145,,,,,,145
1,M,B,Raw,Yes,100,Асланбек Камбиев,Aslanbek Kambiev,Ю 20-23,1986-12-05,90.7,Russia,,,,,,170,-175,-177.5,,170,,,,,,170
1,M,B,Raw,Yes,100,Андрей Суслин,Andrei Suslin,М 40-44,1968-04-21,97.6,Russia,,,,,,155,-162.5,-162.5,,155,,,,,,155
2,M,B,Raw,Yes,100,Евгений Фадеев,Yevgeny Fadeev,М 40-44,1967-01-28,98.55,Russia,,,,,,140,147.5,-157.5,,147.5,,,,,,147.5
1,M,B,Raw,Yes,100,Володимир Чигиринський,Volodymyr Chygyrynskyy,М 45-49,1962-12-07,94.3,Ukraine,,,,,,,130,135,,135,,,,,,135
1,M,B,Raw,Yes,100,Михаил Бобков,Mikhail Bobkov,М 60-64,1947-11-21,95.8,Russia,,,,,,70,80,,,80,,,,,,80
1,M,B,Raw,Yes,100,Дмитрий Козик,Dmitry Kozik,O,1976-04-06,98,Russia,,,,,,177.5,182.5,187.5,,187.5,,,,,,187.5
2,M,B,Raw,Yes,100,Александр Чередниченко,Alexander Cherednichenko,O,1975-09-18,96.3,Russia,,,,,,165,-175,177.5,,177.5,,,,,,177.5
3,M,B,Raw,Yes,100,Дмитрий Проклин,Dmitry Proklin,O,1976-05-09,96.8,Russia,,,,,,162.5,175,-185,,175,,,,,,175
4,M,B,Raw,Yes,100,Асланбек Камбиев,Aslanbek Kambiev,O,1986-12-05,90.7,Russia,,,,,,170,-175,-177.5,,170,,,,,,170
5,M,B,Raw,Yes,100,Роман Красичков,Roman Krasichkov,O,1973-09-06,95.6,Russia,,,,,,150,162.5,-175,,162.5,,,,,,162.5
1,M,B,Raw,Yes,110,Семен Лобов,Semen Lobov,М 40-44,1985-02-12,103,Russia,,,,,,145,150,-152.5,,150,,,,,,150
1,M,B,Raw,Yes,110,Василий Чернышенко,Vasily Chernyshenko,М 45-49,1963-05-25,108.7,Russia,,,,,,130,140,-147.5,,140,,,,,,140
1,M,B,Raw,Yes,110,Роман Тихонов,Roman Tikhonov,O,1976-07-11,107.3,Russia,,,,,,187.5,195,202.5,,202.5,,,,,,202.5
2,M,B,Raw,Yes,110,Андрей Шаров,Andrei Sharov,O,1974-02-07,109.65,Russia,,,,,,180,182.5,185,,185,,,,,,185
3,M,B,Raw,Yes,110,Сергей Терехов,Sergei Terekhov,O,1985-05-09,107,Russia,,,,,,170,-180,-185,,170,,,,,,170
4,M,B,Raw,Yes,110,Виталий Андриякин,Vitaly Andriyakin,O,1983-06-23,108,Russia,,,,,,150,-167.5,-167.5,,150,,,,,,150
1,M,B,Raw,Yes,125,Денис Оглоблин,Denis Ogloblin,М 40-44,1967-05-12,112.8,Russia,,,,,,190,195,197.5,200,197.5,,,,,,197.5
1,M,B,Raw,Yes,125,Павел Вишницкий,Pavel Vishnitsky,М 45-49,1964-10-28,115.8,Russia,,,,,,140,152.5,-162.5,,152.5,,,,,,152.5
1,M,B,Raw,Yes,125,Андрей Завгородний,Andrei Zavgorodniy,O,1981-04-04,119.9,Russia,,,,,,220,-232.5,-232.5,,220,,,,,,220
2,M,B,Raw,Yes,125,Денис Оглоблин,Denis Ogloblin,O,1967-05-12,112.8,Russia,,,,,,190,195,197.5,,197.5,,,,,,197.5
1,M,B,Raw,Yes,140,Сергей Доронин,Sergei Doronin,Ю 20-23,1986-06-14,134.4,Russia,,,,,,195,202.5,207.5,,207.5,,,,,,207.5
1,M,B,Raw,Yes,140,Андрей Мелкозеров,Andrei Melkozerov,O,1971-11-19,129.8,Russia,,,,,,215,-225,-225,,215,,,,,,215
2,M,B,Raw,Yes,140,Сергей Муханько,Sergei Mukhanko,O,1980-04-27,129.5,Russia,,,,,,140,147.5,152.5,,152.5,,,,,,152.5
3,M,B,Raw,Yes,140,Андрей Сабынин,Andrei Sabynin,O,1970-08-11,127.15,Russia,,,,,,125,130,-137.5,,130,,,,,,130
1,F,B,Multi-ply,Yes,48,Ирина Дудырева,Irina Dudyreva,18-19,1990-04-15,47.7,Russia,,,,,,-65,65,72.5,-73,72.5,,,,,,72.5
1,F,B,Multi-ply,Yes,52,Надежда Реутова,Nadezhda Reutova,16-17,1993-01-30,51.5,Russia,,,,,,50,52.5,-55,,52.5,,,,,,52.5
1,F,B,Multi-ply,Yes,56,Наталья Блинкова,Natalya Blinkova,16-17,1992-04-25,54.8,Russia,,,,,,77.5,-82.5,-82.5,,77.5,,,,,,77.5
1,F,B,Multi-ply,Yes,56,Анастасия Ладыгина,Anastasia Ladygina,18-19,1990-09-25,54.5,Russia,,,,,,57.5,60,-62.5,,60,,,,,,60
1,F,B,Multi-ply,Yes,60,Ольга Тельпова,Olga Telpova,Open,1986-03-18,59.4,Russia,,,,,,82.5,-87.5,87.5,88,87.5,,,,,,87.5
1,F,B,Multi-ply,Yes,82.5,Светлана Синачева,Svetlana Sinacheva,Open,1966-12-15,77.1,Russia,,,,,,-115,115,-120,,115,,,,,,115
1,M,B,Multi-ply,Yes,60,Виталий Михин,Vitaly Mikhin,16-17,1993-12-11,59.3,Russia,,,,,,100,107.5,-112.5,,107.5,,,,,,107.5
2,M,B,Multi-ply,Yes,60,Игорь Ястребцов,Igor Yastrebtsov,16-17,1993-02-24,60,Russia,,,,,,85,90,-92.5,,90,,,,,,90
DQ,M,B,Multi-ply,Yes,60,Александр Доброходов,Alexander Dobrokhodov,Open,1981-12-11,59,Russia,,,,,,-125,-125,-125,,,,,,,,
1,M,B,Multi-ply,Yes,67.5,Сергей Алампиев,Sergei Alampiev,50-54,1957-04-07,66.2,Russia,,,,,,130,-140,-140,,130,,,,,,130
1,M,B,Multi-ply,Yes,67.5,Юрий Киселев,Yuri Kiselyov,70-74,1937-11-12,65.7,Russia,,,,,,75,80,,,80,,,,,,80
1,M,B,Multi-ply,Yes,67.5,Руслан Коротков,Ruslan Korotkov,Open,1980-12-19,66.2,Kazakhstan,,,,,,170,175,180,,180,,,,,,180
2,M,B,Multi-ply,Yes,67.5,Дмитрий Колистратов,Dmitry Kalistratov,Open,1977-03-08,67.4,Russia,,,,,,150,-162.5,-162.5,,150,,,,,,150
3,M,B,Multi-ply,Yes,67.5,Юрий Волков,Yuri Volkov,Open,1984-09-05,67.4,Russia,,,,,,125,-132.5,,,125,,,,,,125
DQ,M,B,Multi-ply,Yes,67.5,Роман Петраков,Roman Petrakov,Open,1981-06-13,65.9,Russia,,,,,,-120,,,,,,,,,,
1,M,B,Multi-ply,Yes,75,Виталий Голубев,Vitaly Golubev,18-19,1991-03-20,74.3,Russia,,,,,,150,157.5,-165,,157.5,,,,,,157.5
1,M,B,Multi-ply,Yes,75,Станислав Милостной,Stanislav Milostnoy,Open,1978-12-19,72.9,Russia,,,,,,190,215.5,-220,,215.5,,,,,,215
2,M,B,Multi-ply,Yes,75,Евгений Буров,Yevgeny Burov,Open,1982-04-11,75,Russia,,,,,,160,-167.5,-167.5,,160,,,,,,160
3,M,B,Multi-ply,Yes,75,Николай Кравченко,Nikolai Kravchenko,Open,1986-11-03,73.9,Russia,,,,,,157.5,-165,-165,,157.5,,,,,,157.5
4,M,B,Multi-ply,Yes,75,Виктор Косенко,Viktor Kosenko,Open,1972-03-30,75,Russia,,,,,,140,-145,-145,,140,,,,,,140
DQ,M,B,Multi-ply,Yes,75,Андрей Веселов,Andrei Veselov,Open,1975-11-11,73,Russia,,,,,,-150,-150,-150,,,,,,,,
1,M,B,Multi-ply,Yes,82.5,Александр Карпенко,Alexander Karpenko,16-17,1992-04-25,76,Russia,,,,,,150,-160,160,170,160,,,,,,160
1,M,B,Multi-ply,Yes,82.5,Ринат Абубекиров,Rinat Abubekirov,20-23,1986-10-01,81.4,Russia,,,,,,-195,195,-202.5,,195,,,,,,195
1,M,B,Multi-ply,Yes,82.5,Виктор Мистратов,Viktor Mistratov,Open,1981-02-10,81.5,Russia,,,,,,190,205,-210,,205,,,,,,205
2,M,B,Multi-ply,Yes,82.5,Денис Добрянский,Denis Dobryansky,Open,1977-12-06,81.35,Russia,,,,,,-170,,170,,170,,,,,,170
1,M,B,Multi-ply,Yes,90,Бахтияр Мухаметов,Bahtiyar Mukhametov,40-44,1970-02-18,87,Kyrgyzstan,,,,,,-165,170,-180,,170,,,,,,170
2,M,B,Multi-ply,Yes,90,Сергей Косарев,Sergei Kosarev,40-44,1968-01-18,88.9,Russia,,,,,,-170,-170,170,,170,,,,,,170
1,M,B,Multi-ply,Yes,90,Бакыт Керимбеков,Bakyt Kerimbekov,45-49,1961-07-07,89.9,Kyrgyzstan,,,,,,-150,-160,160,,160,,,,,,160
DQ,M,B,Multi-ply,Yes,90,Евгений Малышев,Yevgeny Malyshev,60-64,1949-03-04,87.3,Russia,,,,,,-105,-105,,,,,,,,,
1,M,B,Multi-ply,Yes,90,Михаил Вебер,Mikhail Veber,Open,1971-07-29,89.4,Russia,,,,,,230,240,-247.5,,240,,,,,,240
2,M,B,Multi-ply,Yes,90,Алексей Голионко,Alexei Golionko,Open,1979-07-25,86.7,Kyrgyzstan,,,,,,225,235,-240,,235,,,,,,235
3,M,B,Multi-ply,Yes,90,Евгений Уваров,Yevgeny Uvarov,Open,1977-02-03,88.5,Russia,,,,,,190,200,210,,210,,,,,,210
1,M,B,Multi-ply,Yes,100,Александр Петров,Alexander Petrov,45-49,1960-07-17,92,Russia,,,,,,220,-227.5,230,,230,,,,,,230
1,M,B,Multi-ply,Yes,100,Николай Соловьев,Nikolai Solovyov,Open,1968-06-21,97.1,Russia,,,,,,232.5,-245,-245,,232.5,,,,,,232.5
2,M,B,Multi-ply,Yes,100,Александр Петров,Alexander Petrov,Open,1960-07-17,92,Russia,,,,,,220,-227.5,230,,230,,,,,,230
3,M,B,Multi-ply,Yes,100,Владимир Щукин,Vladimir Shchukin,Open,1980-03-15,99.1,Russia,,,,,,-210,210,-222.5,,210,,,,,,210
4,M,B,Multi-ply,Yes,100,Валерий Курочкин,Valery Kurochkin,Open,1978-11-09,99.3,Russia,,,,,,210,-250,-250,,210,,,,,,210
5,M,B,Multi-ply,Yes,100,Сергей Гуськов,Sergei Guskov,Open,1981-09-28,99.5,Russia,,,,,,-210,210,-222.5,,210,,,,,,210
1,M,B,Multi-ply,Yes,110,Евгений Фархутдинов,Yevgeny Farkhutdinov,40-44,1968-03-09,108,Russia,,,,,,-190,190,205,,205,,,,,,205
1,M,B,Multi-ply,Yes,125,Павел Яговкин,Pavel Yagovkin,50-54,1959-07-27,118.7,Russia,,,,,,-250,250,-260,,250,,,,,,250
1,M,B,Multi-ply,Yes,125,Павел Яговкин,Pavel Yagovkin,Open,1959-07-27,118.7,Russia,,,,,,-250,250,-260,,250,,,,,,250
2,M,B,Multi-ply,Yes,125,Андрей Федосеев,Andrei Fedoseev,Open,1974-03-03,112.2,Russia,,,,,,-190,190,205,,205,,,,,,205
DQ,M,B,Multi-ply,Yes,125,Виталий Адриякин,Vitaly Adriyakin,Open,1983-06-23,108.8,Russia,,,,,,-150,,,,,,,,,,
1,M,B,Multi-ply,Yes,125,Алексей Воронков,Alexei Voronkov,20-23,1989-03-13,120,Russia,,,,,,-210,-210,210,,210,,,,,,210
1,M,B,Multi-ply,Yes,140,Дмитрий Смирнов,Dmitry Smirnov,Open,1971-12-18,139.6,Russia,,,,,,260,-285,-285,,260,,,,,,260
2,M,B,Multi-ply,Yes,140,Виталий Половников,Vitaly Polovnikov,Open,1977-08-15,129.4,Russia,,,,,,-210,210,-222.5,,210,,,,,,210
1,F,B,Raw,No,60,Марина Медведева,Marina Medvedeva,Open,1974-09-05,60,Russia,,,,,,95,100,105,110,105,,,,,,105
1,F,B,Raw,No,67.5,Мария Егоренкова,Maria Yegorenkova,20-23,1989-05-26,63.6,Russia,,,,,,65,70,-75,,70,,,,,,70
1,F,B,Raw,No,82.5,Анна Тураева,Anna Turaeva,Open,1978-08-18,81.7,Russia,,,,,,117.5,125,,,125,,,,,,125
1,M,B,Raw,No,52,Сергей Баканов,Sergei Bakanov,Open,1985-10-25,47.85,Russia,,,,,,80,90,102.5,,102.5,,,,,,102.5
1,M,B,Raw,No,56,Юрий Клочков,Yuri Klochkov,65-69,1942-01-16,54.25,Russia,,,,,,70,75,-77.5,,75,,,,,,75
1,M,B,Raw,No,60,Михаил Приданников,Mikhail Pridannikov,Open,1986-03-20,59.2,Russia,,,,,,87.5,95,-100,,95,,,,,,95
1,M,B,Raw,No,67.5,Владимир Устинов,Vladimir Ustinov,Open,1986-03-16,66.8,Russia,,,,,,135,145,-152.5,,145,,,,,,145
1,M,B,Raw,No,82.5,Алексей Манюков,Alexei Manyukov,13-15,1994-07-08,77.2,Russia,,,,,,-87.5,90,95,100,95,,,,,,95
1,M,B,Raw,No,82.5,Дмитрий Кухаренко,Dmitry Kukharenko,40-44,1969-01-22,79.8,Russia,,,,,,167.5,175,-180,,175,,,,,,175
1,M,B,Raw,No,82.5,Борис Кузнецов,Boris Kuznetsov,50-54,1958-01-09,80.1,Russia,,,,,,115,-125,125,,125,,,,,,125
1,M,B,Raw,No,82.5,Андрей Кильдюшев,Andrei Kildyushev,Open,1988-08-04,81.15,Russia,,,,,,170,180,190,,190,,,,,,190
2,M,B,Raw,No,82.5,Игорь Передрий,Igor Peredriy,Open,1977-07-16,81.7,Russia,,,,,,170,-177.5,-185,,170,,,,,,170
3,M,B,Raw,No,82.5,Артем Архипов,Artem Arkhipov,Open,1982-03-24,77.2,Russia,,,,,,145,155,-170,,155,,,,,,155
1,M,B,Raw,No,90,Евгений Баторевич,Yevgeny Batorevich,20-23,1986-11-28,89.55,Russia,,,,,,-155,160,-172.5,,160,,,,,,160
1,M,B,Raw,No,90,Георгий Авдонин,Georgy Avdonin,40-44,1969-09-10,86.5,Russia,,,,,,155,160,-165,,160,,,,,,160
1,M,B,Raw,No,90,Сергей Дружков,Sergei Druzhkov,60-64,1950-01-01,85.5,Russia,,,,,,125,-143,143,,143,,,,,,142.5
1,M,B,Raw,No,90,Владимир Малышев,Vladimir Malyshev,70-74,1936-09-07,87.6,Russia,,,,,,127.5,135,-137.5,,135,,,,,,135
1,M,B,Raw,No,90,Георгий Авдонин,Georgy Avdonin,Open,1969-09-10,86.5,Russia,,,,,,155,160,-165,,160,,,,,,160
1,M,B,Raw,No,100,Руслан Хабибулин,Ruslan Khabibulin,18-19,1990-04-26,92.9,Russia,,,,,,160,175,185,,185,,,,,,185
1,M,B,Raw,No,100,Антон Долгих,Anton Dolgikh,20-23,1987-09-25,97.7,Russia,,,,,,-175,175,-180,,175,,,,,,175
1,M,B,Raw,No,100,Вячеслав Франк,Vyacheslav Frank,45-49,1962-03-03,96.8,Russia,,,,,,120,127.5,-132.5,,127.5,,,,,,127.5
1,M,B,Raw,No,100,Калимулла Мурзаханов,Kalimulla Murzakhanov,50-54,1955-07-29,99,Russia,,,,,,160,167.5,-172.5,,167.5,,,,,,167.5
1,M,B,Raw,No,100,Павел Лаптенок,Pavel Laptenok,55-59,1953-01-26,97.9,Russia,,,,,,125,132.5,137.5,,137.5,,,,,,137.5
1,M,B,Raw,No,100,Павел Зверев,Pavel Zverev,Open,1975-01-22,99.9,Russia,,,,,,210,-220,-220,,210,,,,,,210
1,M,B,Raw,No,110,Дмитрий Долгов,Dmitry Dolgov,20-23,1986-10-03,106.4,Russia,,,,,,190,-200,-200,,190,,,,,,190
2,M,B,Raw,No,110,Денис Нагибин,Denis Nagibin,20-23,1986-08-14,100.8,Russia,,,,,,-170,170,180,,180,,,,,,180
1,M,B,Raw,No,110,Сергей Громов,Sergei Gromov,40-44,1966-09-02,102.9,Russia,,,,,,170,180,-190,,180,,,,,,180
2,M,B,Raw,No,110,Денис Седнев,Denis Sednev,40-44,1969-08-11,104.7,Russia,,,,,,155,,,,155,,,,,,155
1,M,B,Raw,No,110,Юрий Усольцев,Yuri Usoltsev,45-49,1964-08-07,109.2,Russia,,,,,,175,185,190,,190,,,,,,190
1,M,B,Raw,No,110,Олег Сайденцаль,Oleg Saidentsal,Open,1975-03-14,108.25,Russia,,,,,,230,235,240,,240,,,,,,240
2,M,B,Raw,No,110,Игорь Чистяков,Igor Chistyakov,Open,1975-06-05,105.85,Russia,,,,,,190,-200,-205,,190,,,,,,190
DQ,M,B,Raw,No,110,Дмитрий Тенетко,Dmitry Tenetko,Open,1975-08-11,108.5,Russia,,,,,,-230,-230,-230,,,,,,,,
1,M,B,Raw,No,125,Станислав Колачев,Stanislav Kolachev,20-23,1987-03-20,113.25,Russia,,,,,,190,200,-210,,200,,,,,,200
1,M,B,Raw,No,125,Вячеслав Приходько,Vyacheslav Prikhodko,40-44,1968-10-15,124.8,Russia,,,,,,210,-220,,,210,,,,,,210
2,M,B,Raw,No,125,Дмитрий Шведов-Виардо,Dmitry Shvedov-Viardo,40-44,1968-07-01,116.2,Russia,,,,,,175,180,182.5,,182.5,,,,,,182.5
3,M,B,Raw,No,125,Сергей Лылов,Sergei Lylov,40-44,1968-12-27,117.7,Russia,,,,,,160,175,-182.5,,175,,,,,,175
1,M,B,Raw,No,125,Николай Чернов,Nikolai Chernov,45-49,1961-08-15,111.5,Russia,,,,,,-160,170,-185,,170,,,,,,170
1,M,B,Raw,No,125,Сергей Молчанов,Sergei Molchanov,Open,1973-03-15,124.6,Russia,,,,,,247.5,255,260,,260,,,,,,260
2,M,B,Raw,No,125,Алексей Гуркин,Alexei Gurkin,Open,1973-05-29,114.2,Russia,,,,,,237.5,245,-250,,245,,,,,,245
3,M,B,Raw,No,125,Сергей Федоров,Sergei Fedorov,Open,1983-10-23,119.7,Russia,,,,,,230,-235,-235,,230,,,,,,230
4,M,B,Raw,No,125,Владислав Манюков,Vladislav Matykov,Open,1972-08-27,114.1,Russia,,,,,,180,,,,180,,,,,,180
1,M,B,Raw,No,140,Виктор Козлов,Viktor Kozlov,45-49,1963-03-23,128.2,Russia,,,,,,185,195,-202.5,,195,,,,,,195
1,M,B,Raw,No,140,Евгений Гуляев,Yevgeny Gulyaev,Open,1976-05-11,136.3,Russia,,,,,,240,245,,,245,,,,,,245
2,M,B,Raw,No,140,Виктор Малюгин,Viktor Malyugin,Open,1990-08-18,127.1,Russia,,,,,,215,225,230,,230,,,,,,230
3,M,B,Raw,No,140,Роман Марачев,Roman Marachev,Open,1988-05-16,128.5,Russia,,,,,,190,-200,200,,200,,,,,,200
1,M,B,Raw,No,140+,Роман Поляков,Roman Polyakov,Open,1975-10-30,154.6,Russia,,,,,,230,250,260,,260,,,,,,260
2,M,B,Raw,No,140+,Вадим Коркин,Vadim Korkin,Open,1975-04-12,161.4,Russia,,,,,,200,210,,,210,,,,,,210
1,F,B,Multi-ply,No,67.5,Наталья Ловцова,Natalya Lovtsova,20-23,1986-05-29,65.2,Russia,,,,,,110,-120,120,,120,,,,,,120
2,F,B,Multi-ply,No,67.5,Мария Егоренкова,Maria Yegorenkova,20-23,1989-05-26,63.4,Russia,,,,,,-97.5,-97.5,97.5,,97.5,,,,,,97.5
1,F,B,Multi-ply,No,75,Юлия Медведева,Yulia Medvedeva,Open,1979-07-08,74.9,Russia,,,,,,-165,-165,165,170.5,165,,,,,,165
1,F,B,Multi-ply,No,82.5,Анна Тураева,Anna Turaeva,Open,1978-08-18,81,Russia,,,,,,160,170,-175,,170,,,,,,170
1,M,B,Multi-ply,No,52,Сергей Баканов,Sergei Bakanov,Open,1985-10-25,48.3,Russia,,,,,,105,115,120,,120,,,,,,120
1,M,B,Multi-ply,No,60,Михаил Приданников,Mikhail Pridannikov,Open,1986-03-20,59.1,Russia,,,,,,150,165,-172.5,,165,,,,,,165
1,M,B,Multi-ply,No,75,Роман Короглишвили,Roman Koroglishvili,16-17,1992-07-17,74.6,Russia,,,,,,-165,165,-175,,165,,,,,,165
1,M,B,Multi-ply,No,75,Андрей Куляев,Andrei Kulyaev,20-23,1986-10-07,69.5,Russia,,,,,,-100,100,-110,,100,,,,,,100
1,M,B,Multi-ply,No,75,Юрий Чепец,Yuriy Chepets,65-69,1943-04-19,74.1,Russia,,,,,,165.5,170,172.5,,172.5,,,,,,172.5
1,M,B,Multi-ply,No,75,Илья Кокорев,Ilya Kokorev,Open,1973-01-19,74.8,Russia,,,,,,210,220,-235.5,,220,,,,,,220
1,M,B,Multi-ply,No,82.5,Дмитрий Осипов,Dmitry Osipov,20-23,1987-05-31,79.1,Russia,,,,,,-185,185,195,,195,,,,,,195
1,M,B,Multi-ply,No,82.5,Константин Дременков,Konstantin Dremenkov,40-44,1966-07-21,81.8,Belarus,,,,,,-192.5,192.5,200,,200,,,,,,200
1,M,B,Multi-ply,No,82.5,Максим Неткач,Maxim Netkach,Open,1977-05-11,81.5,Russia,,,,,,235,240,-245,,240,,,,,,240
2,M,B,Multi-ply,No,82.5,Олег Валиев,Oleg Valiev,Open,1985-03-09,81,Russia,,,,,,182.5,-192.5,192.5,,192.5,,,,,,192.5
DQ,M,B,Multi-ply,No,82.5,Юрий Добрынин,Yuri Dobrynin,Open,1971-02-13,82.5,Russia,,,,,,-192.5,-192.5,-192.5,,,,,,,,
1,M,B,Multi-ply,No,90,Георгий Авдонин,Georgy Avdonin,40-44,1969-09-10,87.3,Russia,,,,,,180,-190,192.5,,192.5,,,,,,192.5
1,M,B,Multi-ply,No,90,Юрий Петряков,Yuri Petryakov,45-49,1964-02-23,89.1,Russia,,,,,,-210,-210,210,,210,,,,,,210
2,M,B,Multi-ply,No,90,Юрий Кориков,Yuri Korikov,45-49,1962-04-24,90,Russia,,,,,,190,202.5,-207.5,,202.5,,,,,,202.5
1,M,B,Multi-ply,No,90,Сергей Дружков,Sergei Druzhkov,60-64,1950-01-01,85,Russia,,,,,,-175,-175,175,,175,,,,,,175
2,M,B,Multi-ply,No,90,Евгений Худолеев,Yevgeny Khudoleev,60-64,1946-09-10,89.5,Russia,,,,,,150,160,170,,170,,,,,,170
1,M,B,Multi-ply,No,90,Евгений Нечаев,Evgeniy Nechaev,Open,1978-02-10,89.65,Russia,,,,,,300,315,323,,323,,,,,,322.5
2,M,B,Multi-ply,No,90,Игорь Кириченко,Igor Kirichenko,Open,1975-02-24,89.3,Russia,,,,,,205,215,-220,,215,,,,,,215
3,M,B,Multi-ply,No,90,Юрий Петряков,Yuri Petryakov,Open,1964-02-23,89.1,Russia,,,,,,-210,-210,210,,210,,,,,,210
4,M,B,Multi-ply,No,90,Илья Лебедев,Ilya Lebedev,Open,1972-02-12,90,Russia,,,,,,180,210,-217.5,,210,,,,,,210
5,M,B,Multi-ply,No,90,Юрий Кориков,Yuri Korikov,Open,1962-04-24,90,Russia,,,,,,190,202.5,-207.5,,202.5,,,,,,202.5
DQ,M,B,Multi-ply,No,90,Андрей Борсук,Andrei Borsuk,Open,1976-04-05,88.7,Belarus,,,,,,-202.5,-202.5,-202.5,,,,,,,,
1,M,B,Multi-ply,No,100,Александр Панаскин,Alexander Panaskin,18-19,1991-06-27,96.8,Russia,,,,,,190,210,222.5,,222.5,,,,,,222.5
2,M,B,Multi-ply,No,100,Руслан Хабибулин,Ruslan Khabibulin,18-19,1990-04-26,92.9,Russia,,,,,,200,210,220,,220,,,,,,220
1,M,B,Multi-ply,No,100,Калимулла Мурзаханов,Kalimulla Murzakhanov,50-54,1955-07-29,99.2,Russia,,,,,,-180,180,190,,190,,,,,,190
1,M,B,Multi-ply,No,100,Павел Лаптенок,Pavel Laptenok,55-59,1953-01-26,99.3,Russia,,,,,,140,150,160,,160,,,,,,160
1,M,B,Multi-ply,No,100,Роман Анпилогов,Roman Anpilogov,Open,1980-07-14,99.8,Russia,,,,,,280,290,-300,,290,,,,,,290
2,M,B,Multi-ply,No,100,Азамат Кочкаров,Azamat Kochkarov,Open,1983-07-18,100,Russia,,,,,,-245,-250,250,,250,,,,,,250
3,M,B,Multi-ply,No,100,Алексей Курочкин,Alexei Kurochkin,Open,1973-03-18,98.2,Russia,,,,,,220,-240,-240,,220,,,,,,220
4,M,B,Multi-ply,No,100,Александр Иванов,Alexander Ivanov,Open,1976-04-10,99,Russia,,,,,,200,210,220,,220,,,,,,220
DQ,M,B,Multi-ply,No,100,Никита Байдак,Nikita Baydak,Open,1985-09-18,99.8,Russia,,,,,,-210,-220,-220,,,,,,,,
1,M,B,Multi-ply,No,110,Павел Кобелев,Pavel Kobelev,18-19,1990-07-14,110,Russia,,,,,,170,180,-190,,180,,,,,,180
1,M,B,Multi-ply,No,110,Виктор Найденов,Viktor Naidenov,20-23,1987-01-25,108.8,Russia,,,,,,330,341,-352.5,,341,,,,,,341
2,M,B,Multi-ply,No,110,Станислав Колачев,Stanislav Kolachev,20-23,1987-03-20,109.6,Russia,,,,,,260,-280,-280,,260,,,,,,260
3,M,B,Multi-ply,No,110,Дмитрий Пысь,Dmitry Pys',20-23,1986-05-04,102.7,Russia,,,,,,240,-250,-250,,240,,,,,,240
1,M,B,Multi-ply,No,110,Дмитрий Горбачев,Dmitry Gorbachev,40-44,1970-03-06,109.8,Russia,,,,,,320,330,-342.5,,330,,,,,,330
DQ,M,B,Multi-ply,No,110,Денис Седнев,Denis Sednev,40-44,1969-08-11,104.7,Russia,,,,,,-210,-210,-210,,,,,,,,
1,M,B,Multi-ply,No,110,Юрий Усольцев,Yuri Usoltsev,45-49,1964-08-07,110,Russia,,,,,,200,210,215,,215,,,,,,215
1,M,B,Multi-ply,No,110,Виктор Найденов,Viktor Naidenov,Open,1987-01-25,108.8,Russia,,,,,,330,341,-352.5,,341,,,,,,341
2,M,B,Multi-ply,No,110,Дмитрий Горбачев,Dmitry Gorbachev,Open,1970-03-06,109.8,Russia,,,,,,320,330,-342.5,,330,,,,,,330
3,M,B,Multi-ply,No,110,Олег Сайденцаль,Oleg Saidentsal,Open,1975-03-14,108.3,Russia,,,,,,280,-290,290,,290,,,,,,290
4,M,B,Multi-ply,No,110,Сергей Пономарев,Sergei Ponomarev,Open,1982-03-05,104.1,Russia,,,,,,-250,-250,250,,250,,,,,,250
DQ,M,B,Multi-ply,No,110,Игорь Голубицкий,Igor Golubitsky,Open,1968-08-02,105.3,Russia,,,,,,-235,-235,-235,,,,,,,,
1,M,B,Multi-ply,No,125,Виталий Машкевич,Vitaly Mashkevich,20-23,1989-08-18,112.6,Russia,,,,,,-240,240,255,,255,,,,,,255
1,M,B,Multi-ply,No,125,Александр Третьяков,Alexander Tretyakov,40-44,1967-06-14,112.4,Russia,,,,,,332.5,-342.5,-350.5,,332.5,,,,,,332.5
2,M,B,Multi-ply,No,125,Вячеслав Приходько,Vyacheslav Prikhodko,40-44,1968-10-15,124.8,Russia,,,,,,240,250,-260,,250,,,,,,250
3,M,B,Multi-ply,No,125,Александр Пономарев,Alexander Ponomarev,40-44,1967-02-27,110.8,Russia,,,,,,230,-240,-240,,230,,,,,,230
4,M,B,Multi-ply,No,125,Дмитрий Шведов-Виардо,Dmitry Shvedov-Viardo,40-44,1968-07-01,115.7,Russia,,,,,,-200,200,210,,210,,,,,,210
1,M,B,Multi-ply,No,125,Александр Третьяков,Alexander Tretyakov,Open,1967-06-14,112.4,Russia,,,,,,332.5,-342.5,-350.5,,332.5,,,,,,332.5
2,M,B,Multi-ply,No,125,Сергей Молчанов,Sergei Molchanov,Open,1973-03-15,124.1,Russia,,,,,,-310,-310,310,,310,,,,,,310
3,M,B,Multi-ply,No,125,Сергей Стародубский,Sergei Starodubsky,Open,1977-12-20,113.4,Russia,,,,,,305,-322.5,-322.5,,305,,,,,,305
DQ,M,B,Multi-ply,No,125,Владислав Манюков,Vladislav Manyukov,Open,1972-08-27,114.7,Russia,,,,,,-250,,,,,,,,,,
DQ,M,B,Multi-ply,No,125,Алексей Гуркин,Alexei Gurkin,Open,1973-05-29,115.4,Russia,,,,,,-270,,,,,,,,,,
DQ,M,B,Multi-ply,No,125,Дмитрий Смирнов,Dmitry Smirnov,Open,1971-12-18,123.3,Russia,,,,,,-270,-270,-270,,,,,,,,
DQ,M,B,Multi-ply,No,125,Ираклий Конджария,Irakly Koydzgariya,Open,1977-09-12,124.8,Russia,,,,,,-310,-310,-312.5,,,,,,,,
1,M,B,Multi-ply,No,140,Владимир Максимов,Vladimir Maksimov,40-44,1966-06-07,132.2,Russia,,,,,,390,402.5,405,,405,,,,,,405
1,M,B,Multi-ply,No,140,Георгий Лопацкий,Georgy Lopatsky,45-49,1962-05-16,129.1,Russia,,,,,,275,-300.5,-300.5,,275,,,,,,275
1,M,B,Multi-ply,No,140,Владимир Максимов,Vladimir Maksimov,Open,1966-06-07,132.2,Russia,,,,,,390,402.5,405,,405,,,,,,405
2,M,B,Multi-ply,No,140,Георгий Лопацкий,Georgy Lopatsky,Open,1962-05-16,129.1,Russia,,,,,,275,-300.5,-300.5,,275,,,,,,275
3,M,B,Multi-ply,No,140,Сергей Новиков,Sergei Novikov,Open,1977-01-28,137.3,Russia,,,,,,-252.5,252.5,-260,,252.5,,,,,,252.5
DQ,M,B,Multi-ply,No,140,Роман Марачев,Roman Marachev,Open,1988-05-16,130.3,Russia,,,,,,-245,-252.5,-252.5,,,,,,,,
1,M,B,Multi-ply,No,140+,Роман Поляков,Roman Polyakov,Open,1975-10-30,155.9,Russia,,,,,,300,310,-315,,310,,,,,,310
2,M,B,Multi-ply,No,140+,Алексей Бражкин,Alexei Brazhkin,Open,1971-02-18,140.5,Russia,,,,,,290,305,-315,,305,,,,,,305
