Division,WeightClassKg,Place,Name,Team,BodyweightKg,Best3SquatKg,Best3BenchKg,Best3DeadliftKg,TotalKg,Equipment,Event,Sex
Boys,55.79,1,Diego Gallegos,Alvin,51.89,140.61,86.18,156.49,383.29,Single-ply,SBD,M
Boys,51.71,2,Ross Cowart,Huntsville,49.8,95.25,58.97,136.08,290.3,Single-ply,SBD,M
Boys,51.71,3,Clayton Coogler,Shepherd,50.35,111.13,61.23,111.13,283.5,Single-ply,SBD,M
Boys,55.79,1,Jordan White,Willis,53.8,124.74,70.31,124.74,319.78,Single-ply,SBD,M
Boys,55.79,2,Martin Rocha,Conroe Woodlands College Park,54.25,113.4,56.7,108.86,278.96,Single-ply,SBD,M
Boys,55.79,3,Conner Jackson,Willis,55.52,102.06,54.43,113.4,269.89,Single-ply,SBD,M
Boys,67.13,1,Gavin Kennedy,Alvin,60.06,136.08,70.31,163.29,369.68,Single-ply,SBD,M
Boys,59.87,2,Chase Watson,Shepherd,56.61,147.42,77.11,124.74,349.27,Single-ply,SBD,M
Boys,67.13,3,Zac Jenkins,Shepherd,60.06,147.42,61.23,138.35,347,Single-ply,SBD,M
Boys,59.87,4,Colton Richie,Conroe Woodlands College Park,57.97,127.01,77.11,136.08,340.19,Single-ply,SBD,M
Boys,59.87,5,Tyler Bond,New Caney,57.79,72.57,63.5,92.99,229.06,Single-ply,SBD,M
Boys,59.87,DQ,Kris Jordan,Trinity,58.69,142.88,79.38,,,Single-ply,SBD,M
Boys,74.84,1,Jacob de la Paz,Alvin,67.31,219.99,117.93,231.33,569.26,Single-ply,SBD,M
Boys,67.13,2,Brandon Coon,Conroe Caney Creek,64.59,190.51,90.72,201.85,483.08,Single-ply,SBD,M
Boys,67.13,3,Javier Vela,Shepherd,65.68,195.04,102.06,183.7,480.81,Single-ply,SBD,M
Boys,67.13,4,Kendrick Sonnier,Port Arthur Memorial,61.14,179.17,83.91,192.78,455.86,Single-ply,SBD,M
Boys,67.13,5,Trent Taylor,Shepherd,63.96,174.63,92.99,183.7,451.32,Single-ply,SBD,M
Boys,67.13,6,Arnaldo Garcia,Port Arthur Memorial,65.32,136.08,102.06,181.44,419.57,Single-ply,SBD,M
Boys,67.13,7,Dariun Hunter,Port Arthur Memorial,60.87,145.15,81.65,170.1,396.89,Single-ply,SBD,M
Boys,74.84,8,Daniel García,New Caney,67.22,176.9,68.04,145.15,390.09,Single-ply,SBD,M
Boys,67.13,9,Wyatt Tumlinson,Shepherd,64.86,147.42,74.84,154.22,376.48,Single-ply,SBD,M
Boys,67.13,10,Eduardo Gonzalez,Conroe Woodlands College Park,63.68,129.27,92.99,151.95,374.21,Single-ply,SBD,M
Boys,67.13,11,Josh Cota,Trinity,61.6,133.81,83.91,142.88,360.61,Single-ply,SBD,M
Boys,67.13,12,William Mattison,Conroe Caney Creek,66.95,111.13,72.57,142.88,326.59,Single-ply,SBD,M
Boys,67.13,13,Cameron Carson,Shepherd,61.87,92.99,52.16,113.4,258.55,Single-ply,SBD,M
Boys,67.13,DQ,Parker Hay,Trinity,66.41,142.88,142.88,,,Single-ply,SBD,M
Boys,74.84,1,Terrance Giles,Alvin,74.39,213.19,142.88,217.72,573.79,Single-ply,SBD,M
Boys,74.84,2,Victor Varela,Alvin,73.84,208.65,142.88,208.65,560.19,Single-ply,SBD,M
Boys,74.84,3,Eloi Fernandez,Alvin,74.75,208.65,136.08,215.46,560.19,Single-ply,SBD,M
Boys,74.84,4,Broch Saxton,New Waverly,74.21,197.31,129.27,206.38,532.97,Single-ply,SBD,M
Boys,74.84,5,Elvin Martinez,Huntsville,73.3,204.12,104.33,210.92,519.36,Single-ply,SBD,M
Boys,74.84,6,Leo Guerro,Trinity,74.75,183.7,124.74,183.7,492.15,Single-ply,SBD,M
Boys,74.84,7,Pedro Ott,Conroe Woodlands College Park,73.94,181.44,99.79,190.51,471.74,Single-ply,SBD,M
Boys,74.84,8,Nick Werner,Conroe Caney Creek,67.68,158.76,108.86,181.44,449.06,Single-ply,SBD,M
Boys,74.84,9,Tim Clay,New Caney Porter,73.75,158.76,102.06,163.29,424.11,Single-ply,SBD,M
Boys,74.84,10,Brandon Cheves,Shepherd,70.4,161.03,95.25,154.22,410.5,Single-ply,SBD,M
Boys,74.84,11,Mykel Williams,Conroe Woodlands College Park,68.86,127.01,77.11,165.56,369.68,Single-ply,SBD,M
Boys,74.84,12,Zach Bass,Willis,71.35,151.95,70.31,142.88,365.14,Single-ply,SBD,M
Boys,74.84,13,Clayton Bailey,Willis,72.08,104.33,61.23,142.88,308.44,Single-ply,SBD,M
Boys,82.1,14,Garrett King,Trinity,75.02,97.52,61.23,115.67,274.42,Single-ply,SBD,M
Boys,89.81,1,Antonio Moye,Shepherd,82.19,183.7,133.81,183.7,501.22,Single-ply,SBD,M
Boys,82.1,2,Jason Campbell,Conroe Woodlands College Park,77.93,181.44,102.06,210.92,494.42,Single-ply,SBD,M
Boys,82.1,3,Armando Cuevas,New Caney Porter,75.93,158.76,115.67,181.44,455.86,Single-ply,SBD,M
Boys,89.81,4,Kreg Williams,Willis,82.28,183.7,92.99,179.17,455.86,Single-ply,SBD,M
Boys,82.1,5,Christian Campbell,New Caney Porter,79.38,172.37,117.93,163.29,453.59,Single-ply,SBD,M
Boys,82.1,DQ,Caleb Butler,Huntsville,79.2,117.93,,,,Single-ply,SBD,M
Boys,89.81,1,Logan Phillips,Conroe Caney Creek,89.72,254.01,165.56,240.4,659.98,Single-ply,SBD,M
Boys,89.81,2,Austin McKean,Conroe Caney Creek,89.72,256.28,133.81,231.33,621.42,Single-ply,SBD,M
Boys,89.81,3,JaeCorien Barnes,Port Arthur Memorial,88.99,224.53,124.74,192.78,542.04,Single-ply,SBD,M
Boys,89.81,4,Kadrion Latson,Bryan Rudder,84.91,192.78,122.47,204.12,519.36,Single-ply,SBD,M
Boys,89.81,5,Javier Solano,Conroe Woodlands College Park,86.64,190.51,122.47,190.51,503.49,Single-ply,SBD,M
Boys,89.81,6,DeVarion Guyton,Bryan Rudder,88,188.24,113.4,195.04,496.68,Single-ply,SBD,M
Boys,89.81,7,Charles MicMillen,Trinity,89.54,183.7,111.13,199.58,494.42,Single-ply,SBD,M
Boys,89.81,8,Camron Easley,New Caney Porter,89.36,158.76,113.4,181.44,453.59,Single-ply,SBD,M
Boys,89.81,9,Jaxen Halbaedier,Willis,83.46,192.78,90.72,165.56,449.06,Single-ply,SBD,M
Boys,89.81,10,Jake Ruby,New Waverly,86.73,170.1,104.33,161.03,435.45,Single-ply,SBD,M
Boys,89.81,11,Jonathon Hay,Willis,89.27,181.44,79.38,151.95,412.77,Single-ply,SBD,M
Boys,99.79,12,Colby Harmon,Willis,89.9,142.88,83.91,165.56,392.36,Single-ply,SBD,M
Boys,89.81,13,Jake Jones,Willis,85.5,151.95,79.38,158.76,390.09,Single-ply,SBD,M
Boys,89.81,DQ,Clint Coyle,Willis,89.36,,,,,Single-ply,SBD,M
Boys,99.79,1,Jose Rangel,New Caney,94.8,254.01,145.15,226.8,625.96,Single-ply,SBD,M
Boys,99.79,2,Spencer Choka,Bryan Rudder,96.16,226.8,147.42,226.8,601.01,Single-ply,SBD,M
Boys,99.79,3,John Carter,Willis,91.94,215.46,136.08,226.8,578.33,Single-ply,SBD,M
Boys,99.79,4,Matthew Reed,Conroe Woodlands College Park,98.79,213.19,124.74,231.33,569.26,Single-ply,SBD,M
Boys,99.79,5,Brent Kobersky,Alvin,99.7,222.26,136.08,199.58,557.92,Single-ply,SBD,M
Boys,99.79,6,Catarino Moreno,Shepherd,99.52,204.12,142.88,188.24,535.24,Single-ply,SBD,M
Boys,99.79,7,Cayetano Gonzales,Shepherd,92.17,190.51,133.81,197.31,521.63,Single-ply,SBD,M
Boys,99.79,8,Alejandro Rodriquez,New Caney Porter,99.16,190.51,138.35,181.44,510.29,Single-ply,SBD,M
Boys,99.79,9,Colby Clark,Shepherd,91.99,201.85,133.81,156.49,492.15,Single-ply,SBD,M
Boys,99.79,10,Clayton Kelleher,Willis,96.43,226.8,104.33,142.88,474,Single-ply,SBD,M
Boys,99.79,11,Mykel Thomas,Port Arthur Memorial,90.81,183.7,106.59,181.44,471.74,Single-ply,SBD,M
Boys,99.79,12,Taylor Grice,New Caney Porter,96.16,163.29,108.86,167.83,439.98,Single-ply,SBD,M
Boys,99.79,13,Chance Hodgkinson,New Caney Porter,91.17,172.37,108.86,154.22,435.45,Single-ply,SBD,M
Boys,99.79,DQ,Wayne Manis,Trinity,99.06,142.88,,,,Single-ply,SBD,M
Boys,99.79,DQ,Scott Erkel,Willis,91.35,,,,,Single-ply,SBD,M
Boys,109.77,1,Rick Marshall,Huntsville,108.41,247.21,161.03,244.94,653.17,Single-ply,SBD,M
Boys,109.77,2,Kainen Collins,Port Arthur Memorial,108.86,222.26,120.2,231.33,573.79,Single-ply,SBD,M
Boys,109.77,3,Dustin Nicholas,Huntsville,102.51,217.72,113.4,238.14,569.26,Single-ply,SBD,M
Boys,109.77,4,Casey Williams,Port Arthur Memorial,106.41,208.65,133.81,226.8,569.26,Single-ply,SBD,M
Boys,109.77,5,Marcus Garza,Conroe Caney Creek,101.06,215.46,111.13,199.58,526.17,Single-ply,SBD,M
Boys,109.77,6,Jacob Gonzalez,Alvin,101.51,199.58,133.81,190.51,523.9,Single-ply,SBD,M
Boys,109.77,7,Cameron Providence,New Caney Porter,101.29,183.7,113.4,204.12,501.22,Single-ply,SBD,M
Boys,109.77,8,Glen Bonner,Trinity,102.6,185.97,127.01,176.9,489.88,Single-ply,SBD,M
Boys,109.77,9,Zach Randell,Willis,106.64,183.7,92.99,204.12,480.81,Single-ply,SBD,M
Boys,109.77,10,Brody Roberts,Bryan Rudder,107.59,192.78,115.67,170.1,478.54,Single-ply,SBD,M
Boys,109.77,11,Charles Umeugokwe,New Caney,103.15,183.7,108.86,183.7,476.27,Single-ply,SBD,M
Boys,124.74,1,Parker Blount,Huntsville,113.94,308.44,185.97,265.35,759.77,Single-ply,SBD,M
Boys,124.74,2,Chase Kellar,Conroe Caney Creek,122.38,265.35,156.49,249.48,671.32,Single-ply,SBD,M
Boys,124.74,3,Brandon Jackson,Port Arthur Memorial,119.75,254.01,158.76,256.28,669.05,Single-ply,SBD,M
Boys,124.74,4,Dillon Poindexter,New Caney,117.39,217.72,145.15,201.85,564.72,Single-ply,SBD,M
Boys,124.74,5,Shaquan Warren,Bryan Rudder,119.48,181.44,140.61,199.58,521.63,Single-ply,SBD,M
Boys,124.74,6,Joseph Sylvester,Shepherd,123.65,199.58,124.74,183.7,508.02,Single-ply,SBD,M
Boys,124.74,7,Tristan Garza,New Caney,123.01,217.72,104.33,158.76,480.81,Single-ply,SBD,M
Boys,124.74,8,Greg Hillyer,New Caney Porter,113.4,172.37,108.86,195.04,476.27,Single-ply,SBD,M
Boys,124.74,9,Jason Vargas,Willis,118.84,181.44,97.52,183.7,462.66,Single-ply,SBD,M
Boys,124.74,10,Chance Price,New Caney Porter,116.85,154.22,86.18,154.22,394.63,Single-ply,SBD,M
Boys,124.74,11,Roberto Bocanegra,Huntsville,112.76,136.08,83.91,131.54,351.53,Single-ply,SBD,M
Boys,124.74,DQ,Casey Vasquez,New Caney Porter,111.4,167.83,129.27,,,Single-ply,SBD,M
Boys,124.74+,1,Charles Owens,Bryan Rudder,127.37,294.84,165.56,265.35,725.75,Single-ply,SBD,M
Boys,124.74+,2,Jimmy White,Willis,132.59,272.16,165.56,219.99,657.71,Single-ply,SBD,M
Boys,124.74+,3,Kevin Hurtado,Conroe Woodlands College Park,155.31,278.96,142.88,208.65,630.49,Single-ply,SBD,M
Boys,124.74+,4,Brandon Artis,Port Arthur Memorial,132.09,224.53,142.88,254.01,621.42,Single-ply,SBD,M
Boys,124.74+,5,Coby Smith,Willis,130.54,183.7,136.08,238.14,557.92,Single-ply,SBD,M
Boys,124.74+,6,Weston Meyer,Willis,126.37,238.14,92.99,183.7,514.83,Single-ply,SBD,M
Boys,124.74+,7,Cody Jackson,New Waverly,143.52,185.97,115.67,181.44,483.08,Single-ply,SBD,M
Boys,124.74+,8,Zac Taylor,Shepherd,128.28,158.76,95.25,161.03,415.04,Single-ply,SBD,M
Boys,124.74+,DQ,Kaleb Allen,Port Arthur Memorial,140.89,,,,,Single-ply,SBD,M
Boys,,NS,Alex Ellison,Bryan Rudder,,,,,,Single-ply,SBD,M
Boys,,NS,Sinai Woods,Bryan Rudder,,,,,,Single-ply,SBD,M
Boys,,NS,Dequarius White,Bryan Rudder,,,,,,Single-ply,SBD,M
Boys,,NS,Alex Arevalo,Bryan Rudder,,,,,,Single-ply,SBD,M
Boys,,NS,Nikedrion Gooden,Bryan Rudder,,,,,,Single-ply,SBD,M
Boys,,NS,Alex Palacios,Conroe Caney Creek,,,,,,Single-ply,SBD,M
Boys,,NS,John Moye,Shepherd,,,,,,Single-ply,SBD,M
Boys,,NS,Dakota Bailey,Shepherd,,,,,,Single-ply,SBD,M
Boys,,NS,Cody Potter,Trinity,,,,,,Single-ply,SBD,M
Boys,,NS,Karsten Mack,Trinity,,,,,,Single-ply,SBD,M
Boys,,NS,Javonte Oliphant,Trinity,,,,,,Single-ply,SBD,M
Boys,,NS,Benton Imhoff,Conroe Woodlands College Park,,,,,,Single-ply,SBD,M
Boys,,NS,Corey Colon,Conroe Woodlands College Park,,,,,,Single-ply,SBD,M
Boys,,NS,Christian Flores,Alvin,,,,,,Single-ply,SBD,M
Boys,,NS,Peyton Opre,Alvin,,,,,,Single-ply,SBD,M
Boys,,NS,Carlos García,Alvin,,,,,,Single-ply,SBD,M
Boys,,NS,Odis Mack,Port Arthur Memorial,,,,,,Single-ply,SBD,M
Boys,,NS,Daniel Mature,New Waverly,,,,,,Single-ply,SBD,M
Boys,,NS,Cedric Cunningham,New Waverly,,,,,,Single-ply,SBD,M
Boys,,NS,Dalton Cyr,Huntsville,,,,,,Single-ply,SBD,M
Boys,,NS,Jose Baca,New Caney,,,,,,Single-ply,SBD,M
Boys,,NS,Jared Hull,New Caney,,,,,,Single-ply,SBD,M
Boys,,NS,Joseph Edwards,New Caney,,,,,,Single-ply,SBD,M
Boys,,NS,Dade Cooper,New Caney,,,,,,Single-ply,SBD,M
Boys,,NS,Alvin Dickey,Huntsville,,,,,,Single-ply,SBD,M
Boys,,NS,Joe York,Huntsville,,,,,,Single-ply,SBD,M
