Division,WeightClassKg,Place,Name,Team,BodyweightKg,Best3SquatKg,Best3BenchKg,Best3DeadliftKg,TotalKg,Equipment,Event,Sex
Boys,51.71,1,Justin Miller,Elkhart,51.71,136.08,74.84,122.47,333.39,Single-ply,SBD,M
Boys,51.71,2,Luke Trim,Elkhart,51.71,131.54,54.43,133.81,319.78,Single-ply,SBD,M
Boys,51.71,3,Eli Trim,Elkhart,51.26,129.27,65.77,120.2,315.25,Single-ply,SBD,M
Boys,51.71,4,Eric Aceves,Madisonville,48.08,83.91,52.16,102.06,238.14,Single-ply,SBD,M
Boys,51.71,5,Cody Bester,Fairfield,41.28,86.18,38.56,92.99,217.72,Single-ply,SBD,M
Boys,55.79,1,Cody DeFore,Elkhart,55.34,140.61,74.84,156.49,371.95,Single-ply,SBD,M
Boys,55.79,2,Chantz Mickens,Palestine Westwood,52.16,136.08,77.11,138.35,351.53,Single-ply,SBD,M
Boys,55.79,3,Ivan Marez,Mexia,55.79,131.54,70.31,136.08,337.93,Single-ply,SBD,M
Boys,55.79,4,Colton Streetman,Grapeland,55.79,102.06,79.38,147.42,328.85,Single-ply,SBD,M
Boys,55.79,5,James Hall,Emory Rains,55.34,102.06,70.31,113.4,285.76,Single-ply,SBD,M
Boys,55.79,6,Colton Edmonds,Teague,53.52,102.06,61.23,102.06,265.35,Single-ply,SBD,M
Boys,55.79,7,Ray Perez,Madisonville,53.52,90.72,,,90.72,Single-ply,S,M
Boys,55.79,DQ,Taylor Martin,Grapeland,52.62,,,,,Single-ply,S,M
Boys,59.87,1,Logan Brown,Palestine,59.87,185.97,106.59,195.04,487.61,Single-ply,SBD,M
Boys,59.87,2,Bryan Thompson,Elkhart,59.87,181.44,102.06,185.97,469.47,Single-ply,SBD,M
Boys,59.87,3,Christian Evans,Grapeland,58.97,147.42,108.86,156.49,412.77,Single-ply,SBD,M
Boys,59.87,4,David Marez,Mexia,58.97,154.22,79.38,165.56,399.16,Single-ply,SBD,M
Boys,59.87,5,Tate Hartley,Buffalo,59.87,151.95,81.65,158.76,392.36,Single-ply,SBD,M
Boys,59.87,6,Ismael Castillo,Madisonville,59.87,124.74,74.84,145.15,344.73,Single-ply,SBD,M
Boys,59.87,7,Juan Mendez,Emory Rains,59.42,120.2,83.91,138.35,342.46,Single-ply,SBD,M
Boys,59.87,8,Christian Dominguez,Buffalo,59.87,113.4,56.7,149.69,319.78,Single-ply,SBD,M
Boys,59.87,9,Josh Monks,Teague,59.42,120.2,54.43,136.08,310.71,Single-ply,SBD,M
Boys,59.87,DQ,Jared Arey,Teague,59.87,,,,,Single-ply,SBD,M
Boys,67.13,1,Kyle Kiser,Emory Rains,65.32,158.76,117.93,185.97,462.66,Single-ply,SBD,M
Boys,67.13,2,David Calixtor,Teague,63.96,183.7,99.79,176.9,460.4,Single-ply,SBD,M
Boys,67.13,3,Michael Murray,Palestine Westwood,64.86,188.24,83.91,174.63,446.79,Single-ply,SBD,M
Boys,67.13,4,Theron Dingas,Palestine Westwood,60.33,158.76,95.25,176.9,430.91,Single-ply,SBD,M
Boys,67.13,5,Brandon Johnson,Palestine Westwood,65.32,158.76,97.52,165.56,421.84,Single-ply,SBD,M
Boys,67.13,6,Hai Vuong,Mexia,67.13,145.15,92.99,176.9,415.04,Single-ply,SBD,M
Boys,67.13,7,Tate Molandes,Elkhart,65.32,154.22,92.99,165.56,412.77,Single-ply,SBD,M
Boys,67.13,8,Fernando Zambrano,Teague,67.13,158.76,79.38,174.63,412.77,Single-ply,SBD,M
Boys,67.13,9,Juan Hernández,Mexia,62.6,156.49,83.91,167.83,408.23,Single-ply,SBD,M
Boys,67.13,10,Taylor Finley,Elkhart,62.6,165.56,86.18,140.61,392.36,Single-ply,SBD,M
Boys,67.13,11,Antonio Mora,Madisonville,66.22,154.22,102.06,136.08,392.36,Single-ply,SBD,M
Boys,67.13,12,Booker Winn,Palestine,65.77,147.42,79.38,151.95,378.75,Single-ply,SBD,M
Boys,67.13,13,Brandon Campbell,Teague,63.5,131.54,65.77,147.42,344.73,Single-ply,SBD,M
Boys,67.13,14,Sam Edwards,Emory Rains,67.13,113.4,81.65,117.93,312.98,Single-ply,SBD,M
Boys,67.13,15,Leon Tran,Crockett,67.13,111.13,74.84,122.47,308.44,Single-ply,SBD,M
Boys,67.13,16,Kolby Venoy,Palestine Westwood,63.96,104.33,65.77,117.93,288.03,Single-ply,SBD,M
Boys,67.13,17,Tacho Monsivbais,Crockett,67.13,102.06,61.23,124.74,288.03,Single-ply,SBD,M
Boys,67.13,18,Juan Orduna,Crockett,61.69,104.33,58.97,111.13,274.42,Single-ply,SBD,M
Boys,67.13,19,Derrick Adams,Palestine,65.32,149.69,88.45,,238.14,Single-ply,SB,M
Boys,74.84,1,Damian Kozak,Groesbeck,74.84,235.87,142.88,219.99,598.74,Single-ply,SBD,M
Boys,74.84,2,Jonathan Hazley,Grapeland,73.48,226.8,113.4,201.85,542.04,Single-ply,SBD,M
Boys,74.84,3,Deion Williams,Jefferson,71.21,204.12,90.72,192.78,487.61,Single-ply,SBD,M
Boys,74.84,4,Calvin Young,Buffalo,72.12,170.1,88.45,197.31,455.86,Single-ply,SBD,M
Boys,74.84,5,Alex Ward,Fairfield,69.4,185.97,86.18,181.44,453.59,Single-ply,SBD,M
Boys,74.84,6,Coy Johnson,Teague,71.21,156.49,104.33,174.63,435.45,Single-ply,SBD,M
Boys,74.84,7,Eric Garnica,Madisonville,72.12,158.76,83.91,181.44,424.11,Single-ply,SBD,M
Boys,74.84,8,Colton Hedrick,Groesbeck,72.12,151.95,81.65,176.9,410.5,Single-ply,SBD,M
Boys,74.84,9,Cooper Adams,Elkhart,74.84,149.69,90.72,167.83,408.23,Single-ply,SBD,M
Boys,74.84,10,Jesus Lopez,Buffalo,68.04,158.76,74.84,167.83,401.43,Single-ply,SBD,M
Boys,74.84,11,Colton Cogdill,Elkhart,73.03,145.15,92.99,154.22,392.36,Single-ply,SBD,M
Boys,74.84,12,Gannon Brown,Emory Rains,69.85,129.27,104.33,156.49,390.09,Single-ply,SBD,M
Boys,74.84,13,Christian Ward,Palestine,68.95,142.88,92.99,149.69,385.55,Single-ply,SBD,M
Boys,74.84,14,Bryce Newman,Palestine,74.84,129.27,97.52,136.08,362.87,Single-ply,SBD,M
Boys,74.84,15,Michael Diaz,Emory Rains,72.12,127.01,79.38,145.15,351.53,Single-ply,SBD,M
Boys,74.84,16,Randall Hanks,Groesbeck,68.95,129.27,88.45,124.74,342.46,Single-ply,SBD,M
Boys,74.84,17,Daniel Vasquez,Grapeland,69.85,133.81,79.38,127.01,340.19,Single-ply,SBD,M
Boys,74.84,DQ,Chase Cooper,Jefferson,74.84,,,,,Single-ply,SBD,M
Boys,74.84,DQ,Sergio Rios,Mexia,74.84,,,,,Single-ply,SBD,M
Boys,82.1,1,Jacob Clark,Elkhart,81.65,244.94,127.01,238.14,610.08,Single-ply,SBD,M
Boys,82.1,2,Martin Balderas,Groesbeck,80.74,217.72,133.81,238.14,589.67,Single-ply,SBD,M
Boys,82.1,3,Jose Dominguez,Buffalo,78.02,217.72,127.01,192.78,537.51,Single-ply,SBD,M
Boys,82.1,4,Nicoli Morgan,Palestine Westwood,78.93,181.44,92.99,224.53,498.95,Single-ply,SBD,M
Boys,82.1,5,Devin Robbins,Crockett,77.56,195.04,92.99,195.04,483.08,Single-ply,SBD,M
Boys,82.1,6,Ben Parish,Groesbeck,79.83,195.04,102.06,183.7,480.81,Single-ply,SBD,M
Boys,82.1,7,Wendell Carnley,Elkhart,76.2,190.51,95.25,176.9,462.66,Single-ply,SBD,M
Boys,82.1,8,Brett Hicks,Emory Rains,75.3,158.76,95.25,161.03,415.04,Single-ply,SBD,M
Boys,82.1,9,Taylor Bachelder,Emory Rains,81.19,147.42,83.91,174.63,405.97,Single-ply,SBD,M
Boys,82.1,10,Will Grahm,Teague,79.38,158.76,83.91,158.76,401.43,Single-ply,SBD,M
Boys,82.1,11,Jd Baxter,Buffalo,80.74,140.61,79.38,149.69,369.68,Single-ply,SBD,M
Boys,82.1,12,Jacob Cooper,Jefferson,79.38,145.15,74.84,147.42,367.41,Single-ply,SBD,M
Boys,82.1,13,Humberto Monsivais,Crockett,77.56,122.47,65.77,149.69,337.93,Single-ply,SBD,M
Boys,82.1,14,Odessa Sanchez,Emory Rains,77.56,106.59,61.23,147.42,315.25,Single-ply,SBD,M
Boys,82.1,15,Mark Powell,Emory Rains,81.65,115.67,79.38,120.2,315.25,Single-ply,SBD,M
Boys,82.1,16,Christian Darter,Emory Rains,76.2,117.93,70.31,111.13,299.37,Single-ply,SBD,M
Boys,82.1,17,Alex Moulllett,Jefferson,76.66,111.13,56.7,,167.83,Single-ply,SB,M
Boys,82.1,DQ,Hunter Luce,Palestine Westwood,82.1,,,,,Single-ply,SB,M
Boys,89.81,1,Diontre Oliver,Mexia,89.81,195.04,106.59,219.99,521.63,Single-ply,SBD,M
Boys,89.81,2,Ryan Lynch,Teague,83.46,197.31,106.59,201.85,505.76,Single-ply,SBD,M
Boys,89.81,3,Jonathan Cates,Buffalo,83.01,188.24,115.67,199.58,503.49,Single-ply,SBD,M
Boys,89.81,4,Sadarius Figures,Jefferson,83.01,170.1,106.59,204.12,480.81,Single-ply,SBD,M
Boys,89.81,5,Ty Tunstall,Teague,87.54,185.97,104.33,188.24,478.54,Single-ply,SBD,M
Boys,89.81,6,Dj Young,Buffalo,84.82,174.63,97.52,170.1,442.25,Single-ply,SBD,M
Boys,89.81,7,Tad Musik,Crockett,86.18,154.22,106.59,170.1,430.91,Single-ply,SBD,M
Boys,89.81,8,Cody Dougherty,Emory Rains,86.64,158.76,90.72,158.76,408.23,Single-ply,SBD,M
Boys,89.81,9,Ryan Jones,Palestine Westwood,83.46,129.27,95.25,158.76,383.29,Single-ply,SBD,M
Boys,89.81,10,Zach Morgan,Groesbeck,87.54,127.01,74.84,129.27,331.12,Single-ply,SBD,M
Boys,89.81,11,Treston Kennedy,Palestine,85.73,120.2,56.7,136.08,312.98,Single-ply,SBD,M
Boys,89.81,12,Michael Castillo,Palestine,85.73,104.33,72.57,122.47,299.37,Single-ply,SBD,M
Boys,89.81,DQ,Ivan Rivas,Buffalo,89.81,,,,,Single-ply,SBD,M
Boys,99.79,1,Ryan Wilkinson,Fairfield,99.34,244.94,154.22,249.48,648.64,Single-ply,SBD,M
Boys,99.79,2,Ethridge Brooks,Madisonville,99.79,181.44,108.86,204.12,494.42,Single-ply,SBD,M
Boys,99.79,3,Derrick Brister,Grapeland,94.8,154.22,113.4,204.12,471.74,Single-ply,SBD,M
Boys,99.79,4,Alex Chicas,Palestine,92.53,185.97,106.59,174.63,467.2,Single-ply,SBD,M
Boys,99.79,5,Josh Carrillo,Buffalo,98.43,190.51,97.52,165.56,453.59,Single-ply,SBD,M
Boys,99.79,6,Ricardo Molina,Mexia,99.79,163.29,83.91,158.76,405.97,Single-ply,SBD,M
Boys,99.79,7,Travis Croson,Groesbeck,95.71,129.27,81.65,158.76,369.68,Single-ply,SBD,M
Boys,99.79,8,Julian Ibarra,Crockett,94.8,136.08,102.06,,238.14,Single-ply,SB,M
Boys,99.79,9,Cody Sell,Fairfield,92.99,226.8,,,226.8,Single-ply,S,M
Boys,109.77,1,Cory Black,Fairfield,107.5,276.69,172.37,244.94,694,Single-ply,SBD,M
Boys,109.77,2,Michael Mooneyham,Fairfield,100.7,249.48,147.42,254.01,650.91,Single-ply,SBD,M
Boys,109.77,3,Dillon Kilpatrick,Fairfield,102.97,215.46,149.69,190.51,555.65,Single-ply,SBD,M
Boys,109.77,4,Johnny Johnson,Teague,105.23,210.92,129.27,213.19,553.38,Single-ply,SBD,M
Boys,109.77,5,Dane Blackwood,Fairfield,105.23,181.44,111.13,190.51,483.08,Single-ply,SBD,M
Boys,109.77,6,John Webb,Palestine Westwood,108.41,188.24,99.79,181.44,469.47,Single-ply,SBD,M
Boys,109.77,7,Colton Long,Madisonville,108.41,165.56,92.99,204.12,462.66,Single-ply,SBD,M
Boys,109.77,8,Steven Capko,Emory Rains,106.14,156.49,88.45,172.37,417.3,Single-ply,SBD,M
Boys,124.74,1,Sammy Calhoun,Palestine,111.13,294.84,176.9,272.16,743.89,Single-ply,SBD,M
Boys,124.74,2,Jacob McKinney,Palestine Westwood,111.58,256.28,131.54,238.14,625.96,Single-ply,SBD,M
Boys,124.74,3,Ben Jaeger,Emory Rains,116.12,222.26,151.95,213.19,587.4,Single-ply,SBD,M
Boys,124.74,4,Andres Lara,Mexia,111.58,249.48,129.27,197.31,576.06,Single-ply,SBD,M
Boys,124.74,5,Tony Barraza,Groesbeck,122.92,242.67,120.2,210.92,573.79,Single-ply,SBD,M
Boys,124.74,6,Willie Anderson,Palestine,110.22,226.8,127.01,217.72,571.53,Single-ply,SBD,M
Boys,124.74,7,Alex Montano,Buffalo,115.67,210.92,120.2,206.38,537.51,Single-ply,SBD,M
Boys,124.74,8,Alex Ellis,Teague,113.85,210.92,117.93,195.04,523.9,Single-ply,SBD,M
Boys,124.74,9,Rashad Reddix,Palestine,121.11,192.78,127.01,201.85,521.63,Single-ply,SBD,M
Boys,124.74,10,Jorge Rosas,Madisonville,119.29,192.78,92.99,188.24,474,Single-ply,SBD,M
Boys,124.74,11,Lawrence Duval,Grapeland,119.75,195.04,113.4,,308.44,Single-ply,SB,M
Boys,124.74,12,Colton Thomas,Elkhart,113.4,170.1,72.57,,242.67,Single-ply,SB,M
Boys,124.74+,1,Kaprice Williams,Elkhart,141.97,317.51,172.37,213.19,703.07,Single-ply,SBD,M
Boys,124.74+,2,Jaime Gomez,Mexia,146.06,256.28,140.61,240.4,637.3,Single-ply,SBD,M
Boys,124.74+,3,Charlie Perry,Palestine,125.19,208.65,161.03,238.14,607.81,Single-ply,SBD,M
Boys,124.74+,4,Zach Pratt,Fairfield,132.9,235.87,156.49,204.12,596.47,Single-ply,SBD,M
Boys,124.74+,5,Brenden Wolf,Elkhart,131.54,195.04,108.86,181.44,485.34,Single-ply,SBD,M
Boys,124.74+,6,Luke Rachel,Fairfield,141.97,172.37,99.79,170.1,442.25,Single-ply,SBD,M
Boys,124.74+,7,Josh Mouton,Crockett,136.08,,90.72,161.03,251.74,Single-ply,BD,M
Boys,124.74+,8,James McTyre,Jefferson,130.18,181.44,,,181.44,Single-ply,S,M
