<?xml version="1.0" encoding="UTF-8"?>
<svg width="12px" height="12px" viewBox="0 0 12 12" version="1.1" xmlns="http://www.w3.org/2000/svg" xmlns:xlink="http://www.w3.org/1999/xlink">
    <!-- Generator: Sketch 59.1 (86144) - https://sketch.com -->
    <title>mark</title>
    <desc>Created with Sketch.</desc>
    <g id="Page-1" stroke="none" stroke-width="1" fill="none" fill-rule="evenodd">
        <g id="mark" fill="#CD2B29" fill-rule="nonzero">
            <path d="M5.91,11.83 L0,5.91 L5.91,0 L11.83,5.91 L5.91,11.83 Z M2.83,5.91 L5.91,9 L9,5.91 L5.91,2.83 L2.83,5.91 Z" id="Shape"></path>
        </g>
    </g>
</svg>