﻿127;72;71;25.64
131;68;62;24.98
127;72;68;22.19
118;59;56;20.28
117;58;56;21.33
114;59;55;19.42
118;71;67;20.54
122;71;67;21.75
112;60;56;20.43
121;68;62;22.33
115;69;55;19.56
110;66;58;21.65
111;68;62;23.67
125;70;66;21.77
115;55;57;20.54
110;60;56;18.32
113;65;66;19.67
112;64;56;21.54
123;68;63;18.55
109;66;54;16.67
117;58;57;22.65
118;59;56;20.43
114;59;55;19.21
125;71;67;19.11
124;69;60;21.66
118;59;55;21.54
114;59;55;18.65
109;63;65;13.22
109;55;62;10.04
101;55;52;9.53
105;59;55;7.29
87;38;46;6.50
108;62;64;13.79
107;65;65;13.65
106;62;64;13.70
101;55;61;10.37
96;42;26;7.68
99;46;46;7.80
101;55;52;10.80
109;63;65;13.55
98;47;46;9.76
109;62;64;13.11
109;53;61;10.76
106;51;51;9.45
105;55;52;10.76
109;55;62;10.33
105;57;54;9.60
100;60;60;10.12
109;63;65;12.29
101;57;53;13.54
105;59;55;9.67
96;54;62;10.89
105;59;55;9.76
105;62;64;13.43
87;46;49;11.37
74;42;43;9.78
74;42;43;8.68
61;34;37;7.80
65;34;37;7.80
87;42;46;8.02
79;42;43;8.68
85;42;49;7.01
79;46;43;7.01
83;46;49;6.91
61;34;37;6.73
61;34;46;6.46
71;34;46;7.20
73;41;42;9.77
71;41;45;9.78
77;41;43;8.68
65;34;38;6.91
70;42;44;9.78
65;34;38;7.80
80;42;46;7.02
61;32;37;7.60
72;42;41;8.58
63;34;35;6.73
62;35;37;6.50
70;41;42;8.77
60;34;46;5.46
68;38;46;6.46
