{
  //url to be used in link generation
  "url": "http://localhost:8080",
  //couchdb and pouchdb connection settings
  "database": {
    "protocol": "http://",
    "host": "127.0.0.1",
    "port": "5984",
    "db": "tdespenza",
    "local": "app/data/db"
  },
  "npm": {
    "user": "admin",
    "password": ""
  },
  //server details
  "server": {
    "host": "127.0.0.1",
    "port": "3422"
  }
}