uart.c:25:5:__io_putchar	16	static
uart.c:30:6:uart2_tx_init	8	static
uart.c:60:6:uart2_rxtx_init	8	static
uart.c:100:6:uart2_read	4	static
uart.c:107:6:uart2_write	16	static
uart.c:114:13:uart_set_baudrate	24	static
uart.c:118:17:compute_uart_bd	16	static
