<?xml version="1.0" encoding="UTF-8"?>
<session version="1.0">
<refactoring accessors="true" comment="Delete element from project &apos;Automation&apos;&#x0D;&#x0A;- Original project: &apos;Automation&apos;&#x0D;&#x0A;- Original element: &apos;tool.AutoIt.java&apos;" description="Delete element" element1="/src\/test\/java&lt;tool{AutoIt.java" elements="1" flags="589830" id="org.eclipse.jdt.ui.delete" resources="0" stamp="1610236792439" subPackages="false" version="1.0"/>
</session>