C:\Users\T02824\eclipse-workspace\DataValidation\src\test\java\com\intellect\testcases\BaseTest.java
C:\Users\T02824\eclipse-workspace\DataValidation\src\test\java\com\intellect\testcases\TC04_Client_Message_Scheduler.java
C:\Users\T02824\eclipse-workspace\DataValidation\src\test\java\com\intellect\testcases\TC03_Client_Message_Address.java
C:\Users\T02824\eclipse-workspace\DataValidation\src\test\java\com\intellect\testcases\TC02_Client_Depository_Mapping.java
C:\Users\T02824\eclipse-workspace\DataValidation\src\test\java\com\intellect\testcases\TC01_Cliente.java
