%YAML 1.1
%TAG !u! tag:unity3d.com,2011:
--- !u!114 &11400000
MonoBehaviour:
  m_ObjectHideFlags: 0
  m_CorrespondingSourceObject: {fileID: 0}
  m_PrefabInstance: {fileID: 0}
  m_PrefabAsset: {fileID: 0}
  m_GameObject: {fileID: 0}
  m_Enabled: 1
  m_EditorHideFlags: 0
  m_Script: {fileID: 11500000, guid: 1aee1302067bb7541b436828eb54bea9, type: 3}
  m_Name: GameWaresConfig
  m_EditorClassIdentifier: 
  wareConfigs:
  - {fileID: 11400000, guid: bba9d39a5c7e5b843a2ceca61dc25c7d, type: 2}
  - {fileID: 11400000, guid: 174ff5ef36ba4ea4181f0b62b4b929c2, type: 2}
  - {fileID: 11400000, guid: 33896b83aa063fe44b5a7b9561daa8a0, type: 2}
  - {fileID: 11400000, guid: d377488e9f0014a4c9fd060383720576, type: 2}
  - {fileID: 11400000, guid: e1d1ce2167c93e442839ee51cacec46a, type: 2}
  - {fileID: 11400000, guid: ecb4c1017861a9e4490d706ca7712440, type: 2}
