%YAML 1.1
%TAG !u! tag:unity3d.com,2011:
--- !u!114 &11400000
MonoBehaviour:
  m_ObjectHideFlags: 0
  m_CorrespondingSourceObject: {fileID: 0}
  m_PrefabInstance: {fileID: 0}
  m_PrefabAsset: {fileID: 0}
  m_GameObject: {fileID: 0}
  m_Enabled: 1
  m_EditorHideFlags: 0
  m_Script: {fileID: 11500000, guid: 6c38c5d9fdefcea4982ae37201209310, type: 3}
  m_Name: Data Hero
  m_EditorClassIdentifier: 
  heroData: {fileID: 4900000, guid: 62c5a37aa5c7e3743a5a2f1f169decf1, type: 3}
