%YAML 1.1
%TAG !u! tag:unity3d.com,2011:
--- !u!114 &11400000
MonoBehaviour:
  m_ObjectHideFlags: 0
  m_CorrespondingSourceObject: {fileID: 0}
  m_PrefabInstance: {fileID: 0}
  m_PrefabAsset: {fileID: 0}
  m_GameObject: {fileID: 0}
  m_Enabled: 1
  m_EditorHideFlags: 0
  m_Script: {fileID: 11500000, guid: 9d1764c11401bee43a811a401f2d0300, type: 3}
  m_Name: Heros
  m_EditorClassIdentifier: 
  allHeros:
  - {fileID: 787627650968634083, guid: a5d1f3badc969d9459ebea5fab69667f, type: 3}
  - {fileID: 1941626631810218275, guid: 48c14cb41ea327c4ea76618a26655043, type: 3}
