{
  "development": {
    "username": "postgres",
    "password": "transvaluasi",
    "database": "database_development",
    "host": "localhost",
    "dialect": "postgres"
  },
  "test": {
    "username": "postgres",
    "password": "transvaluasi",
    "database": "database_test",
    "host": "localhost",
    "dialect": "postgres"
  },
  "production": {
    "username": "postgres",
    "password": "transvaluasi",
    "database": "database_production",
    "host": "localhost",
    "dialect": "postgres"
  }
}
