{
    "version": 1,
    "settings": {
        "layout": {
            "contentSize": "1024px",
            "wideSize": "1280px"
        },
        "color": {
            "palette": [
                {
                    "name": "Primary",
                    "slug": "primary",
                    "color": "#023E88"
                },
                {
                    "name": "Secondary",
                    "slug": "secondary",
                    "color": "#F47920"
                },
                {
                    "name": "danger",
                    "slug": "danger",
                    "color": "#F42020"
                },
                {
                    "name": "success",
                    "slug": "success",
                    "color": "#027500"
                },
                {
                    "name": "warning",
                    "slug": "warning",
                    "color": "#FCD62B"
                },
                {
                    "name": "disable",
                    "slug": "disable",
                    "color": "#384555"
                },
                {
                    "name": "Dark",
                    "slug": "dark",
                    "color": "#00031F"
                },
                {
                    "name": "Light",
                    "slug": "light",
                    "color": "#ECF0F6"
                }
            ]
        },
        "typography": {
            "fontSizes": [
                {
                    "name": "Small",
                    "slug": "small",
                    "size": "0.875rem"
                },
                {
                    "slug": "regular",
                    "name": "Regular",
                    "size": "1.5rem"
                },
                {
                    "slug": "large",
                    "name": "Large",
                    "size": "1.125rem"
                },
                {
                    "slug": "xl",
                    "name": "XL",
                    "size": "1.25rem"
                },
                {
                    "slug": "xxl",
                    "name": "2XL",
                    "size": "1.5rem"
                },
                {
                    "slug": "xxxl",
                    "name": "3XL",
                    "size": "1.875rem"
                }
            ]
        }
    }
}
