propensi/sibkd/sibkd/repository/SemesterDB.class
propensi/sibkd/sibkd/repository/JabatanStrukturalDb.class
propensi/sibkd/sibkd/controller/FileController.class
propensi/sibkd/sibkd/controller/PelaporanBKDController.class
propensi/sibkd/sibkd/model/File.class
propensi/sibkd/sibkd/controller/KegiatanBKDController.class
propensi/sibkd/sibkd/service/KegiatanBKDService.class
propensi/sibkd/sibkd/service/BidangService.class
propensi/sibkd/sibkd/service/PenggunaService.class
propensi/sibkd/sibkd/security/WebSecurityConfig$1.class
propensi/sibkd/sibkd/service/JabatanStrukturalService.class
propensi/sibkd/sibkd/service/BidangServiceImpl.class
propensi/sibkd/sibkd/repository/KegiatanDb.class
propensi/sibkd/sibkd/service/JabatanStrukturalServiceImpl.class
propensi/sibkd/sibkd/service/KegiatanBKDServiceImpl.class
propensi/sibkd/sibkd/service/DosenService.class
propensi/sibkd/sibkd/service/AsesorService.class
propensi/sibkd/sibkd/SibkdApplication.class
propensi/sibkd/sibkd/service/PenggunaServiceImpl.class
propensi/sibkd/sibkd/service/SemesterServiceImpl.class
propensi/sibkd/sibkd/model/Pengguna.class
propensi/sibkd/sibkd/model/JabatanStruktural.class
propensi/sibkd/sibkd/service/ExportPdfService.class
propensi/sibkd/sibkd/service/ItemBKDService.class
propensi/sibkd/sibkd/model/Dosen.class
propensi/sibkd/sibkd/repository/FileDb.class
propensi/sibkd/sibkd/service/CustomOAuth2UserService.class
propensi/sibkd/sibkd/service/EmailServiceImpl$1.class
propensi/sibkd/sibkd/controller/JadwalBKDController.class
propensi/sibkd/sibkd/service/EmailServiceImpl.class
propensi/sibkd/sibkd/repository/permissionDb.class
propensi/sibkd/sibkd/repository/JadwalDb.class
propensi/sibkd/sibkd/controller/AdminController.class
propensi/sibkd/sibkd/service/DosenServiceImpl.class
propensi/sibkd/sibkd/model/Asesor.class
propensi/sibkd/sibkd/model/Role.class
propensi/sibkd/sibkd/service/FileServiceImpl.class
propensi/sibkd/sibkd/controller/SemesterController.class
propensi/sibkd/sibkd/service/JadwalServiceImpl.class
propensi/sibkd/sibkd/controller/BiodataController.class
propensi/sibkd/sibkd/repository/DosenDb.class
propensi/sibkd/sibkd/service/FileService.class
propensi/sibkd/sibkd/service/JadwalService.class
propensi/sibkd/sibkd/model/Semester.class
propensi/sibkd/sibkd/repository/UserDao.class
propensi/sibkd/sibkd/security/WebSecurityConfig.class
propensi/sibkd/sibkd/controller/RangkumanBKDController.class
propensi/sibkd/sibkd/model/ItemBKD.class
propensi/sibkd/sibkd/repository/BidangDb.class
propensi/sibkd/sibkd/model/KegiatanBKD.class
propensi/sibkd/sibkd/model/Bidang.class
propensi/sibkd/sibkd/model/CustomOAuth2User.class
propensi/sibkd/sibkd/service/SemesterService.class
propensi/sibkd/sibkd/service/ExportPdfServiceImpl.class
propensi/sibkd/sibkd/service/RoleService.class
propensi/sibkd/sibkd/controller/ItemBKDController.class
propensi/sibkd/sibkd/service/ItemBKDServiceImpl.class
propensi/sibkd/sibkd/service/AsesorServiceImpl.class
propensi/sibkd/sibkd/model/Permission.class
propensi/sibkd/sibkd/controller/EmailReminderController.class
propensi/sibkd/sibkd/repository/RoleDb.class
propensi/sibkd/sibkd/model/JadwalBKD.class
propensi/sibkd/sibkd/repository/AsesorDb.class
propensi/sibkd/sibkd/repository/ItemDb.class
propensi/sibkd/sibkd/controller/BaseController.class
propensi/sibkd/sibkd/service/EmailService.class
propensi/sibkd/sibkd/controller/ExportLaporanController.class
propensi/sibkd/sibkd/service/RoleServiceImpl.class
propensi/sibkd/sibkd/controller/AssessmentController.class
