<svg width="118" height="35" viewBox="0 0 118 35" fill="none" xmlns="http://www.w3.org/2000/svg">
<g clip-path="url(#clip0_704_656)">
<path fill-rule="evenodd" clip-rule="evenodd" d="M0 9.32339L14.2478 1L28.5952 9.32339V26.1707L14.2478 34.5944L0 26.1707V9.32339ZM6.59904 13.2575L14.2709 8.7985L21.9965 13.2575V22.2828L14.2709 26.7955L6.59904 22.2828V13.2575Z" fill="#0962EC"/>
<path d="M46.0753 12.2344C45.9825 11.366 45.5914 10.6899 44.902 10.206C44.2192 9.72206 43.331 9.48011 42.2372 9.48011C41.4683 9.48011 40.8087 9.59612 40.2585 9.82812C39.7083 10.0601 39.2874 10.375 38.9957 10.7727C38.7041 11.1705 38.5549 11.6245 38.5483 12.1349C38.5483 12.5592 38.6444 12.9271 38.8366 13.2386C39.0355 13.5502 39.304 13.8153 39.642 14.0341C39.9801 14.2462 40.3546 14.4252 40.7656 14.571C41.1766 14.7169 41.5909 14.8395 42.0085 14.9389L43.9176 15.4162C44.6866 15.5952 45.4257 15.8371 46.1349 16.142C46.8509 16.447 47.4905 16.8314 48.054 17.2955C48.6241 17.7595 49.0748 18.3196 49.4062 18.9759C49.7377 19.6321 49.9034 20.401 49.9034 21.2827C49.9034 22.4759 49.5985 23.5265 48.9886 24.4347C48.3788 25.3362 47.4972 26.0421 46.3438 26.5526C45.197 27.0563 43.8082 27.3082 42.1776 27.3082C40.5933 27.3082 39.2178 27.063 38.0511 26.5724C36.8911 26.0819 35.983 25.366 35.3267 24.4247C34.6771 23.4834 34.3258 22.3366 34.2727 20.9844H37.902C37.955 21.6937 38.1738 22.2836 38.5582 22.7543C38.9427 23.2249 39.4432 23.5762 40.0597 23.8082C40.6828 24.0402 41.3788 24.1562 42.1477 24.1562C42.9498 24.1562 43.6525 24.0369 44.2557 23.7983C44.8655 23.553 45.3428 23.215 45.6875 22.7841C46.0322 22.3466 46.2079 21.8362 46.2145 21.2528C46.2079 20.7225 46.0521 20.285 45.7472 19.9403C45.4422 19.589 45.0147 19.2973 44.4645 19.0653C43.9209 18.8267 43.2846 18.6146 42.5554 18.429L40.2386 17.8324C38.5616 17.4015 37.2358 16.7486 36.2614 15.8736C35.2936 14.992 34.8097 13.822 34.8097 12.3636C34.8097 11.1638 35.1345 10.1132 35.7841 9.21165C36.4403 8.31013 37.3319 7.6108 38.4588 7.11364C39.5857 6.60985 40.8617 6.35795 42.2869 6.35795C43.732 6.35795 44.9981 6.60985 46.0852 7.11364C47.179 7.6108 48.0374 8.3035 48.6605 9.19176C49.2836 10.0734 49.6051 11.0876 49.625 12.2344H46.0753ZM53.1921 6.63636H57.7063L63.7518 21.392H63.9904L70.0359 6.63636H74.5501V27H71.0103V13.0099H70.8214L65.1935 26.9403H62.5487L56.9208 12.9801H56.7319V27H53.1921V6.63636ZM82.256 6.63636V27H78.5671V6.63636H82.256ZM86.2507 27V6.63636H89.9396V23.9077H98.9084V27H86.2507ZM102.11 27V6.63636H115.354V9.72869H105.799V15.2571H114.668V18.3494H105.799V23.9077H115.434V27H102.11Z" fill="#07274A"/>
</g>
<defs>
<clipPath id="clip0_704_656">
<rect width="118" height="34.5944" fill="white"/>
</clipPath>
</defs>
</svg>
