<svg  viewBox="0 0 78 78" fill="none" xmlns="http://www.w3.org/2000/svg">
<g clip-path="url(#clip0_455_681)">
<path d="M39.0802 56.4471L19.0062 44.8141V35.4509H25.7448V40.9837L39.0802 48.6445L52.4156 40.9837V35.4509H59.1542V44.8141L39.0802 56.4471Z" fill="#F47920"/>
<path d="M19.0062 30.9821V21.6189L39.0802 10.0569L59.1542 21.6189V30.9821H52.4156V25.5202L39.0802 17.7886L25.7448 25.5202V30.9821H19.0062Z" fill="#023E88"/>
<path d="M42.2009 32.2594L46.3859 36.3734L42.201 40.487L38.087 36.3733L42.2009 32.2594Z" fill="#023E88"/>
<path d="M35.9591 25.946L40.0732 30.131L35.9592 34.2447L31.7743 30.1311L35.9591 25.946Z" fill="#023E88"/>
<path fill-rule="evenodd" clip-rule="evenodd" d="M44.2583 62.1927H45.8897V66.2359H47.6631V62.1927H49.2945V60.7031H44.2583V62.1927Z" fill="#023E88"/>
<path fill-rule="evenodd" clip-rule="evenodd" d="M52.6284 64.3207H51.4934L51.99 62.4055L52.6284 64.3207ZM50.926 66.2359L51.1388 65.4556H52.9121L53.1249 66.2359H54.8982L52.9121 60.7031H51.1388L49.1526 66.2359H50.926Z" fill="#023E88"/>
<path fill-rule="evenodd" clip-rule="evenodd" d="M60.2182 66.2359V64.9591H57.4518L60.0763 61.9799V60.7031H55.3947V61.9799H57.8774L55.2529 64.8882V66.2359H60.2182Z" fill="#023E88"/>
<path fill-rule="evenodd" clip-rule="evenodd" d="M61.0694 66.2359H62.8427V64.4626L63.2683 64.037L64.616 66.2359H66.744L64.5451 62.7602L66.5312 60.7031H64.4032L62.8427 62.4764V60.7031H61.0694V66.2359Z" fill="#023E88"/>
<path d="M69.2269 60.7044V66.2372H67.3826V60.7044H69.2269Z" fill="#023E88"/>
<path fill-rule="evenodd" clip-rule="evenodd" d="M73.3408 64.3207H72.2059L72.7733 62.4055L73.3408 64.3207ZM71.6384 66.2359L71.8512 65.4556H73.6245L73.8373 66.2359H75.6106L73.6954 60.7031H71.8512L69.8651 66.2359H71.6384Z" fill="#023E88"/>
<path d="M4.32245 60.7036V66.2363H2.54913V60.7036H4.32245Z" fill="#023E88"/>
<path fill-rule="evenodd" clip-rule="evenodd" d="M7.08947 60.7031H5.45801V66.2359H7.1604V64.4626L7.08947 63.2567L9.07558 66.2359H10.707V60.7031H9.00465V62.4764L9.07558 63.7532L7.08947 60.7031Z" fill="#023E88"/>
<path fill-rule="evenodd" clip-rule="evenodd" d="M16.3817 62.3346L16.3107 61.9799L16.1689 61.6253L15.9561 61.3415L15.6723 61.1287L15.5305 60.9869L15.3886 60.9159L15.034 60.7031L14.0409 60.5613L13.3316 60.6322L12.7641 60.7741L11.9129 61.3415L11.842 61.5543L11.7001 61.8381L11.6292 62.0509V62.6183L11.7001 62.9021L11.9838 63.3277L12.1257 63.4695L12.5513 63.7533L13.1897 63.966L13.6862 64.1079L14.4665 64.3207L14.6084 64.3916L14.6793 64.4626L14.7502 64.6045L14.8211 64.6754L14.7502 64.8172V64.8882L14.3246 65.101H14.0409L13.7572 65.0301H13.6153L13.5443 64.9591L13.3316 64.8172L13.2606 64.6754V64.5335H11.4873L11.5582 64.7463L11.6292 65.0301L11.7001 65.2428L11.9838 65.6684L12.4094 65.9522L12.9769 66.2359L13.2606 66.3068L13.6153 66.3778H13.9699L14.963 66.2359L15.6014 66.0231L15.8142 65.8812L16.0979 65.5975L16.3107 65.3138L16.5235 64.6754V64.4626L16.4526 64.1789V63.966L16.1689 63.5404L15.8142 63.2567L15.6014 63.1149L14.963 62.9021L14.4665 62.7602L14.0409 62.6183L13.6862 62.5474L13.5443 62.4765L13.4734 62.4055L13.4025 62.2637L13.3316 62.1927L13.4734 61.909H13.6862L13.899 61.8381L14.1828 61.909L14.3955 61.9799H14.4665L14.5374 62.1218L14.6084 62.1927L14.6793 62.3346H16.3817Z" fill="#023E88"/>
<path fill-rule="evenodd" clip-rule="evenodd" d="M16.9491 62.1927H18.5806V66.2359H20.4248V62.1927H21.9853V60.7031H16.9491V62.1927Z" fill="#023E88"/>
<path d="M24.6113 60.7031V66.2358H22.8379V60.7031H24.6113Z" fill="#023E88"/>
<path fill-rule="evenodd" clip-rule="evenodd" d="M25.4611 62.1927H27.0925V66.2359H28.8658V62.1927H30.4973V60.7031H25.4611V62.1927Z" fill="#023E88"/>
<path fill-rule="evenodd" clip-rule="evenodd" d="M31.2066 63.8242L31.2775 64.1788V64.4626L31.4194 65.03L31.4903 65.2428L31.7741 65.6684L31.9159 65.8103L32.2706 66.0231L32.7671 66.2359L32.9799 66.3068H33.2637L33.9021 66.3777L34.5405 66.3068H34.8242L35.037 66.2359L35.3207 66.165L35.7463 65.8812L35.8882 65.7394L36.1719 65.3847L36.2429 65.1719L36.3847 64.9591L36.4556 64.4626L36.5266 63.8242V60.7031H34.7532V64.037L34.6823 64.3916L34.6114 64.6044L34.4695 64.8882L34.2567 64.9591L34.1149 65.03H33.6183L33.4055 64.9591L33.1927 64.7463L33.0509 64.3916V60.7031H31.2066V63.8242Z" fill="#023E88"/>
<path fill-rule="evenodd" clip-rule="evenodd" d="M37.3069 62.1927H38.8674V66.2359H40.7117V62.1927H42.2722V60.7031H37.3069V62.1927Z" fill="#023E88"/>
</g>
<defs>
<clipPath id="clip0_455_681">
<rect width="78" height="78" fill="white"/>
</clipPath>
</defs>
</svg>
