<svg width="268" height="299" viewBox="0 0 268 299" fill="none" xmlns="http://www.w3.org/2000/svg">
<path fill-rule="evenodd" clip-rule="evenodd" d="M236.471 15.7368V31.4737H220.706V30.6868H235.682V15.7368H236.471Z" fill="#F47920"/>
<path fill-rule="evenodd" clip-rule="evenodd" d="M236.471 0V15.7368H220.706V14.95H235.682V0H236.471Z" fill="#F47920"/>
<path fill-rule="evenodd" clip-rule="evenodd" d="M252.235 15.7368V31.4737H236.471V30.6868H251.447V15.7368H252.235Z" fill="#F47920"/>
<path fill-rule="evenodd" clip-rule="evenodd" d="M252.235 0V15.7368H236.471V14.95H251.447V0H252.235Z" fill="#F47920"/>
<path fill-rule="evenodd" clip-rule="evenodd" d="M268 15.7368V31.4737H252.235V30.6868H267.212V15.7368H268Z" fill="#F47920"/>
<path fill-rule="evenodd" clip-rule="evenodd" d="M268 0V15.7368H252.235V14.95H267.212V0H268Z" fill="#F47920"/>
<path fill-rule="evenodd" clip-rule="evenodd" d="M220.706 15.7368V31.4737H204.941V30.6868H219.918V15.7368H220.706Z" fill="#F47920"/>
<path fill-rule="evenodd" clip-rule="evenodd" d="M220.706 0V15.7368H204.941V14.95H219.918V0H220.706Z" fill="#F47920"/>
<path fill-rule="evenodd" clip-rule="evenodd" d="M204.941 15.7368V31.4737H189.176V30.6868H204.153V15.7368H204.941Z" fill="#F47920"/>
<path fill-rule="evenodd" clip-rule="evenodd" d="M204.941 0V15.7368H189.176V14.95H204.153V0H204.941Z" fill="#F47920"/>
<path fill-rule="evenodd" clip-rule="evenodd" d="M189.176 15.7368V31.4737H173.412V30.6868H188.388V15.7368H189.176Z" fill="#F47920"/>
<path fill-rule="evenodd" clip-rule="evenodd" d="M189.176 0V15.7368H173.412V14.95H188.388V0H189.176Z" fill="#F47920"/>
<path fill-rule="evenodd" clip-rule="evenodd" d="M173.412 15.7368V31.4737H157.647V30.6868H172.624V15.7368H173.412Z" fill="#F47920"/>
<path fill-rule="evenodd" clip-rule="evenodd" d="M173.412 0V15.7368H157.647V14.95H172.624V0H173.412Z" fill="#F47920"/>
<path d="M157.647 15.7368H141.882V31.4737H157.647V15.7368Z" fill="#F47920"/>
<path fill-rule="evenodd" clip-rule="evenodd" d="M157.647 15.7368V31.4737H141.882V30.6868H156.859V15.7368H157.647Z" fill="#F47920"/>
<path fill-rule="evenodd" clip-rule="evenodd" d="M157.647 0V15.7368H141.882V14.95H156.859V0H157.647Z" fill="#F47920"/>
<path fill-rule="evenodd" clip-rule="evenodd" d="M141.882 15.7368V31.4737H126.118V30.6868H141.094V15.7368H141.882Z" fill="#F47920"/>
<path fill-rule="evenodd" clip-rule="evenodd" d="M141.882 0V15.7368H126.118V14.95H141.094V0H141.882Z" fill="#F47920"/>
<path d="M126.118 15.7368H110.353V31.4737H126.118V15.7368Z" fill="#F47920"/>
<path fill-rule="evenodd" clip-rule="evenodd" d="M126.118 15.7368V31.4737H110.353V30.6868H125.329V15.7368H126.118Z" fill="#F47920"/>
<path fill-rule="evenodd" clip-rule="evenodd" d="M126.118 0V15.7368H110.353V14.95H125.329V0H126.118Z" fill="#F47920"/>
<path fill-rule="evenodd" clip-rule="evenodd" d="M110.353 15.7368V31.4737H94.5882V30.6868H109.565V15.7368H110.353Z" fill="#F47920"/>
<path fill-rule="evenodd" clip-rule="evenodd" d="M110.353 0V15.7368H94.5882V14.95H109.565V0H110.353Z" fill="#F47920"/>
<path fill-rule="evenodd" clip-rule="evenodd" d="M94.5882 15.7368V31.4737H78.8235V30.6868H93.8V15.7368H94.5882Z" fill="#F47920"/>
<path fill-rule="evenodd" clip-rule="evenodd" d="M94.5882 0V15.7368H78.8235V14.95H93.8V0H94.5882Z" fill="#F47920"/>
<path fill-rule="evenodd" clip-rule="evenodd" d="M78.8235 15.7368V31.4737H63.0588V30.6868H78.0353V15.7368H78.8235Z" fill="#F47920"/>
<path fill-rule="evenodd" clip-rule="evenodd" d="M78.8235 0V15.7368H63.0588V14.95H78.0353V0H78.8235Z" fill="#F47920"/>
<path fill-rule="evenodd" clip-rule="evenodd" d="M63.0588 15.7368V31.4737H47.2941V30.6868H62.2706V15.7368H63.0588Z" fill="#F47920"/>
<path fill-rule="evenodd" clip-rule="evenodd" d="M63.0588 0V15.7368H47.2941V14.95H62.2706V0H63.0588Z" fill="#F47920"/>
<path fill-rule="evenodd" clip-rule="evenodd" d="M47.2941 15.7368V31.4737H31.5294V30.6868H46.5059V15.7368H47.2941Z" fill="#F47920"/>
<path fill-rule="evenodd" clip-rule="evenodd" d="M47.2941 0V15.7368H31.5294V14.95H46.5059V0H47.2941Z" fill="#F47920"/>
<path fill-rule="evenodd" clip-rule="evenodd" d="M31.5294 15.7368V31.4737H15.7647V30.6868H30.7412V15.7368H31.5294Z" fill="#F47920"/>
<path fill-rule="evenodd" clip-rule="evenodd" d="M31.5294 0V15.7368H15.7647V14.95H30.7412V0H31.5294Z" fill="#F47920"/>
<path fill-rule="evenodd" clip-rule="evenodd" d="M15.7647 15.7368V31.4737H0V30.6868H14.9765V15.7368H15.7647Z" fill="#F47920"/>
<path fill-rule="evenodd" clip-rule="evenodd" d="M15.7647 0V15.7368H0V14.95H14.9765V0H15.7647Z" fill="#F47920"/>
<path fill-rule="evenodd" clip-rule="evenodd" d="M236.471 31.4737V47.2105H220.706V46.4237H235.682V31.4737H236.471Z" fill="#F47920"/>
<path fill-rule="evenodd" clip-rule="evenodd" d="M252.235 31.4737V47.2105H236.471V46.4237H251.447V31.4737H252.235Z" fill="#F47920"/>
<path fill-rule="evenodd" clip-rule="evenodd" d="M268 31.4737V47.2105H252.235V46.4237H267.212V31.4737H268Z" fill="#F47920"/>
<path fill-rule="evenodd" clip-rule="evenodd" d="M220.706 31.4737V47.2105H204.941V46.4237H219.918V31.4737H220.706Z" fill="#F47920"/>
<path fill-rule="evenodd" clip-rule="evenodd" d="M204.941 31.4737V47.2105H189.176V46.4237H204.153V31.4737H204.941Z" fill="#F47920"/>
<path fill-rule="evenodd" clip-rule="evenodd" d="M189.176 31.4737V47.2105H173.412V46.4237H188.388V31.4737H189.176Z" fill="#F47920"/>
<path d="M173.412 31.4737H157.647V47.2105H173.412V31.4737Z" fill="#F47920"/>
<path fill-rule="evenodd" clip-rule="evenodd" d="M173.412 31.4737V47.2105H157.647V46.4237H172.624V31.4737H173.412Z" fill="#F47920"/>
<path fill-rule="evenodd" clip-rule="evenodd" d="M157.647 31.4737V47.2105H141.882V46.4237H156.859V31.4737H157.647Z" fill="#F47920"/>
<path d="M141.882 31.4737H126.118V47.2105H141.882V31.4737Z" fill="#F47920"/>
<path fill-rule="evenodd" clip-rule="evenodd" d="M141.882 31.4737V47.2105H126.118V46.4237H141.094V31.4737H141.882Z" fill="#F47920"/>
<path fill-rule="evenodd" clip-rule="evenodd" d="M126.118 31.4737V47.2105H110.353V46.4237H125.329V31.4737H126.118Z" fill="#F47920"/>
<path d="M110.353 31.4737H94.5882V47.2105H110.353V31.4737Z" fill="#F47920"/>
<path fill-rule="evenodd" clip-rule="evenodd" d="M110.353 31.4737V47.2105H94.5882V46.4237H109.565V31.4737H110.353Z" fill="#F47920"/>
<path fill-rule="evenodd" clip-rule="evenodd" d="M94.5882 31.4737V47.2105H78.8235V46.4237H93.8V31.4737H94.5882Z" fill="#F47920"/>
<path fill-rule="evenodd" clip-rule="evenodd" d="M78.8235 31.4737V47.2105H63.0588V46.4237H78.0353V31.4737H78.8235Z" fill="#F47920"/>
<path fill-rule="evenodd" clip-rule="evenodd" d="M63.0588 31.4737V47.2105H47.2941V46.4237H62.2706V31.4737H63.0588Z" fill="#F47920"/>
<path fill-rule="evenodd" clip-rule="evenodd" d="M31.5294 31.4737V47.2105H15.7647V46.4237H30.7412V31.4737H31.5294Z" fill="#F47920"/>
<path fill-rule="evenodd" clip-rule="evenodd" d="M47.2941 31.4737V47.2105H31.5294V46.4237H46.5059V31.4737H47.2941Z" fill="#F47920"/>
<path fill-rule="evenodd" clip-rule="evenodd" d="M15.7647 31.4737V47.2105H0V46.4237H14.9765V31.4737H15.7647Z" fill="#F47920"/>
<path fill-rule="evenodd" clip-rule="evenodd" d="M236.471 47.2105V62.9474H220.706V62.1605H235.682V47.2105H236.471Z" fill="#F47920"/>
<path fill-rule="evenodd" clip-rule="evenodd" d="M252.235 47.2105V62.9474H236.471V62.1605H251.447V47.2105H252.235Z" fill="#F47920"/>
<path fill-rule="evenodd" clip-rule="evenodd" d="M268 47.2105V62.9474H252.235V62.1605H267.212V47.2105H268Z" fill="#F47920"/>
<path fill-rule="evenodd" clip-rule="evenodd" d="M220.706 47.2105V62.9474H204.941V62.1605H219.918V47.2105H220.706Z" fill="#F47920"/>
<path fill-rule="evenodd" clip-rule="evenodd" d="M204.941 47.2105V62.9474H189.176V62.1605H204.153V47.2105H204.941Z" fill="#F47920"/>
<path d="M189.176 47.2105H173.412V62.9474H189.176V47.2105Z" fill="#F47920"/>
<path fill-rule="evenodd" clip-rule="evenodd" d="M189.176 47.2105V62.9474H173.412V62.1605H188.388V47.2105H189.176Z" fill="#F47920"/>
<path fill-rule="evenodd" clip-rule="evenodd" d="M173.412 47.2105V62.9474H157.647V62.1605H172.624V47.2105H173.412Z" fill="#F47920"/>
<path d="M157.647 47.2105H141.882V62.9474H157.647V47.2105Z" fill="#F47920"/>
<path fill-rule="evenodd" clip-rule="evenodd" d="M157.647 47.2105V62.9474H141.882V62.1605H156.859V47.2105H157.647Z" fill="#F47920"/>
<path fill-rule="evenodd" clip-rule="evenodd" d="M141.882 47.2105V62.9474H126.118V62.1605H141.094V47.2105H141.882Z" fill="#F47920"/>
<path d="M126.118 47.2105H110.353V62.9474H126.118V47.2105Z" fill="#F47920"/>
<path fill-rule="evenodd" clip-rule="evenodd" d="M126.118 47.2105V62.9474H110.353V62.1605H125.329V47.2105H126.118Z" fill="#F47920"/>
<path fill-rule="evenodd" clip-rule="evenodd" d="M110.353 47.2105V62.9474H94.5882V62.1605H109.565V47.2105H110.353Z" fill="#F47920"/>
<path d="M94.5882 47.2105H78.8235V62.9474H94.5882V47.2105Z" fill="#F47920"/>
<path fill-rule="evenodd" clip-rule="evenodd" d="M94.5882 47.2105V62.9474H78.8235V62.1605H93.8V47.2105H94.5882Z" fill="#F47920"/>
<path fill-rule="evenodd" clip-rule="evenodd" d="M78.8235 47.2105V62.9474H63.0588V62.1605H78.0353V47.2105H78.8235Z" fill="#F47920"/>
<path fill-rule="evenodd" clip-rule="evenodd" d="M31.5294 47.2105V62.9474H15.7647V62.1605H30.7412V47.2105H31.5294Z" fill="#F47920"/>
<path fill-rule="evenodd" clip-rule="evenodd" d="M63.0588 47.2105V62.9474H47.2941V62.1605H62.2706V47.2105H63.0588Z" fill="#F47920"/>
<path fill-rule="evenodd" clip-rule="evenodd" d="M47.2941 47.2105V62.9474H31.5294V62.1605H46.5059V47.2105H47.2941Z" fill="#F47920"/>
<path fill-rule="evenodd" clip-rule="evenodd" d="M15.7647 47.2105V62.9474H0V62.1605H14.9765V47.2105H15.7647Z" fill="#F47920"/>
<path fill-rule="evenodd" clip-rule="evenodd" d="M236.471 62.9474V78.6842H220.706V77.8974H235.682V62.9474H236.471Z" fill="#F47920"/>
<path fill-rule="evenodd" clip-rule="evenodd" d="M252.235 62.9474V78.6842H236.471V77.8974H251.447V62.9474H252.235Z" fill="#F47920"/>
<path fill-rule="evenodd" clip-rule="evenodd" d="M268 62.9474V78.6842H252.235V77.8974H267.212V62.9474H268Z" fill="#F47920"/>
<path fill-rule="evenodd" clip-rule="evenodd" d="M220.706 62.9474V78.6842H204.941V77.8974H219.918V62.9474H220.706Z" fill="#F47920"/>
<path d="M204.941 62.9474H189.176V78.6842H204.941V62.9474Z" fill="#F47920"/>
<path fill-rule="evenodd" clip-rule="evenodd" d="M204.941 62.9474V78.6842H189.176V77.8974H204.153V62.9474H204.941Z" fill="#F47920"/>
<path fill-rule="evenodd" clip-rule="evenodd" d="M189.176 62.9474V78.6842H173.412V77.8974H188.388V62.9474H189.176Z" fill="#F47920"/>
<path d="M173.412 62.9474H157.647V78.6842H173.412V62.9474Z" fill="#F47920"/>
<path fill-rule="evenodd" clip-rule="evenodd" d="M173.412 62.9474V78.6842H157.647V77.8974H172.624V62.9474H173.412Z" fill="#F47920"/>
<path fill-rule="evenodd" clip-rule="evenodd" d="M157.647 62.9474V78.6842H141.882V77.8974H156.859V62.9474H157.647Z" fill="#F47920"/>
<path fill-rule="evenodd" clip-rule="evenodd" d="M141.882 62.9474V78.6842H126.118V77.8974H141.094V62.9474H141.882Z" fill="#F47920"/>
<path fill-rule="evenodd" clip-rule="evenodd" d="M126.118 62.9474V78.6842H110.353V77.8974H125.329V62.9474H126.118Z" fill="#F47920"/>
<path d="M110.353 62.9474H94.5882V78.6842H110.353V62.9474Z" fill="#F47920"/>
<path fill-rule="evenodd" clip-rule="evenodd" d="M110.353 62.9474V78.6842H94.5882V77.8974H109.565V62.9474H110.353Z" fill="#F47920"/>
<path fill-rule="evenodd" clip-rule="evenodd" d="M94.5882 62.9474V78.6842H78.8235V77.8974H93.8V62.9474H94.5882Z" fill="#F47920"/>
<path fill-rule="evenodd" clip-rule="evenodd" d="M31.5294 62.9474V78.6842H15.7647V77.8974H30.7412V62.9474H31.5294Z" fill="#F47920"/>
<path d="M78.8235 62.9474H63.0588V78.6842H78.8235V62.9474Z" fill="#F47920"/>
<path fill-rule="evenodd" clip-rule="evenodd" d="M78.8235 62.9474V78.6842H63.0588V77.8974H78.0353V62.9474H78.8235Z" fill="#F47920"/>
<path fill-rule="evenodd" clip-rule="evenodd" d="M63.0588 62.9474V78.6842H47.2941V77.8974H62.2706V62.9474H63.0588Z" fill="#F47920"/>
<path fill-rule="evenodd" clip-rule="evenodd" d="M47.2941 62.9474V78.6842H31.5294V77.8974H46.5059V62.9474H47.2941Z" fill="#F47920"/>
<path fill-rule="evenodd" clip-rule="evenodd" d="M15.7647 62.9474V78.6842H0V77.8974H14.9765V62.9474H15.7647Z" fill="#F47920"/>
<path fill-rule="evenodd" clip-rule="evenodd" d="M236.471 78.6842V94.4211H220.706V93.6342H235.682V78.6842H236.471Z" fill="#F47920"/>
<path fill-rule="evenodd" clip-rule="evenodd" d="M252.235 78.6842V94.4211H236.471V93.6342H251.447V78.6842H252.235Z" fill="#F47920"/>
<path fill-rule="evenodd" clip-rule="evenodd" d="M268 78.6842V94.4211H252.235V93.6342H267.212V78.6842H268Z" fill="#F47920"/>
<path d="M220.706 78.6842H204.941V94.4211H220.706V78.6842Z" fill="#F47920"/>
<path fill-rule="evenodd" clip-rule="evenodd" d="M220.706 78.6842V94.4211H204.941V93.6342H219.918V78.6842H220.706Z" fill="#F47920"/>
<path fill-rule="evenodd" clip-rule="evenodd" d="M204.941 78.6842V94.4211H189.176V93.6342H204.153V78.6842H204.941Z" fill="#F47920"/>
<path d="M189.176 78.6842H173.412V94.4211H189.176V78.6842Z" fill="#F47920"/>
<path fill-rule="evenodd" clip-rule="evenodd" d="M189.176 78.6842V94.4211H173.412V93.6342H188.388V78.6842H189.176Z" fill="#F47920"/>
<path fill-rule="evenodd" clip-rule="evenodd" d="M173.412 78.6842V94.4211H157.647V93.6342H172.624V78.6842H173.412Z" fill="#F47920"/>
<path fill-rule="evenodd" clip-rule="evenodd" d="M157.647 78.6842V94.4211H141.882V93.6342H156.859V78.6842H157.647Z" fill="#F47920"/>
<path fill-rule="evenodd" clip-rule="evenodd" d="M141.882 78.6842V94.4211H126.118V93.6342H141.094V78.6842H141.882Z" fill="#F47920"/>
<path fill-rule="evenodd" clip-rule="evenodd" d="M126.118 78.6842V94.4211H110.353V93.6342H125.329V78.6842H126.118Z" fill="#F47920"/>
<path fill-rule="evenodd" clip-rule="evenodd" d="M110.353 78.6842V94.4211H94.5882V93.6342H109.565V78.6842H110.353Z" fill="#F47920"/>
<path fill-rule="evenodd" clip-rule="evenodd" d="M31.5294 78.6842V94.4211H15.7647V93.6342H30.7412V78.6842H31.5294Z" fill="#F47920"/>
<path d="M94.5882 78.6842H78.8235V94.4211H94.5882V78.6842Z" fill="#F47920"/>
<path fill-rule="evenodd" clip-rule="evenodd" d="M94.5882 78.6842V94.4211H78.8235V93.6342H93.8V78.6842H94.5882Z" fill="#F47920"/>
<path fill-rule="evenodd" clip-rule="evenodd" d="M78.8235 78.6842V94.4211H63.0588V93.6342H78.0353V78.6842H78.8235Z" fill="#F47920"/>
<path d="M63.0588 78.6842H47.2941V94.4211H63.0588V78.6842Z" fill="#F47920"/>
<path fill-rule="evenodd" clip-rule="evenodd" d="M63.0588 78.6842V94.4211H47.2941V93.6342H62.2706V78.6842H63.0588Z" fill="#F47920"/>
<path fill-rule="evenodd" clip-rule="evenodd" d="M47.2941 78.6842V94.4211H31.5294V93.6342H46.5059V78.6842H47.2941Z" fill="#F47920"/>
<path fill-rule="evenodd" clip-rule="evenodd" d="M15.7647 78.6842V94.4211H0V93.6342H14.9765V78.6842H15.7647Z" fill="#F47920"/>
<path d="M236.471 94.4211H220.706V110.158H236.471V94.4211Z" fill="#F47920"/>
<path fill-rule="evenodd" clip-rule="evenodd" d="M236.471 94.4211V110.158H220.706V109.371H235.682V94.4211H236.471Z" fill="#F47920"/>
<path fill-rule="evenodd" clip-rule="evenodd" d="M252.235 94.4211V110.158H236.471V109.371H251.447V94.4211H252.235Z" fill="#F47920"/>
<path fill-rule="evenodd" clip-rule="evenodd" d="M268 94.4211V110.158H252.235V109.371H267.212V94.4211H268Z" fill="#F47920"/>
<path fill-rule="evenodd" clip-rule="evenodd" d="M220.706 94.4211V110.158H204.941V109.371H219.918V94.4211H220.706Z" fill="#F47920"/>
<path d="M204.941 94.4211H189.176V110.158H204.941V94.4211Z" fill="#F47920"/>
<path fill-rule="evenodd" clip-rule="evenodd" d="M204.941 94.4211V110.158H189.176V109.371H204.153V94.4211H204.941Z" fill="#F47920"/>
<path fill-rule="evenodd" clip-rule="evenodd" d="M189.176 94.4211V110.158H173.412V109.371H188.388V94.4211H189.176Z" fill="#F47920"/>
<path fill-rule="evenodd" clip-rule="evenodd" d="M173.412 94.4211V110.158H157.647V109.371H172.624V94.4211H173.412Z" fill="#F47920"/>
<path fill-rule="evenodd" clip-rule="evenodd" d="M157.647 94.4211V110.158H141.882V109.371H156.859V94.4211H157.647Z" fill="#F47920"/>
<path fill-rule="evenodd" clip-rule="evenodd" d="M141.882 94.4211V110.158H126.118V109.371H141.094V94.4211H141.882Z" fill="#F47920"/>
<path fill-rule="evenodd" clip-rule="evenodd" d="M126.118 94.4211V110.158H110.353V109.371H125.329V94.4211H126.118Z" fill="#F47920"/>
<path fill-rule="evenodd" clip-rule="evenodd" d="M31.5294 94.4211V110.158H15.7647V109.371H30.7412V94.4211H31.5294Z" fill="#F47920"/>
<path fill-rule="evenodd" clip-rule="evenodd" d="M110.353 94.4211V110.158H94.5882V109.371H109.565V94.4211H110.353Z" fill="#F47920"/>
<path fill-rule="evenodd" clip-rule="evenodd" d="M94.5882 94.4211V110.158H78.8235V109.371H93.8V94.4211H94.5882Z" fill="#F47920"/>
<path d="M78.8235 94.4211H63.0588V110.158H78.8235V94.4211Z" fill="#F47920"/>
<path fill-rule="evenodd" clip-rule="evenodd" d="M78.8235 94.4211V110.158H63.0588V109.371H78.0353V94.4211H78.8235Z" fill="#F47920"/>
<path fill-rule="evenodd" clip-rule="evenodd" d="M63.0588 94.4211V110.158H47.2941V109.371H62.2706V94.4211H63.0588Z" fill="#F47920"/>
<path d="M47.2941 94.4211H31.5294V110.158H47.2941V94.4211Z" fill="#F47920"/>
<path fill-rule="evenodd" clip-rule="evenodd" d="M47.2941 94.4211V110.158H31.5294V109.371H46.5059V94.4211H47.2941Z" fill="#F47920"/>
<path fill-rule="evenodd" clip-rule="evenodd" d="M15.7647 94.4211V110.158H0V109.371H14.9765V94.4211H15.7647Z" fill="#F47920"/>
<path fill-rule="evenodd" clip-rule="evenodd" d="M236.471 110.158V125.895H220.706V125.108H235.682V110.158H236.471Z" fill="#F47920"/>
<path fill-rule="evenodd" clip-rule="evenodd" d="M252.235 110.158V125.895H236.471V125.108H251.447V110.158H252.235Z" fill="#F47920"/>
<path fill-rule="evenodd" clip-rule="evenodd" d="M268 110.158V125.895H252.235V125.108H267.212V110.158H268Z" fill="#F47920"/>
<path d="M220.706 110.158H204.941V125.895H220.706V110.158Z" fill="#F47920"/>
<path fill-rule="evenodd" clip-rule="evenodd" d="M220.706 110.158V125.895H204.941V125.108H219.918V110.158H220.706Z" fill="#F47920"/>
<path fill-rule="evenodd" clip-rule="evenodd" d="M204.941 110.158V125.895H189.176V125.108H204.153V110.158H204.941Z" fill="#F47920"/>
<path fill-rule="evenodd" clip-rule="evenodd" d="M189.176 110.158V125.895H173.412V125.108H188.388V110.158H189.176Z" fill="#F47920"/>
<path d="M173.412 110.158H157.647V125.895H173.412V110.158Z" fill="#F47920"/>
<path fill-rule="evenodd" clip-rule="evenodd" d="M173.412 110.158V125.895H157.647V125.108H172.624V110.158H173.412Z" fill="#F47920"/>
<path fill-rule="evenodd" clip-rule="evenodd" d="M157.647 110.158V125.895H141.882V125.108H156.859V110.158H157.647Z" fill="#F47920"/>
<path d="M141.882 110.158H126.118V125.895H141.882V110.158Z" fill="#F47920"/>
<path fill-rule="evenodd" clip-rule="evenodd" d="M141.882 110.158V125.895H126.118V125.108H141.094V110.158H141.882Z" fill="#F47920"/>
<path fill-rule="evenodd" clip-rule="evenodd" d="M31.5294 110.158V125.895H15.7647V125.108H30.7412V110.158H31.5294Z" fill="#F47920"/>
<path fill-rule="evenodd" clip-rule="evenodd" d="M126.118 110.158V125.895H110.353V125.108H125.329V110.158H126.118Z" fill="#F47920"/>
<path fill-rule="evenodd" clip-rule="evenodd" d="M110.353 110.158V125.895H94.5882V125.108H109.565V110.158H110.353Z" fill="#F47920"/>
<path fill-rule="evenodd" clip-rule="evenodd" d="M94.5882 110.158V125.895H78.8235V125.108H93.8V110.158H94.5882Z" fill="#F47920"/>
<path fill-rule="evenodd" clip-rule="evenodd" d="M78.8235 110.158V125.895H63.0588V125.108H78.0353V110.158H78.8235Z" fill="#F47920"/>
<path d="M63.0588 110.158H47.2941V125.895H63.0588V110.158Z" fill="#F47920"/>
<path fill-rule="evenodd" clip-rule="evenodd" d="M63.0588 110.158V125.895H47.2941V125.108H62.2706V110.158H63.0588Z" fill="#F47920"/>
<path fill-rule="evenodd" clip-rule="evenodd" d="M47.2941 110.158V125.895H31.5294V125.108H46.5059V110.158H47.2941Z" fill="#F47920"/>
<path fill-rule="evenodd" clip-rule="evenodd" d="M15.7647 110.158V125.895H0V125.108H14.9765V110.158H15.7647Z" fill="#F47920"/>
<path d="M236.471 125.895H220.706V141.632H236.471V125.895Z" fill="#F47920"/>
<path fill-rule="evenodd" clip-rule="evenodd" d="M236.471 125.895V141.632H220.706V140.845H235.682V125.895H236.471Z" fill="#F47920"/>
<path fill-rule="evenodd" clip-rule="evenodd" d="M252.235 125.895V141.632H236.471V140.845H251.447V125.895H252.235Z" fill="#F47920"/>
<path fill-rule="evenodd" clip-rule="evenodd" d="M268 125.895V141.632H252.235V140.845H267.212V125.895H268Z" fill="#F47920"/>
<path fill-rule="evenodd" clip-rule="evenodd" d="M220.706 125.895V141.632H204.941V140.845H219.918V125.895H220.706Z" fill="#F47920"/>
<path d="M204.941 125.895H189.176V141.632H204.941V125.895Z" fill="#F47920"/>
<path fill-rule="evenodd" clip-rule="evenodd" d="M204.941 125.895V141.632H189.176V140.845H204.153V125.895H204.941Z" fill="#F47920"/>
<path fill-rule="evenodd" clip-rule="evenodd" d="M189.176 125.895V141.632H173.412V140.845H188.388V125.895H189.176Z" fill="#F47920"/>
<path fill-rule="evenodd" clip-rule="evenodd" d="M173.412 125.895V141.632H157.647V140.845H172.624V125.895H173.412Z" fill="#F47920"/>
<path d="M157.647 125.895H141.882V141.632H157.647V125.895Z" fill="#F47920"/>
<path fill-rule="evenodd" clip-rule="evenodd" d="M157.647 125.895V141.632H141.882V140.845H156.859V125.895H157.647Z" fill="#F47920"/>
<path fill-rule="evenodd" clip-rule="evenodd" d="M31.5294 125.895V141.632H15.7647V140.845H30.7412V125.895H31.5294Z" fill="#F47920"/>
<path fill-rule="evenodd" clip-rule="evenodd" d="M141.882 125.895V141.632H126.118V140.845H141.094V125.895H141.882Z" fill="#F47920"/>
<path fill-rule="evenodd" clip-rule="evenodd" d="M126.118 125.895V141.632H110.353V140.845H125.329V125.895H126.118Z" fill="#F47920"/>
<path fill-rule="evenodd" clip-rule="evenodd" d="M110.353 125.895V141.632H94.5882V140.845H109.565V125.895H110.353Z" fill="#F47920"/>
<path fill-rule="evenodd" clip-rule="evenodd" d="M94.5882 125.895V141.632H78.8235V140.845H93.8V125.895H94.5882Z" fill="#F47920"/>
<path d="M78.8235 125.895H63.0588V141.632H78.8235V125.895Z" fill="#F47920"/>
<path fill-rule="evenodd" clip-rule="evenodd" d="M78.8235 125.895V141.632H63.0588V140.845H78.0353V125.895H78.8235Z" fill="#F47920"/>
<path fill-rule="evenodd" clip-rule="evenodd" d="M63.0588 125.895V141.632H47.2941V140.845H62.2706V125.895H63.0588Z" fill="#F47920"/>
<path d="M47.2941 125.895H31.5294V141.632H47.2941V125.895Z" fill="#F47920"/>
<path fill-rule="evenodd" clip-rule="evenodd" d="M47.2941 125.895V141.632H31.5294V140.845H46.5059V125.895H47.2941Z" fill="#F47920"/>
<path fill-rule="evenodd" clip-rule="evenodd" d="M15.7647 125.895V141.632H0V140.845H14.9765V125.895H15.7647Z" fill="#F47920"/>
<path fill-rule="evenodd" clip-rule="evenodd" d="M236.471 141.632V157.368H220.706V156.582H235.682V141.632H236.471Z" fill="#F47920"/>
<path fill-rule="evenodd" clip-rule="evenodd" d="M252.235 141.632V157.368H236.471V156.582H251.447V141.632H252.235Z" fill="#F47920"/>
<path fill-rule="evenodd" clip-rule="evenodd" d="M268 141.632V157.368H252.235V156.582H267.212V141.632H268Z" fill="#F47920"/>
<path fill-rule="evenodd" clip-rule="evenodd" d="M220.706 141.632V157.368H204.941V156.582H219.918V141.632H220.706Z" fill="#F47920"/>
<path fill-rule="evenodd" clip-rule="evenodd" d="M204.941 141.632V157.368H189.176V156.582H204.153V141.632H204.941Z" fill="#F47920"/>
<path fill-rule="evenodd" clip-rule="evenodd" d="M189.176 141.632V157.368H173.412V156.582H188.388V141.632H189.176Z" fill="#F47920"/>
<path d="M173.412 141.632H157.647V157.368H173.412V141.632Z" fill="#F47920"/>
<path fill-rule="evenodd" clip-rule="evenodd" d="M173.412 141.632V157.368H157.647V156.582H172.624V141.632H173.412Z" fill="#F47920"/>
<path fill-rule="evenodd" clip-rule="evenodd" d="M31.5294 141.632V157.368H15.7647V156.582H30.7412V141.632H31.5294Z" fill="#F47920"/>
<path fill-rule="evenodd" clip-rule="evenodd" d="M157.647 141.632V157.368H141.882V156.582H156.859V141.632H157.647Z" fill="#F47920"/>
<path d="M141.882 141.632H126.118V157.368H141.882V141.632Z" fill="#F47920"/>
<path fill-rule="evenodd" clip-rule="evenodd" d="M141.882 141.632V157.368H126.118V156.582H141.094V141.632H141.882Z" fill="#F47920"/>
<path fill-rule="evenodd" clip-rule="evenodd" d="M126.118 141.632V157.368H110.353V156.582H125.329V141.632H126.118Z" fill="#F47920"/>
<path d="M110.353 141.632H94.5882V157.368H110.353V141.632Z" fill="#F47920"/>
<path fill-rule="evenodd" clip-rule="evenodd" d="M110.353 141.632V157.368H94.5882V156.582H109.565V141.632H110.353Z" fill="#F47920"/>
<path fill-rule="evenodd" clip-rule="evenodd" d="M94.5882 141.632V157.368H78.8235V156.582H93.8V141.632H94.5882Z" fill="#F47920"/>
<path fill-rule="evenodd" clip-rule="evenodd" d="M78.8235 141.632V157.368H63.0588V156.582H78.0353V141.632H78.8235Z" fill="#F47920"/>
<path fill-rule="evenodd" clip-rule="evenodd" d="M63.0588 141.632V157.368H47.2941V156.582H62.2706V141.632H63.0588Z" fill="#F47920"/>
<path fill-rule="evenodd" clip-rule="evenodd" d="M47.2941 141.632V157.368H31.5294V156.582H46.5059V141.632H47.2941Z" fill="#F47920"/>
<path fill-rule="evenodd" clip-rule="evenodd" d="M15.7647 141.632V157.368H0V156.582H14.9765V141.632H15.7647Z" fill="#F47920"/>
<path d="M236.471 157.368H220.706V173.105H236.471V157.368Z" fill="#F47920"/>
<path fill-rule="evenodd" clip-rule="evenodd" d="M236.471 157.368V173.105H220.706V172.318H235.682V157.368H236.471Z" fill="#F47920"/>
<path fill-rule="evenodd" clip-rule="evenodd" d="M252.235 157.368V173.105H236.471V172.318H251.447V157.368H252.235Z" fill="#F47920"/>
<path fill-rule="evenodd" clip-rule="evenodd" d="M268 157.368V173.105H252.235V172.318H267.212V157.368H268Z" fill="#F47920"/>
<path fill-rule="evenodd" clip-rule="evenodd" d="M220.706 157.368V173.105H204.941V172.318H219.918V157.368H220.706Z" fill="#F47920"/>
<path d="M204.941 157.368H189.176V173.105H204.941V157.368Z" fill="#F47920"/>
<path fill-rule="evenodd" clip-rule="evenodd" d="M204.941 157.368V173.105H189.176V172.318H204.153V157.368H204.941Z" fill="#F47920"/>
<path fill-rule="evenodd" clip-rule="evenodd" d="M189.176 157.368V173.105H173.412V172.318H188.388V157.368H189.176Z" fill="#F47920"/>
<path fill-rule="evenodd" clip-rule="evenodd" d="M31.5294 157.368V173.105H15.7647V172.318H30.7412V157.368H31.5294Z" fill="#F47920"/>
<path fill-rule="evenodd" clip-rule="evenodd" d="M173.412 157.368V173.105H157.647V172.318H172.624V157.368H173.412Z" fill="#F47920"/>
<path fill-rule="evenodd" clip-rule="evenodd" d="M157.647 157.368V173.105H141.882V172.318H156.859V157.368H157.647Z" fill="#F47920"/>
<path fill-rule="evenodd" clip-rule="evenodd" d="M141.882 157.368V173.105H126.118V172.318H141.094V157.368H141.882Z" fill="#F47920"/>
<path d="M126.118 157.368H110.353V173.105H126.118V157.368Z" fill="#F47920"/>
<path fill-rule="evenodd" clip-rule="evenodd" d="M126.118 157.368V173.105H110.353V172.318H125.329V157.368H126.118Z" fill="#F47920"/>
<path fill-rule="evenodd" clip-rule="evenodd" d="M110.353 157.368V173.105H94.5882V172.318H109.565V157.368H110.353Z" fill="#F47920"/>
<path fill-rule="evenodd" clip-rule="evenodd" d="M94.5882 157.368V173.105H78.8235V172.318H93.8V157.368H94.5882Z" fill="#F47920"/>
<path d="M78.8235 157.368H63.0588V173.105H78.8235V157.368Z" fill="#F47920"/>
<path fill-rule="evenodd" clip-rule="evenodd" d="M78.8235 157.368V173.105H63.0588V172.318H78.0353V157.368H78.8235Z" fill="#F47920"/>
<path fill-rule="evenodd" clip-rule="evenodd" d="M63.0588 157.368V173.105H47.2941V172.318H62.2706V157.368H63.0588Z" fill="#F47920"/>
<path d="M47.2941 157.368H31.5294V173.105H47.2941V157.368Z" fill="#F47920"/>
<path fill-rule="evenodd" clip-rule="evenodd" d="M47.2941 157.368V173.105H31.5294V172.318H46.5059V157.368H47.2941Z" fill="#F47920"/>
<path fill-rule="evenodd" clip-rule="evenodd" d="M15.7647 157.368V173.105H0V172.318H14.9765V157.368H15.7647Z" fill="#F47920"/>
<path fill-rule="evenodd" clip-rule="evenodd" d="M236.471 173.105V188.842H220.706V188.055H235.682V173.105H236.471Z" fill="#F47920"/>
<path fill-rule="evenodd" clip-rule="evenodd" d="M252.235 173.105V188.842H236.471V188.055H251.447V173.105H252.235Z" fill="#F47920"/>
<path fill-rule="evenodd" clip-rule="evenodd" d="M268 173.105V188.842H252.235V188.055H267.212V173.105H268Z" fill="#F47920"/>
<path d="M220.706 173.105H204.941V188.842H220.706V173.105Z" fill="#F47920"/>
<path fill-rule="evenodd" clip-rule="evenodd" d="M220.706 173.105V188.842H204.941V188.055H219.918V173.105H220.706Z" fill="#F47920"/>
<path fill-rule="evenodd" clip-rule="evenodd" d="M204.941 173.105V188.842H189.176V188.055H204.153V173.105H204.941Z" fill="#F47920"/>
<path fill-rule="evenodd" clip-rule="evenodd" d="M31.5294 173.105V188.842H15.7647V188.055H30.7412V173.105H31.5294Z" fill="#F47920"/>
<path fill-rule="evenodd" clip-rule="evenodd" d="M189.176 173.105V188.842H173.412V188.055H188.388V173.105H189.176Z" fill="#F47920"/>
<path fill-rule="evenodd" clip-rule="evenodd" d="M173.412 173.105V188.842H157.647V188.055H172.624V173.105H173.412Z" fill="#F47920"/>
<path fill-rule="evenodd" clip-rule="evenodd" d="M157.647 173.105V188.842H141.882V188.055H156.859V173.105H157.647Z" fill="#F47920"/>
<path d="M141.882 173.105H126.118V188.842H141.882V173.105Z" fill="#F47920"/>
<path fill-rule="evenodd" clip-rule="evenodd" d="M141.882 173.105V188.842H126.118V188.055H141.094V173.105H141.882Z" fill="#F47920"/>
<path fill-rule="evenodd" clip-rule="evenodd" d="M126.118 173.105V188.842H110.353V188.055H125.329V173.105H126.118Z" fill="#F47920"/>
<path d="M110.353 173.105H94.5882V188.842H110.353V173.105Z" fill="#F47920"/>
<path fill-rule="evenodd" clip-rule="evenodd" d="M110.353 173.105V188.842H94.5882V188.055H109.565V173.105H110.353Z" fill="#F47920"/>
<path fill-rule="evenodd" clip-rule="evenodd" d="M94.5882 173.105V188.842H78.8235V188.055H93.8V173.105H94.5882Z" fill="#F47920"/>
<path fill-rule="evenodd" clip-rule="evenodd" d="M78.8235 173.105V188.842H63.0588V188.055H78.0353V173.105H78.8235Z" fill="#F47920"/>
<path d="M63.0588 173.105H47.2941V188.842H63.0588V173.105Z" fill="#F47920"/>
<path fill-rule="evenodd" clip-rule="evenodd" d="M63.0588 173.105V188.842H47.2941V188.055H62.2706V173.105H63.0588Z" fill="#F47920"/>
<path fill-rule="evenodd" clip-rule="evenodd" d="M47.2941 173.105V188.842H31.5294V188.055H46.5059V173.105H47.2941Z" fill="#F47920"/>
<path fill-rule="evenodd" clip-rule="evenodd" d="M15.7647 173.105V188.842H0V188.055H14.9765V173.105H15.7647Z" fill="#F47920"/>
<path d="M236.471 188.842H220.706V204.579H236.471V188.842Z" fill="#F47920"/>
<path fill-rule="evenodd" clip-rule="evenodd" d="M236.471 188.842V204.579H220.706V203.792H235.682V188.842H236.471Z" fill="#F47920"/>
<path fill-rule="evenodd" clip-rule="evenodd" d="M252.235 188.842V204.579H236.471V203.792H251.447V188.842H252.235Z" fill="#F47920"/>
<path fill-rule="evenodd" clip-rule="evenodd" d="M268 188.842V204.579H252.235V203.792H267.212V188.842H268Z" fill="#F47920"/>
<path fill-rule="evenodd" clip-rule="evenodd" d="M220.706 188.842V204.579H204.941V203.792H219.918V188.842H220.706Z" fill="#F47920"/>
<path fill-rule="evenodd" clip-rule="evenodd" d="M31.5294 188.842V204.579H15.7647V203.792H30.7412V188.842H31.5294Z" fill="#F47920"/>
<path d="M204.941 188.842H189.176V204.579H204.941V188.842Z" fill="#F47920"/>
<path fill-rule="evenodd" clip-rule="evenodd" d="M204.941 188.842V204.579H189.176V203.792H204.153V188.842H204.941Z" fill="#F47920"/>
<path fill-rule="evenodd" clip-rule="evenodd" d="M189.176 188.842V204.579H173.412V203.792H188.388V188.842H189.176Z" fill="#F47920"/>
<path fill-rule="evenodd" clip-rule="evenodd" d="M173.412 188.842V204.579H157.647V203.792H172.624V188.842H173.412Z" fill="#F47920"/>
<path fill-rule="evenodd" clip-rule="evenodd" d="M157.647 188.842V204.579H141.882V203.792H156.859V188.842H157.647Z" fill="#F47920"/>
<path fill-rule="evenodd" clip-rule="evenodd" d="M141.882 188.842V204.579H126.118V203.792H141.094V188.842H141.882Z" fill="#F47920"/>
<path fill-rule="evenodd" clip-rule="evenodd" d="M126.118 188.842V204.579H110.353V203.792H125.329V188.842H126.118Z" fill="#F47920"/>
<path fill-rule="evenodd" clip-rule="evenodd" d="M110.353 188.842V204.579H94.5882V203.792H109.565V188.842H110.353Z" fill="#F47920"/>
<path fill-rule="evenodd" clip-rule="evenodd" d="M94.5882 188.842V204.579H78.8235V203.792H93.8V188.842H94.5882Z" fill="#F47920"/>
<path d="M78.8235 188.842H63.0588V204.579H78.8235V188.842Z" fill="#F47920"/>
<path fill-rule="evenodd" clip-rule="evenodd" d="M78.8235 188.842V204.579H63.0588V203.792H78.0353V188.842H78.8235Z" fill="#F47920"/>
<path fill-rule="evenodd" clip-rule="evenodd" d="M63.0588 188.842V204.579H47.2941V203.792H62.2706V188.842H63.0588Z" fill="#F47920"/>
<path d="M47.2941 188.842H31.5294V204.579H47.2941V188.842Z" fill="#F47920"/>
<path fill-rule="evenodd" clip-rule="evenodd" d="M47.2941 188.842V204.579H31.5294V203.792H46.5059V188.842H47.2941Z" fill="#F47920"/>
<path fill-rule="evenodd" clip-rule="evenodd" d="M15.7647 188.842V204.579H0V203.792H14.9765V188.842H15.7647Z" fill="#F47920"/>
<path fill-rule="evenodd" clip-rule="evenodd" d="M236.471 204.579V220.316H220.706V219.529H235.682V204.579H236.471Z" fill="#F47920"/>
<path fill-rule="evenodd" clip-rule="evenodd" d="M252.235 204.579V220.316H236.471V219.529H251.447V204.579H252.235Z" fill="#F47920"/>
<path fill-rule="evenodd" clip-rule="evenodd" d="M268 204.579V220.316H252.235V219.529H267.212V204.579H268Z" fill="#F47920"/>
<path fill-rule="evenodd" clip-rule="evenodd" d="M31.5294 204.579V220.316H15.7647V219.529H30.7412V204.579H31.5294Z" fill="#F47920"/>
<path d="M220.706 204.579H204.941V220.316H220.706V204.579Z" fill="#F47920"/>
<path fill-rule="evenodd" clip-rule="evenodd" d="M220.706 204.579V220.316H204.941V219.529H219.918V204.579H220.706Z" fill="#F47920"/>
<path fill-rule="evenodd" clip-rule="evenodd" d="M204.941 204.579V220.316H189.176V219.529H204.153V204.579H204.941Z" fill="#F47920"/>
<path d="M189.176 204.579H173.412V220.316H189.176V204.579Z" fill="#F47920"/>
<path fill-rule="evenodd" clip-rule="evenodd" d="M189.176 204.579V220.316H173.412V219.529H188.388V204.579H189.176Z" fill="#F47920"/>
<path fill-rule="evenodd" clip-rule="evenodd" d="M173.412 204.579V220.316H157.647V219.529H172.624V204.579H173.412Z" fill="#F47920"/>
<path fill-rule="evenodd" clip-rule="evenodd" d="M157.647 204.579V220.316H141.882V219.529H156.859V204.579H157.647Z" fill="#F47920"/>
<path fill-rule="evenodd" clip-rule="evenodd" d="M141.882 204.579V220.316H126.118V219.529H141.094V204.579H141.882Z" fill="#F47920"/>
<path fill-rule="evenodd" clip-rule="evenodd" d="M126.118 204.579V220.316H110.353V219.529H125.329V204.579H126.118Z" fill="#F47920"/>
<path fill-rule="evenodd" clip-rule="evenodd" d="M110.353 204.579V220.316H94.5882V219.529H109.565V204.579H110.353Z" fill="#F47920"/>
<path d="M94.5882 204.579H78.8235V220.316H94.5882V204.579Z" fill="#F47920"/>
<path fill-rule="evenodd" clip-rule="evenodd" d="M94.5882 204.579V220.316H78.8235V219.529H93.8V204.579H94.5882Z" fill="#F47920"/>
<path fill-rule="evenodd" clip-rule="evenodd" d="M78.8235 204.579V220.316H63.0588V219.529H78.0353V204.579H78.8235Z" fill="#F47920"/>
<path d="M63.0588 204.579H47.2941V220.316H63.0588V204.579Z" fill="#F47920"/>
<path fill-rule="evenodd" clip-rule="evenodd" d="M63.0588 204.579V220.316H47.2941V219.529H62.2706V204.579H63.0588Z" fill="#F47920"/>
<path fill-rule="evenodd" clip-rule="evenodd" d="M47.2941 204.579V220.316H31.5294V219.529H46.5059V204.579H47.2941Z" fill="#F47920"/>
<path fill-rule="evenodd" clip-rule="evenodd" d="M15.7647 204.579V220.316H0V219.529H14.9765V204.579H15.7647Z" fill="#F47920"/>
<path fill-rule="evenodd" clip-rule="evenodd" d="M31.5294 220.316V236.053H15.7647V235.266H30.7412V220.316H31.5294Z" fill="#F47920"/>
<path fill-rule="evenodd" clip-rule="evenodd" d="M236.471 220.316V236.053H220.706V235.266H235.682V220.316H236.471Z" fill="#F47920"/>
<path fill-rule="evenodd" clip-rule="evenodd" d="M252.235 220.316V236.053H236.471V235.266H251.447V220.316H252.235Z" fill="#F47920"/>
<path fill-rule="evenodd" clip-rule="evenodd" d="M268 220.316V236.053H252.235V235.266H267.212V220.316H268Z" fill="#F47920"/>
<path fill-rule="evenodd" clip-rule="evenodd" d="M220.706 220.316V236.053H204.941V235.266H219.918V220.316H220.706Z" fill="#F47920"/>
<path d="M204.941 220.316H189.176V236.053H204.941V220.316Z" fill="#F47920"/>
<path fill-rule="evenodd" clip-rule="evenodd" d="M204.941 220.316V236.053H189.176V235.266H204.153V220.316H204.941Z" fill="#F47920"/>
<path fill-rule="evenodd" clip-rule="evenodd" d="M189.176 220.316V236.053H173.412V235.266H188.388V220.316H189.176Z" fill="#F47920"/>
<path d="M173.412 220.316H157.647V236.053H173.412V220.316Z" fill="#F47920"/>
<path fill-rule="evenodd" clip-rule="evenodd" d="M173.412 220.316V236.053H157.647V235.266H172.624V220.316H173.412Z" fill="#F47920"/>
<path fill-rule="evenodd" clip-rule="evenodd" d="M157.647 220.316V236.053H141.882V235.266H156.859V220.316H157.647Z" fill="#F47920"/>
<path fill-rule="evenodd" clip-rule="evenodd" d="M141.882 220.316V236.053H126.118V235.266H141.094V220.316H141.882Z" fill="#F47920"/>
<path fill-rule="evenodd" clip-rule="evenodd" d="M126.118 220.316V236.053H110.353V235.266H125.329V220.316H126.118Z" fill="#F47920"/>
<path d="M110.353 220.316H94.5882V236.053H110.353V220.316Z" fill="#F47920"/>
<path fill-rule="evenodd" clip-rule="evenodd" d="M110.353 220.316V236.053H94.5882V235.266H109.565V220.316H110.353Z" fill="#F47920"/>
<path fill-rule="evenodd" clip-rule="evenodd" d="M94.5882 220.316V236.053H78.8235V235.266H93.8V220.316H94.5882Z" fill="#F47920"/>
<path d="M78.8235 220.316H63.0588V236.053H78.8235V220.316Z" fill="#F47920"/>
<path fill-rule="evenodd" clip-rule="evenodd" d="M78.8235 220.316V236.053H63.0588V235.266H78.0353V220.316H78.8235Z" fill="#F47920"/>
<path fill-rule="evenodd" clip-rule="evenodd" d="M63.0588 220.316V236.053H47.2941V235.266H62.2706V220.316H63.0588Z" fill="#F47920"/>
<path fill-rule="evenodd" clip-rule="evenodd" d="M47.2941 220.316V236.053H31.5294V235.266H46.5059V220.316H47.2941Z" fill="#F47920"/>
<path fill-rule="evenodd" clip-rule="evenodd" d="M31.5294 236.053V251.789H15.7647V251.003H30.7412V236.053H31.5294Z" fill="#F47920"/>
<path fill-rule="evenodd" clip-rule="evenodd" d="M15.7647 220.316V236.053H0V235.266H14.9765V220.316H15.7647Z" fill="#F47920"/>
<path fill-rule="evenodd" clip-rule="evenodd" d="M236.471 236.053V251.789H220.706V251.003H235.682V236.053H236.471Z" fill="#F47920"/>
<path fill-rule="evenodd" clip-rule="evenodd" d="M252.235 236.053V251.789H236.471V251.003H251.447V236.053H252.235Z" fill="#F47920"/>
<path fill-rule="evenodd" clip-rule="evenodd" d="M268 236.053V251.789H252.235V251.003H267.212V236.053H268Z" fill="#F47920"/>
<path fill-rule="evenodd" clip-rule="evenodd" d="M220.706 236.053V251.789H204.941V251.003H219.918V236.053H220.706Z" fill="#F47920"/>
<path fill-rule="evenodd" clip-rule="evenodd" d="M204.941 236.053V251.789H189.176V251.003H204.153V236.053H204.941Z" fill="#F47920"/>
<path d="M189.176 236.053H173.412V251.789H189.176V236.053Z" fill="#F47920"/>
<path fill-rule="evenodd" clip-rule="evenodd" d="M189.176 236.053V251.789H173.412V251.003H188.388V236.053H189.176Z" fill="#F47920"/>
<path fill-rule="evenodd" clip-rule="evenodd" d="M173.412 236.053V251.789H157.647V251.003H172.624V236.053H173.412Z" fill="#F47920"/>
<path d="M157.647 236.053H141.882V251.789H157.647V236.053Z" fill="#F47920"/>
<path fill-rule="evenodd" clip-rule="evenodd" d="M157.647 236.053V251.789H141.882V251.003H156.859V236.053H157.647Z" fill="#F47920"/>
<path fill-rule="evenodd" clip-rule="evenodd" d="M141.882 236.053V251.789H126.118V251.003H141.094V236.053H141.882Z" fill="#F47920"/>
<path d="M126.118 236.053H110.353V251.789H126.118V236.053Z" fill="#F47920"/>
<path fill-rule="evenodd" clip-rule="evenodd" d="M126.118 236.053V251.789H110.353V251.003H125.329V236.053H126.118Z" fill="#F47920"/>
<path fill-rule="evenodd" clip-rule="evenodd" d="M110.353 236.053V251.789H94.5882V251.003H109.565V236.053H110.353Z" fill="#F47920"/>
<path d="M94.5882 236.053H78.8235V251.789H94.5882V236.053Z" fill="#F47920"/>
<path fill-rule="evenodd" clip-rule="evenodd" d="M94.5882 236.053V251.789H78.8235V251.003H93.8V236.053H94.5882Z" fill="#F47920"/>
<path fill-rule="evenodd" clip-rule="evenodd" d="M78.8235 236.053V251.789H63.0588V251.003H78.0353V236.053H78.8235Z" fill="#F47920"/>
<path fill-rule="evenodd" clip-rule="evenodd" d="M63.0588 236.053V251.789H47.2941V251.003H62.2706V236.053H63.0588Z" fill="#F47920"/>
<path fill-rule="evenodd" clip-rule="evenodd" d="M31.5294 251.789V267.526H15.7647V266.739H30.7412V251.789H31.5294Z" fill="#F47920"/>
<path fill-rule="evenodd" clip-rule="evenodd" d="M47.2941 236.053V251.789H31.5294V251.003H46.5059V236.053H47.2941Z" fill="#F47920"/>
<path fill-rule="evenodd" clip-rule="evenodd" d="M15.7647 236.053V251.789H0V251.003H14.9765V236.053H15.7647Z" fill="#F47920"/>
<path fill-rule="evenodd" clip-rule="evenodd" d="M236.471 251.789V267.526H220.706V266.739H235.682V251.789H236.471Z" fill="#F47920"/>
<path fill-rule="evenodd" clip-rule="evenodd" d="M252.235 251.789V267.526H236.471V266.739H251.447V251.789H252.235Z" fill="#F47920"/>
<path fill-rule="evenodd" clip-rule="evenodd" d="M268 251.789V267.526H252.235V266.739H267.212V251.789H268Z" fill="#F47920"/>
<path fill-rule="evenodd" clip-rule="evenodd" d="M220.706 251.789V267.526H204.941V266.739H219.918V251.789H220.706Z" fill="#F47920"/>
<path fill-rule="evenodd" clip-rule="evenodd" d="M204.941 251.789V267.526H189.176V266.739H204.153V251.789H204.941Z" fill="#F47920"/>
<path fill-rule="evenodd" clip-rule="evenodd" d="M189.176 251.789V267.526H173.412V266.739H188.388V251.789H189.176Z" fill="#F47920"/>
<path d="M173.412 251.789H157.647V267.526H173.412V251.789Z" fill="#F47920"/>
<path fill-rule="evenodd" clip-rule="evenodd" d="M173.412 251.789V267.526H157.647V266.739H172.624V251.789H173.412Z" fill="#F47920"/>
<path fill-rule="evenodd" clip-rule="evenodd" d="M157.647 251.789V267.526H141.882V266.739H156.859V251.789H157.647Z" fill="#F47920"/>
<path d="M141.882 251.789H126.118V267.526H141.882V251.789Z" fill="#F47920"/>
<path fill-rule="evenodd" clip-rule="evenodd" d="M141.882 251.789V267.526H126.118V266.739H141.094V251.789H141.882Z" fill="#F47920"/>
<path fill-rule="evenodd" clip-rule="evenodd" d="M126.118 251.789V267.526H110.353V266.739H125.329V251.789H126.118Z" fill="#F47920"/>
<path d="M110.353 251.789H94.5882V267.526H110.353V251.789Z" fill="#F47920"/>
<path fill-rule="evenodd" clip-rule="evenodd" d="M110.353 251.789V267.526H94.5882V266.739H109.565V251.789H110.353Z" fill="#F47920"/>
<path fill-rule="evenodd" clip-rule="evenodd" d="M94.5882 251.789V267.526H78.8235V266.739H93.8V251.789H94.5882Z" fill="#F47920"/>
<path fill-rule="evenodd" clip-rule="evenodd" d="M78.8235 251.789V267.526H63.0588V266.739H78.0353V251.789H78.8235Z" fill="#F47920"/>
<path fill-rule="evenodd" clip-rule="evenodd" d="M31.5294 267.526V283.263H15.7647V282.476H30.7412V267.526H31.5294Z" fill="#F47920"/>
<path fill-rule="evenodd" clip-rule="evenodd" d="M63.0588 251.789V267.526H47.2941V266.739H62.2706V251.789H63.0588Z" fill="#F47920"/>
<path fill-rule="evenodd" clip-rule="evenodd" d="M47.2941 251.789V267.526H31.5294V266.739H46.5059V251.789H47.2941Z" fill="#F47920"/>
<path fill-rule="evenodd" clip-rule="evenodd" d="M15.7647 251.789V267.526H0V266.739H14.9765V251.789H15.7647Z" fill="#F47920"/>
<path fill-rule="evenodd" clip-rule="evenodd" d="M236.471 267.526V283.263H220.706V282.476H235.682V267.526H236.471Z" fill="#F47920"/>
<path fill-rule="evenodd" clip-rule="evenodd" d="M252.235 267.526V283.263H236.471V282.476H251.447V267.526H252.235Z" fill="#F47920"/>
<path fill-rule="evenodd" clip-rule="evenodd" d="M268 267.526V283.263H252.235V282.476H267.212V267.526H268Z" fill="#F47920"/>
<path fill-rule="evenodd" clip-rule="evenodd" d="M220.706 267.526V283.263H204.941V282.476H219.918V267.526H220.706Z" fill="#F47920"/>
<path fill-rule="evenodd" clip-rule="evenodd" d="M204.941 267.526V283.263H189.176V282.476H204.153V267.526H204.941Z" fill="#F47920"/>
<path fill-rule="evenodd" clip-rule="evenodd" d="M189.176 267.526V283.263H173.412V282.476H188.388V267.526H189.176Z" fill="#F47920"/>
<path fill-rule="evenodd" clip-rule="evenodd" d="M173.412 267.526V283.263H157.647V282.476H172.624V267.526H173.412Z" fill="#F47920"/>
<path d="M157.647 267.526H141.882V283.263H157.647V267.526Z" fill="#F47920"/>
<path fill-rule="evenodd" clip-rule="evenodd" d="M157.647 267.526V283.263H141.882V282.476H156.859V267.526H157.647Z" fill="#F47920"/>
<path fill-rule="evenodd" clip-rule="evenodd" d="M141.882 267.526V283.263H126.118V282.476H141.094V267.526H141.882Z" fill="#F47920"/>
<path d="M126.118 267.526H110.353V283.263H126.118V267.526Z" fill="#F47920"/>
<path fill-rule="evenodd" clip-rule="evenodd" d="M126.118 267.526V283.263H110.353V282.476H125.329V267.526H126.118Z" fill="#F47920"/>
<path fill-rule="evenodd" clip-rule="evenodd" d="M110.353 267.526V283.263H94.5882V282.476H109.565V267.526H110.353Z" fill="#F47920"/>
<path fill-rule="evenodd" clip-rule="evenodd" d="M94.5882 267.526V283.263H78.8235V282.476H93.8V267.526H94.5882Z" fill="#F47920"/>
<path fill-rule="evenodd" clip-rule="evenodd" d="M31.5294 283.263V299H15.7647V298.213H30.7412V283.263H31.5294Z" fill="#F47920"/>
<path fill-rule="evenodd" clip-rule="evenodd" d="M78.8235 267.526V283.263H63.0588V282.476H78.0353V267.526H78.8235Z" fill="#F47920"/>
<path fill-rule="evenodd" clip-rule="evenodd" d="M63.0588 267.526V283.263H47.2941V282.476H62.2706V267.526H63.0588Z" fill="#F47920"/>
<path fill-rule="evenodd" clip-rule="evenodd" d="M47.2941 267.526V283.263H31.5294V282.476H46.5059V267.526H47.2941Z" fill="#F47920"/>
<path fill-rule="evenodd" clip-rule="evenodd" d="M15.7647 267.526V283.263H0V282.476H14.9765V267.526H15.7647Z" fill="#F47920"/>
<path fill-rule="evenodd" clip-rule="evenodd" d="M236.471 283.263V299H220.706V298.213H235.682V283.263H236.471Z" fill="#F47920"/>
<path fill-rule="evenodd" clip-rule="evenodd" d="M252.235 283.263V299H236.471V298.213H251.447V283.263H252.235Z" fill="#F47920"/>
<path fill-rule="evenodd" clip-rule="evenodd" d="M268 283.263V299H252.235V298.213H267.212V283.263H268Z" fill="#F47920"/>
<path fill-rule="evenodd" clip-rule="evenodd" d="M220.706 283.263V299H204.941V298.213H219.918V283.263H220.706Z" fill="#F47920"/>
<path fill-rule="evenodd" clip-rule="evenodd" d="M204.941 283.263V299H189.176V298.213H204.153V283.263H204.941Z" fill="#F47920"/>
<path fill-rule="evenodd" clip-rule="evenodd" d="M189.176 283.263V299H173.412V298.213H188.388V283.263H189.176Z" fill="#F47920"/>
<path fill-rule="evenodd" clip-rule="evenodd" d="M173.412 283.263V299H157.647V298.213H172.624V283.263H173.412Z" fill="#F47920"/>
<path fill-rule="evenodd" clip-rule="evenodd" d="M157.647 283.263V299H141.882V298.213H156.859V283.263H157.647Z" fill="#F47920"/>
<path fill-rule="evenodd" clip-rule="evenodd" d="M141.882 283.263V299H126.118V298.213H141.094V283.263H141.882Z" fill="#F47920"/>
<path fill-rule="evenodd" clip-rule="evenodd" d="M126.118 283.263V299H110.353V298.213H125.329V283.263H126.118Z" fill="#F47920"/>
<path fill-rule="evenodd" clip-rule="evenodd" d="M110.353 283.263V299H94.5882V298.213H109.565V283.263H110.353Z" fill="#F47920"/>
<path fill-rule="evenodd" clip-rule="evenodd" d="M94.5882 283.263V299H78.8235V298.213H93.8V283.263H94.5882Z" fill="#F47920"/>
<path fill-rule="evenodd" clip-rule="evenodd" d="M78.8235 283.263V299H63.0588V298.213H78.0353V283.263H78.8235Z" fill="#F47920"/>
<path fill-rule="evenodd" clip-rule="evenodd" d="M63.0588 283.263V299H47.2941V298.213H62.2706V283.263H63.0588Z" fill="#F47920"/>
<path fill-rule="evenodd" clip-rule="evenodd" d="M47.2941 283.263V299H31.5294V298.213H46.5059V283.263H47.2941Z" fill="#F47920"/>
<path fill-rule="evenodd" clip-rule="evenodd" d="M15.7647 283.263V299H0V298.213H14.9765V283.263H15.7647Z" fill="#F47920"/>
</svg>
