<svg width="114" height="44" viewBox="0 0 114 44" fill="none" xmlns="http://www.w3.org/2000/svg">
<g clip-path="url(#clip0_2105_453)">
<path d="M19.1743 44L0.134521 32.9664V24.0856H6.52595V29.3334L19.1743 36.5994L31.8226 29.3334V24.0856H38.214V32.9664L19.1743 44Z" fill="#F47920"/>
<path d="M0.134521 19.8471V10.9664L19.1743 0L38.214 10.9664V19.8471H31.8226V14.6666L19.1743 7.33332L6.52595 14.6666V19.8471H0.134521Z" fill="#023E88"/>
<path d="M22.1342 21.0587L26.1037 24.9607L22.1343 28.8623L18.2322 24.9606L22.1342 21.0587Z" fill="#023E88"/>
<path d="M16.214 15.0706L20.1162 19.0399L16.2141 22.9416L12.2447 19.04L16.214 15.0706Z" fill="#023E88"/>
</g>
<g clip-path="url(#clip1_2105_453)">
<path d="M46.8381 14.7373L50.6262 14.5C50.7083 15.1152 50.8752 15.584 51.1272 15.9062C51.5374 16.4277 52.1233 16.6885 52.885 16.6885C53.4534 16.6885 53.8899 16.5566 54.1946 16.293C54.5051 16.0234 54.6604 15.7129 54.6604 15.3613C54.6604 15.0273 54.5139 14.7285 54.2209 14.4648C53.928 14.2012 53.2483 13.9521 52.1819 13.7178C50.4358 13.3252 49.1907 12.8037 48.4465 12.1533C47.6965 11.5029 47.3215 10.6738 47.3215 9.66602C47.3215 9.00391 47.512 8.37988 47.8928 7.79395C48.2795 7.20215 48.8567 6.73926 49.6243 6.40527C50.3977 6.06543 51.4553 5.89551 52.7971 5.89551C54.4436 5.89551 55.6975 6.20312 56.5588 6.81836C57.426 7.42773 57.9417 8.40039 58.1057 9.73633L54.3528 9.95605C54.2532 9.37598 54.0422 8.9541 53.72 8.69043C53.4036 8.42676 52.9641 8.29492 52.4016 8.29492C51.9387 8.29492 51.5901 8.39453 51.3557 8.59375C51.1213 8.78711 51.0042 9.02441 51.0042 9.30566C51.0042 9.51074 51.1008 9.69531 51.2942 9.85938C51.4817 10.0293 51.927 10.1875 52.6301 10.334C54.3704 10.709 55.6155 11.0898 56.3655 11.4766C57.1213 11.8574 57.6692 12.332 58.009 12.9004C58.3547 13.4688 58.5276 14.1045 58.5276 14.8076C58.5276 15.6338 58.2991 16.3955 57.842 17.0928C57.385 17.79 56.7463 18.3203 55.926 18.6836C55.1057 19.041 54.0715 19.2197 52.8235 19.2197C50.6321 19.2197 49.1145 18.7979 48.2708 17.9541C47.427 17.1104 46.9495 16.0381 46.8381 14.7373ZM59.635 6.11523H71.7375V9.29688H67.677V19H63.6956V9.29688H59.635V6.11523ZM73.5042 6.11523H78.7424L80.7639 13.9551L82.7766 6.11523H87.9973V19H84.7454V9.17383L82.2229 19H79.2786L76.7649 9.17383V19H73.5042V6.11523ZM90.7043 6.11523H94.6946V19H90.7043V6.11523ZM97.5774 6.11523H101.559V10.9844L105.734 6.11523H111.025L106.331 10.9756L111.236 19H106.331L103.615 13.7002L101.559 15.8535V19H97.5774V6.11523Z" fill="#023E88"/>
<path d="M46.5813 26.5469H57.3391V29.375H53.7297V38H50.1907V29.375H46.5813V26.5469ZM64.9016 36.1094H60.8704L60.3157 38H56.6985L61.0032 26.5469H64.8625L69.1672 38H65.4641L64.9016 36.1094ZM64.1594 33.6328L62.8938 29.5156L61.636 33.6328H64.1594ZM70.0188 26.5469H80.0344V28.8359L73.6125 35.5391H80.2688V38H69.4016V35.625L75.7532 28.9922H70.0188V26.5469ZM81.886 26.5469H85.425V30.875L89.136 26.5469H93.8391L89.6672 30.8672L94.0266 38H89.6672L87.2532 33.2891L85.425 35.2031V38H81.886V26.5469ZM95.3391 26.5469H98.886V38H95.3391V26.5469ZM108.48 36.1094H104.448L103.894 38H100.277L104.581 26.5469H108.441L112.745 38H109.042L108.48 36.1094ZM107.738 33.6328L106.472 29.5156L105.214 33.6328H107.738Z" fill="#023E88"/>
</g>
<defs>
<clipPath id="clip0_2105_453">
<rect width="38.0795" height="44" fill="white" transform="translate(0.134521)"/>
</clipPath>
<clipPath id="clip1_2105_453">
<rect width="67" height="36" fill="white" transform="translate(46.2141 4)"/>
</clipPath>
</defs>
</svg>
