AWSTATS DATA FILE 7.7 (build 20180105)
# If you remove this file, all statistics for date 202002 will be lost/reset.
# Last config file used to build this data file was /home/wy18p168lh8u/tmp/awstats/awstats.proteindistrict.com.conf.

# Position (offset in bytes) in this file for beginning of each section for
# direct I/O access. If you made changes somewhere in this file, you should
# also remove completely the MAP section (AWStats will rewrite it at next
# update).
BEGIN_MAP 28
POS_GENERAL 2020                
POS_TIME 2681                
POS_VISITOR 5719                
POS_DAY 5830                
POS_DOMAIN 3251                
POS_LOGIN 3475                
POS_ROBOT 3630                
POS_WORMS 3762                
POS_EMAILSENDER 3893                
POS_EMAILRECEIVER 4036                
POS_SESSION 5907                
POS_SIDER 6053                
POS_FILETYPES 4171                
POS_DOWNLOADS 4255                
POS_OS 4303                
POS_BROWSER 4378                
POS_SCREENSIZE 4444                
POS_UNKNOWNREFERER 4518                
POS_UNKNOWNREFERERBROWSER 4605                
POS_ORIGIN 4687                
POS_SEREFERRALS 4817                
POS_PAGEREFS 4961                
POS_SEARCHWORDS 5109                
POS_KEYWORDS 5261                
POS_MISC 2345                
POS_ERRORS 5320                
POS_CLUSTER 3331                
POS_SIDER_404 5410                
END_MAP

# LastLine    = Date of last record processed - Last record line number in last log - Last record offset in last log - Last record signature value
# FirstTime   = Date of first visit for history file
# LastTime    = Date of last visit for history file
# LastUpdate  = Date of last update - Nb of parsed records - Nb of parsed old records - Nb of parsed new records - Nb of parsed corrupted - Nb of parsed dropped
# TotalVisits = Number of visits
# TotalUnique = Number of unique visitors
# MonthHostsKnown   = Number of hosts known
# MonthHostsUnKnown = Number of hosts unknown
BEGIN_GENERAL 8
LastLine 20200301024219 5 549 12281062250818
FirstTime 0
LastTime 20200205010429
LastUpdate 20200301050438 5 0 4 0 0
TotalVisits 1                   
TotalUnique 1                   
MonthHostsKnown 0                   
MonthHostsUnknown 1                   
END_GENERAL

# Misc ID - Pages - Hits - Bandwidth
BEGIN_MISC 10
AddToFavourites 0 4 0
JavascriptDisabled 0 0 0
PDFSupport 0 0 0
RealPlayerSupport 0 0 0
DirectorSupport 0 0 0
WindowsMediaPlayerSupport 0 0 0
TotalMisc 0 0 0
QuickTimeSupport 0 0 0
FlashSupport 0 0 0
JavaEnabled 0 0 0
END_MISC

# Hour - Pages - Hits - Bandwidth - Not viewed Pages - Not viewed Hits - Not viewed Bandwidth
BEGIN_TIME 24
0 0 0 0 26 29 6960
1 1 1 33945 5 6 1505
2 0 0 0 10 12 2645
3 0 0 0 5 5 1235
4 0 0 0 6 7 1668
5 0 0 0 15 18 4411
6 0 0 0 4 5 1219
7 0 0 0 13 17 4111
8 0 0 0 13 13 3158
9 0 0 0 16 19 4570
10 0 0 0 12 14 3463
11 0 0 0 4 5 1258
12 0 0 0 16 18 4406
13 0 0 0 4 4 1048
14 0 0 0 6 8 2011
15 0 0 0 2 2 472
16 0 0 0 11 15 3640
17 0 0 0 3 3 713
18 0 0 0 4 5 1198
19 0 0 0 10 12 2910
20 0 0 0 4 7 1683
21 0 0 0 5 7 1730
22 0 0 0 5 5 1197
23 0 0 0 2 2 472
END_TIME

# Domain - Pages - Hits - Bandwidth
# The 25 first Pages must be first (order not required for others)
BEGIN_DOMAIN 1
ps 1 1 33945
END_DOMAIN

# Cluster ID - Pages - Hits - Bandwidth
BEGIN_CLUSTER 0
END_CLUSTER

# Login - Pages - Hits - Bandwidth - Last visit
# The 10 first Pages must be first (order not required for others)
BEGIN_LOGIN 0
END_LOGIN

# Robot ID - Hits - Bandwidth - Last visit - Hits on robots.txt
# The 25 first Hits must be first (order not required for others)
BEGIN_ROBOT 0
END_ROBOT

# Worm ID - Hits - Bandwidth - Last visit
# The 5 first Hits must be first (order not required for others)
BEGIN_WORMS 0
END_WORMS

# EMail - Hits - Bandwidth - Last visit
# The 20 first Hits must be first (order not required for others)
BEGIN_EMAILSENDER 0
END_EMAILSENDER

# EMail - Hits - Bandwidth - Last visit
# The 20 first hits must be first (order not required for others)
BEGIN_EMAILRECEIVER 0
END_EMAILRECEIVER

# Files type - Hits - Bandwidth - Bandwidth without compression - Bandwidth after compression
BEGIN_FILETYPES 1
Unknown 1 33945 0 0
END_FILETYPES

# Downloads - Hits - Bandwidth
BEGIN_DOWNLOADS 0
END_DOWNLOADS

# OS ID - Hits
BEGIN_OS ID - Hits - Pages 1
win10 1 1
END_OS

# Browser ID - Hits - Pages
BEGIN_BROWSER 1
firefox72.0 1 1
END_BROWSER

# Screen size - Hits
BEGIN_SCREENSIZE 0
END_SCREENSIZE

# Unknown referer OS - Last visit date
BEGIN_UNKNOWNREFERER 0
END_UNKNOWNREFERER

# Unknown referer Browser - Last visit date
BEGIN_UNKNOWNREFERERBROWSER 0
END_UNKNOWNREFERERBROWSER

# Origin - Pages - Hits 
BEGIN_ORIGIN 6
From0 1 1
From1 0 0
From2 0 0
From3 0 0
From4 0 0
From5 0 0
END_ORIGIN

# Search engine referers ID - Pages - Hits
BEGIN_SEREFERRALS 0
END_SEREFERRALS

# External page referers - Pages - Hits
# The 25 first Pages must be first (order not required for others)
BEGIN_PAGEREFS 0
END_PAGEREFS

# Search keyphrases - Number of search
# The 10 first number of search must be first (order not required for others)
BEGIN_SEARCHWORDS 0
END_SEARCHWORDS

# Search keywords - Number of search
# The 25 first number of search must be first (order not required for others)
BEGIN_KEYWORDS 0
END_KEYWORDS

# Errors - Hits - Bandwidth
BEGIN_ERRORS 1
301 234 56695
END_ERRORS

# URL with 404 errors - Hits - Last URL referrer
BEGIN_SIDER_404 0
END_SIDER_404

# Host - Pages - Hits - Bandwidth - Last visit date - [Start date of last visit] - [Last page of last visit]
# [Start date of last visit] and [Last page of last visit] are saved only if session is not finished
# The 25 first Hits must be first (order not required for others)
BEGIN_VISITOR 1
213.244.81.36 1 1 33945 20200205010429
END_VISITOR

# Date - Pages - Hits - Bandwidth - Visits
BEGIN_DAY 1
20200205 1 1 33945 1
END_DAY

# Session range - Number of visits
BEGIN_SESSION 1
0s-30s 1
END_SESSION

# URL - Pages - Bandwidth - Entry - Exit
# The 25 first Pages must be first (order not required for others)
BEGIN_SIDER 1
/cpanel 1 33945 1 1
END_SIDER
