AWSTATS DATA FILE 7.7 (build 20180105)
# If you remove this file, all statistics for date 202003 will be lost/reset.
# Last config file used to build this data file was /home/wy18p168lh8u/tmp/awstats/awstats.proteindistrict.com.conf.

# Position (offset in bytes) in this file for beginning of each section for
# direct I/O access. If you made changes somewhere in this file, you should
# also remove completely the MAP section (AWStats will rewrite it at next
# update).
BEGIN_MAP 28
POS_GENERAL 2020                
POS_TIME 2681                
POS_VISITOR 5979                
POS_DAY 6469                
POS_DOMAIN 3302                
POS_LOGIN 3563                
POS_ROBOT 3718                
POS_WORMS 3850                
POS_EMAILSENDER 3981                
POS_EMAILRECEIVER 4124                
POS_SESSION 6611                
POS_SIDER 6768                
POS_FILETYPES 4259                
POS_DOWNLOADS 4344                
POS_OS 4392                
POS_BROWSER 4488                
POS_SCREENSIZE 4598                
POS_UNKNOWNREFERER 4672                
POS_UNKNOWNREFERERBROWSER 4862                
POS_ORIGIN 4944                
POS_SEREFERRALS 5076                
POS_PAGEREFS 5220                
POS_SEARCHWORDS 5368                
POS_KEYWORDS 5520                
POS_MISC 2345                
POS_ERRORS 5579                
POS_CLUSTER 3419                
POS_SIDER_404 5670                
END_MAP

# LastLine    = Date of last record processed - Last record line number in last log - Last record offset in last log - Last record signature value
# FirstTime   = Date of first visit for history file
# LastTime    = Date of last visit for history file
# LastUpdate  = Date of last update - Nb of parsed records - Nb of parsed old records - Nb of parsed new records - Nb of parsed corrupted - Nb of parsed dropped
# TotalVisits = Number of visits
# TotalUnique = Number of unique visitors
# MonthHostsKnown   = Number of hosts known
# MonthHostsUnKnown = Number of hosts unknown
BEGIN_GENERAL 8
LastLine 20200401011750 8 1600 8144962859726
FirstTime 0
LastTime 20200329055711
LastUpdate 20200401051154 8 0 7 0 0
TotalVisits 11                  
TotalUnique 11                  
MonthHostsKnown 0                   
MonthHostsUnknown 11                  
END_GENERAL

# Misc ID - Pages - Hits - Bandwidth
BEGIN_MISC 10
RealPlayerSupport 0 0 0
FlashSupport 0 0 0
TotalMisc 0 0 0
QuickTimeSupport 0 0 0
WindowsMediaPlayerSupport 0 0 0
JavascriptDisabled 0 0 0
DirectorSupport 0 0 0
PDFSupport 0 0 0
JavaEnabled 0 0 0
AddToFavourites 0 5 0
END_MISC

# Hour - Pages - Hits - Bandwidth - Not viewed Pages - Not viewed Hits - Not viewed Bandwidth
BEGIN_TIME 24
0 0 0 0 34 35 8636
1 0 0 0 12 14 3416
2 0 0 0 40 48 13046
3 0 0 0 13 13 3092
4 0 0 0 15 16 3801
5 12 12 13681 19 23 5294
6 0 0 0 22 23 5224
7 0 0 0 16 18 4293
8 0 0 0 16 19 4569
9 1 1 12505 14 21 5084
10 0 0 0 10 11 2730
11 0 0 0 25 32 8558
12 1 1 12505 48 52 14935
13 0 0 0 68 75 19523
14 0 0 0 85 91 26168
15 0 0 0 61 63 16348
16 0 0 0 118 125 36509
17 0 0 0 31 31 9311
18 0 0 0 2 14 3847
19 0 0 0 10 11 2611
20 0 0 0 15 17 4170
21 0 0 0 17 20 5082
22 0 0 0 7 10 2415
23 1 1 12505 35 38 9397
END_TIME

# Domain - Pages - Hits - Bandwidth
# The 25 first Pages must be first (order not required for others)
BEGIN_DOMAIN 4
us 9 9 963
ae 3 3 12718
ps 2 2 25010
cz 1 1 12505
END_DOMAIN

# Cluster ID - Pages - Hits - Bandwidth
BEGIN_CLUSTER 0
END_CLUSTER

# Login - Pages - Hits - Bandwidth - Last visit
# The 10 first Pages must be first (order not required for others)
BEGIN_LOGIN 0
END_LOGIN

# Robot ID - Hits - Bandwidth - Last visit - Hits on robots.txt
# The 25 first Hits must be first (order not required for others)
BEGIN_ROBOT 0
END_ROBOT

# Worm ID - Hits - Bandwidth - Last visit
# The 5 first Hits must be first (order not required for others)
BEGIN_WORMS 0
END_WORMS

# EMail - Hits - Bandwidth - Last visit
# The 20 first Hits must be first (order not required for others)
BEGIN_EMAILSENDER 0
END_EMAILSENDER

# EMail - Hits - Bandwidth - Last visit
# The 20 first hits must be first (order not required for others)
BEGIN_EMAILRECEIVER 0
END_EMAILRECEIVER

# Files type - Hits - Bandwidth - Bandwidth without compression - Bandwidth after compression
BEGIN_FILETYPES 1
Unknown 15 51196 0 0
END_FILETYPES

# Downloads - Hits - Bandwidth
BEGIN_DOWNLOADS 0
END_DOWNLOADS

# OS ID - Hits
BEGIN_OS ID - Hits - Pages 3
win10 6 6
Unknown 8 8
win7 1 1
END_OS

# Browser ID - Hits - Pages
BEGIN_BROWSER 4
firefox73.0 3 3
firefox33.0 1 1
mozilla 8 8
firefox74.0 3 3
END_BROWSER

# Screen size - Hits
BEGIN_SCREENSIZE 0
END_SCREENSIZE

# Unknown referer OS - Last visit date
BEGIN_UNKNOWNREFERER 1
Mozilla/5.0_(compatible;_Let's_Encrypt_validation_server;__https://www.letsencrypt.org) 20200329055711
END_UNKNOWNREFERER

# Unknown referer Browser - Last visit date
BEGIN_UNKNOWNREFERERBROWSER 0
END_UNKNOWNREFERERBROWSER

# Origin - Pages - Hits 
BEGIN_ORIGIN 6
From0 14 14
From1 1 1
From2 0 0
From3 0 0
From4 0 0
From5 0 0
END_ORIGIN

# Search engine referers ID - Pages - Hits
BEGIN_SEREFERRALS 0
END_SEREFERRALS

# External page referers - Pages - Hits
# The 25 first Pages must be first (order not required for others)
BEGIN_PAGEREFS 0
END_PAGEREFS

# Search keyphrases - Number of search
# The 10 first number of search must be first (order not required for others)
BEGIN_SEARCHWORDS 0
END_SEARCHWORDS

# Search keywords - Number of search
# The 25 first number of search must be first (order not required for others)
BEGIN_KEYWORDS 0
END_KEYWORDS

# Errors - Hits - Bandwidth
BEGIN_ERRORS 1
301 815 216820
END_ERRORS

# URL with 404 errors - Hits - Last URL referrer
BEGIN_SIDER_404 0
END_SIDER_404

# Host - Pages - Hits - Bandwidth - Last visit date - [Start date of last visit] - [Last page of last visit]
# [Start date of last visit] and [Last page of last visit] are saved only if session is not finished
# The 25 first Hits must be first (order not required for others)
BEGIN_VISITOR 11
94.204.149.232 3 3 12718 20200329055652
52.28.236.88 2 2 214 20200329055711
66.133.109.36 2 2 214 20200329055711
89.239.42.101 1 1 12505 20200310093930
34.222.229.130 1 1 107 20200329055700
52.15.254.228 1 1 107 20200329055711
213.244.81.36 1 1 12505 20200304231146
3.14.255.131 1 1 107 20200329055700
82.205.7.178 1 1 12505 20200308123251
138.197.202.197 1 1 107 20200329055654
34.209.232.166 1 1 107 20200329055711
END_VISITOR

# Date - Pages - Hits - Bandwidth - Visits
BEGIN_DAY 4
20200304 1 1 12505 1
20200308 1 1 12505 1
20200310 1 1 12505 1
20200329 12 12 13681 8
END_DAY

# Session range - Number of visits
BEGIN_SESSION 2
0s-30s 10
2mn-5mn 1
END_SESSION

# URL - Pages - Bandwidth - Entry - Exit
# The 25 first Pages must be first (order not required for others)
BEGIN_SIDER 3
/.well-known/acme-challenge/N0bP318qBPUuGt6OYTpTuynuMcTaL4debRkXJe-3dG4 6 642 3 6
/.well-known/acme-challenge/hdoUqUHyemNxTaS7UHFjxg4MQ0Dxt8kmJsxPbB5hmnA 5 535 4 2
/cpanel 4 50019 4 3
END_SIDER
