AWSTATS DATA FILE 7.7 (build 20180105)
# If you remove this file, all statistics for date 202012 will be lost/reset.
# Last config file used to build this data file was /home/wy18p168lh8u/tmp/awstats/ssl/awstats.proteindistrict.com.conf.

# Position (offset in bytes) in this file for beginning of each section for
# direct I/O access. If you made changes somewhere in this file, you should
# also remove completely the MAP section (AWStats will rewrite it at next
# update).
BEGIN_MAP 28
POS_GENERAL 2024                
POS_TIME 2708                
POS_VISITOR 18174               
POS_DAY 27250               
POS_DOMAIN 3656                
POS_LOGIN 4331                
POS_ROBOT 4486                
POS_WORMS 5613                
POS_EMAILSENDER 5744                
POS_EMAILRECEIVER 5887                
POS_SESSION 28098               
POS_SIDER 28308               
POS_FILETYPES 6022                
POS_DOWNLOADS 6265                
POS_OS 6313                
POS_BROWSER 6637                
POS_SCREENSIZE 8379                
POS_UNKNOWNREFERER 8453                
POS_UNKNOWNREFERERBROWSER 9027                
POS_ORIGIN 9397                
POS_SEREFERRALS 9540                
POS_PAGEREFS 9941                
POS_SEARCHWORDS 10205               
POS_KEYWORDS 10357               
POS_MISC 2371                
POS_ERRORS 10416               
POS_CLUSTER 4187                
POS_SIDER_404 10575               
END_MAP

# LastLine    = Date of last record processed - Last record line number in last log - Last record offset in last log - Last record signature value
# FirstTime   = Date of first visit for history file
# LastTime    = Date of last visit for history file
# LastUpdate  = Date of last update - Nb of parsed records - Nb of parsed old records - Nb of parsed new records - Nb of parsed corrupted - Nb of parsed dropped
# TotalVisits = Number of visits
# TotalUnique = Number of unique visitors
# MonthHostsKnown   = Number of hosts known
# MonthHostsUnKnown = Number of hosts unknown
BEGIN_GENERAL 8
LastLine 20210101000109 613 144663 10877943613021
FirstTime 20201201000312
LastTime 20201231223757
LastUpdate 20210101051646 613 0 612 0 0
TotalVisits 267                 
TotalUnique 221                 
MonthHostsKnown 0                   
MonthHostsUnknown 230                 
END_GENERAL

# Misc ID - Pages - Hits - Bandwidth
BEGIN_MISC 10
FlashSupport 0 0 0
AddToFavourites 0 21 0
JavascriptDisabled 0 0 0
WindowsMediaPlayerSupport 0 0 0
JavaEnabled 0 0 0
DirectorSupport 0 0 0
TotalMisc 0 0 0
QuickTimeSupport 0 0 0
PDFSupport 0 0 0
RealPlayerSupport 0 0 0
END_MISC

# Hour - Pages - Hits - Bandwidth - Not viewed Pages - Not viewed Hits - Not viewed Bandwidth
BEGIN_TIME 24
0 100 275 7101425 346 409 5293287
1 168 218 4412079 226 274 3175161
2 27 114 5345189 235 342 4213457
3 116 264 6197272 282 450 7361142
4 63 102 1296576 210 366 11747997
5 23 180 5133657 202 272 2946599
6 119 378 12474662 170 246 2780825
7 139 470 18499330 247 386 6385335
8 127 204 3170609 222 358 15868695
9 78 150 1360675 267 335 3992586
10 39 159 10344803 277 378 5956822
11 83 261 19818428 234 318 3545999
12 53 169 6156669 299 422 8898742
13 105 287 27535967 191 392 9023801
14 71 130 3015953 231 284 3943075
15 16 107 6363530 217 264 3327921
16 17 121 10240440 624 788 14529819
17 28 123 4702283 1170 1391 23351192
18 6 26 362926 155 211 2830783
19 10 94 3155155 184 267 2951275
20 75 95 1272661 167 263 12917080
21 24 91 3708347 144 207 2885172
22 71 104 4674838 220 322 14516757
23 48 92 1577383 199 301 12681454
END_TIME

# Domain - Pages - Hits - Bandwidth
# The 25 first Pages must be first (order not required for others)
BEGIN_DOMAIN 29
ae 463 1205 36632379
pk 433 489 5112652
us 258 531 18663659
sa 129 824 58787148
ru 109 130 1613489
om 59 219 14719740
se 31 31 428358
gb 24 98 4169474
ps 21 21 128886
de 21 55 1329772
kw 15 275 13721161
ca 14 36 613228
cn 8 41 966388
fr 5 25 765382
ph 2 50 1621906
fi 2 26 955843
id 2 2 10609
ch 1 22 907082
qa 1 21 906721
gr 1 1 9213
iq 1 21 906723
ua 1 1 9210
in 1 20 862664
no 1 21 316872
be 1 22 929397
hr 0 1 128421
pl 1 1 67259
jo 0 1 17003
eg 1 24 2620218
END_DOMAIN

# Cluster ID - Pages - Hits - Bandwidth
BEGIN_CLUSTER 0
END_CLUSTER

# Login - Pages - Hits - Bandwidth - Last visit
# The 10 first Pages must be first (order not required for others)
BEGIN_LOGIN 0
END_LOGIN

# Robot ID - Hits - Bandwidth - Last visit - Hits on robots.txt
# The 25 first Hits must be first (order not required for others)
BEGIN_ROBOT 24
AhrefsBot/ 1615 24593527 20201231235703 59
bot[\s_+:,\.\;\/\\-] 1191 19354320 20201231235533 199
YandexBot/ 1178 19749027 20201230112728 14
CFNetwork 630 10333142 20201231105040 0
SemrushBot/ 429 4125046 20201222031024 154
bingbot/ 415 7241639 20201231214717 82
SeznamBot/ 369 2761447 20201231233209 168
Dalvik/ 312 57621855 20201231072807 0
Googlebot/ 251 2543834 20201231223939 34
YandexImages/ 228 11642744 20201230000459 0
baidu 101 4643764 20201216131719 0
crawl 100 1666496 20201221000058 0
bingpreview 87 2604191 20201229223507 0
spider 57 1721365 20201218105635 7
Apache\-HttpClient/ 40 368420 20201209143901 0
Applebot/ 30 608786 20201231195615 7
Googlebot\-Image/ 20 701735 20201231223940 0
unknown 13 312 20201231192453 13
Baiduspider/ 8 1063701 20201230070108 0
DuckDuckGo\-Favicons\-Bot/ 6 55271 20201231223427 0
no_user_agent 3 67487 20201223205639 0
curl 2 9210 20201226174325 0
[\s_+:,\.\;\/\\-]bot 1 9214 20201201071616 0
(firefox/)([0-9]\.|[0-1][0]\.) 1 9208 20201220190005 0
END_ROBOT

# Worm ID - Hits - Bandwidth - Last visit
# The 5 first Hits must be first (order not required for others)
BEGIN_WORMS 0
END_WORMS

# EMail - Hits - Bandwidth - Last visit
# The 20 first Hits must be first (order not required for others)
BEGIN_EMAILSENDER 0
END_EMAILSENDER

# EMail - Hits - Bandwidth - Last visit
# The 20 first hits must be first (order not required for others)
BEGIN_EMAILRECEIVER 0
END_EMAILRECEIVER

# Files type - Hits - Bandwidth - Bandwidth without compression - Bandwidth after compression
BEGIN_FILETYPES 9
svg 1118 699209 0 0
js 187 16781341 0 0
php 1 9231 0 0
Unknown 1366 11254821 0 0
css 164 1360985 0 0
xsd 5 675 0 0
jpeg 519 54610873 0 0
html 234 4239208 0 0
png 620 78964514 0 0
END_FILETYPES

# Downloads - Hits - Bandwidth
BEGIN_DOWNLOADS 0
END_DOWNLOADS

# OS ID - Hits
BEGIN_OS ID - Hits - Pages 19
linuxandroid 581 100
win7 94 52
macosx9 1 1
macosx7 2 2
Unknown 778 778
macosx12 1 1
win8.1 1 1
macosx5 1 1
linux 38 36
winlong 21 21
macosx8 1 1
ios_iphone 1229 150
macosx 160 23
macosx11 1 1
ios_ipad 45 3
win8 29 29
macosx10 3 3
win10 1202 377
winxp 26 26
END_OS

# Browser ID - Hits - Pages
BEGIN_BROWSER 83
chrome67.0.3396.87 1 1
firefox80.0 1 1
chrome26.0.1410.65 1 1
safari13.0.4 21 1
chrome80.0.3987.99 89 10
chrome80.0.3987.132 20 1
safari13.1 44 3
chrome35.0.1916.47 1 1
chrome83.0.4103.14 1 1
safari11.0 20 1
chrome41.0.2227.1 12 12
chrome41.0.2228.0 24 24
safari14.0.1 821 125
chrome86.0.4240.198 41 3
msie7.0 1 1
chrome74.0.3694.0 22 1
chrome40.0.2214.85 8 8
chrome41.0.2224.3 21 21
chrome86.0.4240.75 37 4
chrome68.0.3440.106 2 2
safari4.0.4 1 1
chrome72.0.3626.119 1 1
safari 139 10
edge12 1 0
chrome75.0.3729.169 27 27
firefox33.0 1 1
chrome41.0.2226.0 12 12
safari14.0 112 6
chrome83.0.4100.3 1 1
chrome87.0.4280.66 32 4
netscape 2 2
chrome17.0.963.66 3 3
firefox52.0 6 6
chrome78.0.3904.87 19 1
firefox81.0 1 1
firefox48.0 1 1
chrome73.0.3683.103 20 1
mozilla 17 17
chrome84.0.4147.135 20 1
msie6.0 3 3
chrome65.0.3325.181 1 1
chrome83.0.4103.106 273 73
chrome34.0.1847.137 1 1
netscape5.0 3 3
chrome63.0.3239.26 68 43
chrome81.0.4044.138 10 8
chrome87.0.4280.67 19 0
safari1.3.2 1 1
safari14.0.2 41 2
opera72.0.3815.400 22 1
msie11.0 42 3
chrome88.0.4240.193 10 10
chrome79.0.3945.88 1 1
firefox57.0 2 2
chrome83.0.4099.2 1 1
chrome80.0.3987.149 4 4
firefox83.0 3 2
safari13.0.3 21 1
chrome41.0.2227.0 4 4
chrome83.0.4103.97 16 6
chrome39.0.2171.95 2 2
chrome84.0.4147.105 2 2
chrome41.0.2225.0 29 29
chrome87.0.4280.101 183 10
msie9.0 3 0
opera12.0 1 1
chrome66.0.3359.181 61 61
chrome51.0.2704.103 7 7
chrome87.0.4280.88 879 215
safari12.1.2 22 1
firefox28.0 6 6
chrome83.0.4089.0 1 1
firefox55.0 1 1
safari13.1.2 87 5
firefox15.0.1 1 1
Unknown 759 759
iphone 1 0
chrome73.0.3683.90 1 1
firefox62.0 1 1
firefox72.0 14 12
msie10.6 1 1
chrome37.0.2062.124 1 1
chrome80.0.3987.122 1 1
END_BROWSER

# Screen size - Hits
BEGIN_SCREENSIZE 0
END_SCREENSIZE

# Unknown referer OS - Last visit date
BEGIN_UNKNOWNREFERER 11
python-requests/2.25.1 20201227071512
python-requests/2.25.0 20201228133400
Mozilla/5.0_(compatible;_NetcraftSurveyAgent/1.0;__info@netcraft.com) 20201206221124
Go-http-client/1.1 20201231192454
Go_http_package 20201220214709
Mozilla/5.0_(compatible;_Panscient/1.0;__http://panscient.com/faq.htm) 20201204204138
Embarcadero_URI_Client/1.0 20201217083745
okhttp/3.12.0 20201231073135
python-requests/2.24.0 20201214092604
WhatsApp/2.20.206.24_A 20201217150505
Mozilla/5.0 20201231143816
END_UNKNOWNREFERER

# Unknown referer Browser - Last visit date
BEGIN_UNKNOWNREFERERBROWSER 8
python-requests/2.25.0 20201228133400
Embarcadero_URI_Client/1.0 20201217083745
python-requests/2.25.1 20201227071512
Go_http_package 20201220214709
WhatsApp/2.20.206.24_A 20201217150505
Go-http-client/1.1 20201231192454
python-requests/2.24.0 20201214092604
okhttp/3.12.0 20201231073135
END_UNKNOWNREFERERBROWSER

# Origin - Pages - Hits 
BEGIN_ORIGIN 6
From0 1007 1011
From1 1 1
From2 73 89
From3 2 4
From4 523 3109
From5 0 0
END_ORIGIN

# Search engine referers ID - Pages - Hits
BEGIN_SEREFERRALS 14
www_google_ae 3 4
www_google_com_au 1 1
www_google_ch 1 1
google_com 0 1
bing 1 1
www_google_com_sa 2 2
yahoo_catchall 1 1
duckduckgo 2 2
www_google_no 1 1
www_google_ca 1 1
www_google_co_uk 2 2
www_google_jo 0 1
www_google_com 57 70
www_google_com_hk 1 1
END_SEREFERRALS

# External page referers - Pages - Hits
# The 25 first Pages must be first (order not required for others)
BEGIN_PAGEREFS 3
http://160.153.133.150:80 1 1
http://tblsv.chedishu.com/blog/78175833/view/ 1 1
http://mobile-webview.gmail.com 0 2
END_PAGEREFS

# Search keyphrases - Number of search
# The 10 first number of search must be first (order not required for others)
BEGIN_SEARCHWORDS 0
END_SEARCHWORDS

# Search keywords - Number of search
# The 25 first number of search must be first (order not required for others)
BEGIN_KEYWORDS 0
END_KEYWORDS

# Errors - Hits - Bandwidth
BEGIN_ERRORS 6
302 1054 227943
404 591 11099597
500 50 157519
403 1 67259
301 302 76595
421 1 322
END_ERRORS

# URL with 404 errors - Hits - Last URL referrer
BEGIN_SIDER_404 200
/admin/includes/general.js 3 -
/phpunit/phpunit/Util/PHP/eval-stdin.php 1 -
/sites/.env 5 -
//sito/wp-includes/wlwmanifest.xml 5 -
//vendor/phpunit/phpunit/src/Util/PHP/eval-stdin.php 9 -
/product/789/review 2 -
//wp-includes/wlwmanifest.xml 5 -
/wordpress/wp-admin/install.php 2 -
/wp-content/plugins/background-image-cropper/ups.php.suspected 1 http://google.com
/.git/config 2 http://mail.proteindistrict.com/.git/config
/themes/default/assets/images/arrow-down.svg 27 -
/2019 1 -
//2020/wp-includes/wlwmanifest.xml 4 -
/sitemap.xml 3 -
/product/349/review 2 -
/wp-content 1 -
/api/vendor/phpunit/phpunit/src/Util/PHP/eval-stdin.php 1 -
//2018/wp-includes/wlwmanifest.xml 1 -
/wp-content/plugins/background-image-cropper/simple.php5 1 http://google.com
/admin/vendor/phpunit/phpunit/src/Util/PHP/eval-stdin.php 1 -
//blog/wp-includes/wlwmanifest.xml 6 -
/product/207/review 1 -
/product/257/review 2 -
/vendor/.env 5 -
/product/203/review 2 -
/doc.php 1 http://google.com
/product/475/review 2 -
//wp2/wp-includes/wlwmanifest.xml 5 -
/wp-admin/install.php 3 -
/product/1082/review 1 -
/phpunit/phpunit/src/Util/PHP/eval-stdin.php 1 -
/wordpress/wp-admin/setup-config.php 2 -
/product/811/review 1 -
/wp-admin/links.php 1 http://google.com
/wp-admin/admin-ajax.php 2 -
/old 1 -
/google-site-verification-content-fpk8ez12pdbewljjo9xhbxlv7lhxa9nplpcode87.php 1 http://google.com
//wp-content/plugins/wp-file-manager/lib/php/connector.minimal.php 1 -
/wp/wp-admin/setup-config.php 2 -
/wp-content/uploads/404.php 1 http://google.com
/images/logo.svg 40 -
/apple-touch-icon.png 4 -
/cache/medium/product/1226/pa5lVCTXvRMefnuTSxsXs3UEJrk781NZLv8DpAXd.jpeg 1 -
/product/384/review 2 -
/contact 1 -
/site/wp-admin/setup-config.php 2 -
/laravel/vendor/phpunit/phpunit/src/Util/PHP/eval-stdin.php 1 -
/wp-content/plugins/jekyll-exporter/vendor/phpunit/phpunit/src/Util/PHP/eval-stdin.php 1 -
/product/772/review 1 -
/product/621/review 1 -
/product/1305/review 1 -
/wp-content/themes/distance-lite/languages/namespaces.php 1 http://google.com
/administrator/help/en-GB/toc.json 3 -
/wp-content/plugins/background-image-cropper/content-post.php.suspected 2 http://google.com
/oldsite 1 -
/wp-admin/setup-config.php 2 -
/asset-manifest.json 1 https://proteindistrict.com/
/mini.php 1 http://google.com
/product/734/review 1 -
/fckeditor/editor/filemanager/connectors/php/upload.php 3 -
/product/463/review 2 -
/apple-touch-icon-120x120.png 3 -
/blog/.env 5 -
/product/1354/review 1 -
/product/1235/review 2 -
/product/845/review 1 -
/user/login 1 -
/wp-content/themes/wp-update.php 1 www.google.com
//.env 20 -
/wp-content/plugins/superstorefinder-wp/ssf-wp-admin/pages/import.php 1 -
/js/header-rollup-554.js 3 -
/product/448/review 1 -
/__media__/js/netsoltrademark.php 1 -
/vendor/phpunit/phpunit/build.xml 3 -
//wp-content/plugins/superlogoshowcase-wp/sls-wp-admin/pages/import.php 1 -
/product/881/review 1 -
/plugins/system/debug/debug.xml 3 -
/dev 1 -
/product/265/review 1 -
/wp-includes/css/css.php 2 -
/wp-content/plugins/redirection/models/wp-contentt.php 1 http://google.com
/vendor/phpunit/phpunit/LICENSE 1 -
/wp-content/plugins/mm-plugin/inc/vendor/phpunit/phpunit/src/Util/PHP/eval-stdin.php 1 -
/wp-content/plugins/super-interactive-maps/sim-wp-admin/pages/import.php 1 -
/gank.php.PhP 1 http://google.com
/wp-includes/js/jquery/jquery.js 3 -
/product/477/review 2 -
/product/1368/review 1 -
/img.php 1 http://google.com
/administrator/language/en-GB/install.xml 3 -
/wp-includes/widgets/class-wp-widget-header.php 1 http://google.com
/product/406/review 2 -
/wp-content/plugins/ultimate-member/readme.txt 1 -
/product/1373/review 1 -
/product/770/review 2 -
/product/610/review 2 -
/xmlrpc.php 1 -
/laravel/.env 5 -
/wp-content/themes/CP20/content-post.php 1 http://google.com
/product/1237/review 2 -
/product/211/review 1 -
/product/614/review 2 -
//website/wp-includes/wlwmanifest.xml 5 -
//wordpress/wp-includes/wlwmanifest.xml 5 -
/2018 1 -
/config.bak.php 3 -
/system/.env 1 -
//site/wp-includes/wlwmanifest.xml 5 -
/product/1246/review 1 -
//wp-content/plugins/super-interactive-maps/sim-wp-admin/pages/import.php 1 -
/wordpress 1 -
/api/.env 5 -
/apple-touch-icon-120x120-precomposed.png 3 -
/test/vendor/phpunit/phpunit/src/Util/PHP/eval-stdin.php 1 -
/wp-admin/code87/5.php 1 http://google.com
/Chitoge.php 1 -
/product/209/review 2 -
/vendor/phpunit/phpunit/Util/PHP/eval-stdin.php 1 -
/test/wp-admin/setup-config.php 2 -
/product/343/review 2 -
/test/.env 5 -
//wp/wp-includes/wlwmanifest.xml 5 -
/product/305/review 1 -
/product/1280/review 1 -
/product/365/review 1 -
/checkout/cart/add/886 1 -
/wp-content/plugins/background-image-cropper/ups.php 1 http://google.com
/panel/vendor/phpunit/phpunit/src/Util/PHP/eval-stdin.php 1 -
/blog/wp-admin/setup-config.php 2 -
/vendor/phpunit/Util/PHP/eval-stdin.php 1 -
/.env 35 -
/lib/phpunit/phpunit/Util/PHP/eval-stdin.php 1 -
/product/678/review 2 -
/product/1300/review 1 -
/images/editor/separator.gif 3 -
/product/629/review 1 -
/wp-content/plugins/ubh/up.php 1 http://site.ru
/ads.txt 11 http://proteindistrict.com/ads.txt
/products/nutristrenght 4 -
/vendor/phpunit/src/Util/PHP/eval-stdin.php 1 -
/lib/phpunit/phpunit/src/Util/PHP/eval-stdin.php 1 -
/admin/view/javascript/common.js 3 -
/new 1 -
/phpunit/src/Util/PHP/eval-stdin.php 1 -
/product/1002/review 1 -
//xmlrpc.php 6 -
/lib/phpunit/Util/PHP/eval-stdin.php 1 -
/o.php 1 http://google.com
//wp-content/plugins/superstorefinder-wp/ssf-wp-admin/pages/import.php 1 -
/wp-content/plugins/easy-wp-smtp 3 -
/product/311/review 1 -
/wp-login.php 22 http://proteindistrict.com/wp-login.php
/product/556/review 1 -
//shop/wp-includes/wlwmanifest.xml 5 -
/backup 1 -
/vendor/phpunit/phpunit/src/Util/PHP/kill.php 1 -
//media/wp-includes/wlwmanifest.xml 1 -
/product/387/review 1 -
/wp-content/wp-muen.php 1 http://google.com
//wp1/wp-includes/wlwmanifest.xml 5 -
/shop/.env 1 -
/phpunit/Util/PHP/eval-stdin.php 1 -
//cms/wp-includes/wlwmanifest.xml 5 -
/administrator/index.php 1 -
/administrator 3 -
/public/.env 1 -
/products/- 1 -
/wp-includes/fonts/css.php 2 -
/admin/.env 5 -
//web/wp-includes/wlwmanifest.xml 5 -
/docindex.php 2 http://google.com
/emergency.php 1 www.google.com
/vendor/phpunit/phpunit/phpunit.xml 1 -
/sites/all/libraries/mailchimp/vendor/phpunit/phpunit/src/Util/PHP/eval-stdin.php 2 -
/wp-content/plugins/wp-file-manager/lib/php/connector.minimal.php 1 -
/humans.txt 4 http://proteindistrict.com/humans.txt
/vendor/phpunit/phpunit/src/Util/PHP/eval-stdin.php 9 -
/product/729/review 1 -
/wp 1 -
/product/1315/review 1 -
/lib/phpunit/src/Util/PHP/eval-stdin.php 1 -
/wp-content/plugins/background-image-cropper/content-post.php 3 http://google.com
/wp-content/wp-info.php 2 http://google.com
/wp-content/plugins/superlogoshowcase-wp/sls-wp-admin/pages/import.php 1 -
/misc/ajax.js 3 -
/old/vendor/phpunit/phpunit/src/Util/PHP/eval-stdin.php 1 -
/product/299/review 1 -
/product/711/review 1 -
//test/wp-includes/wlwmanifest.xml 5 -
/apple-touch-icon-precomposed.png 4 -
//2019/wp-includes/wlwmanifest.xml 5 -
/app-ads.txt 44 -
/wp-admin/includes/images.php 2 http://google.com
/product/1233/review 1 -
/product/511/review 2 -
/blog 1 -
/product/472/review 2 -
/product/1231/review 2 -
/products/--- 1 -
//news/wp-includes/wlwmanifest.xml 5 -
END_SIDER_404

# Host - Pages - Hits - Bandwidth - Last visit date - [Start date of last visit] - [Last page of last visit]
# [Start date of last visit] and [Last page of last visit] are saved only if session is not finished
# The 25 first Hits must be first (order not required for others)
BEGIN_VISITOR 230
43.245.205.104 394 416 3284258 20201231073339
94.202.53.146 175 607 19666785 20201222061837
5.107.151.112 121 121 321745 20201211090731
5.188.62.214 64 64 89360 20201213071718
188.135.27.20 59 219 14719740 20201202111832
35.196.166.82 46 46 265238 20201228225344
37.121.200.192 45 105 12684164 20201211132847
92.96.83.234 39 198 6711324 20201210073056
5.38.38.178 33 33 140197 20201221204555
5.188.62.140 32 32 44656 20201215122023
80.227.78.195 27 27 165161 20201202230759
5.107.182.190 26 26 87039 20201231042033
37.8.23.244 21 21 128886 20201228133121
176.204.101.164 20 20 75297 20201231041409
192.227.144.114 20 30 1145567 20201202134340
51.223.126.218 19 129 12520435 20201211210639
59.103.203.129 18 18 119523 20201203115810
159.0.94.223 15 65 11507748 20201218120414
72.79.58.112 14 14 232418 20201204204138
103.228.158.25 11 11 62307 20201202213045
23.95.219.136 11 19 685698 20201222173131
167.114.175.39 10 12 299050 20201222124510
111.88.197.29 10 43 1646564 20201222034942
2.89.177.152 10 37 1140531 20201218175017
104.129.255.179 10 17 543443 20201222114923
2.50.181.68 0 1 207165 
175.44.42.24 1 1 9212 20201219182916
159.0.83.229 2 21 492419 20201210012248
93.158.90.15 9 9 130505 20201230205712
34.82.189.161 1 1 0 20201228204557
2.88.245.187 1 20 476661 20201225090134
138.246.253.24 8 8 0 20201226043000
5.82.126.41 1 20 476659 20201207175448
93.158.90.130 9 9 130498 20201231202839
37.39.249.100 1 1 9211 20201214133522
95.217.207.28 1 1 9210 20201206160618
149.200.227.8 0 1 17003 
95.179.191.206 1 1 9213 20201223164652
34.125.69.252 1 1 9212 20201201093450
167.172.245.44 1 1 67259 20201206221124
93.169.55.45 1 1 9213 20201218115705
176.9.169.59 2 2 134518 20201209002319
188.236.202.0 1 20 476657 20201213030715
135.181.147.110 1 1 14184 20201229035829
94.128.218.173 0 1 128421 
174.246.198.201 1 2 9212 20201206200650
34.219.232.200 2 2 18423 20201224143358
74.64.217.96 2 22 1351609 20201208170050
34.219.88.87 2 2 18217 20201226143407
34.217.111.71 2 2 18421 20201202143322
185.253.218.243 2 2 18421 20201229020609
51.68.35.2 1 1 9211 20201205093829
95.90.242.53 2 36 1081533 20201226052228
40.87.105.177 2 2 76471 20201220124137
51.218.10.68 2 23 509358 20201229073411
34.209.160.85 2 2 18422 20201211143356
5.188.48.16 1 1 101889 20201207144947
128.127.215.197 2 21 485875 20201207100815
18.237.234.112 2 2 18422 20201201145713
103.44.18.164 1 20 862664 20201222032954
34.218.45.114 2 2 18424 20201225141615
85.1.217.17 1 22 907082 20201231142853
34.83.109.175 1 1 0 20201228204554
54.184.24.195 2 2 18422 20201230142357
35.162.224.173 1 1 9210 20201221140803
93.158.90.83 9 9 130509 20201231130741
199.244.88.132 1 1 9212 20201205222557
209.17.97.2 1 1 67259 20201220214709
51.141.124.182 2 2 134518 20201202100227
107.170.96.6 1 1 9211 20201204150624
51.39.189.143 1 22 907080 20201207024300
94.129.84.34 1 24 2287748 20201216050949
158.69.228.209 1 1 67259 20201223135826
82.165.117.55 4 4 18694 20201229090604
79.91.54.14 2 22 563605 20201214154650
40.76.1.202 1 1 135 20201205074341
18.236.206.113 2 2 18417 20201214143748
171.13.14.84 1 19 687103 20201213194431
194.156.95.243 1 1 9209 20201217183205
20.64.248.52 1 1 9210 20201203163953
218.75.158.134 1 1 9208 20201224210156
69.4.234.25 1 1 67259 20201201024056
38.18.59.111 1 1 9211 20201216175733
5.110.231.104 1 20 476662 20201208043403
83.146.222.98 2 26 955843 20201224025707
188.70.22.254 3 53 6291660 20201212161621
3.249.71.53 1 1 9212 20201209200107
35.162.236.239 1 1 67487 20201230010925
2.89.202.4 1 20 476667 20201228125947
52.12.48.89 2 2 18425 20201215142150
20.51.121.111 3 3 27634 20201228195023
34.209.236.75 1 22 863722 20201204002134
80.184.140.69 1 20 476600 20201211064532
34.210.206.5 1 1 9008 20201209044920
36.68.239.42 2 2 10609 20201214092604
34.221.21.222 2 2 18423 20201213142604
174.141.183.211 1 21 906728 20201225082927
149.202.67.223 1 1 67259 20201215032936
34.212.12.190 2 2 18422 20201203143654
188.236.175.242 1 23 728217 20201213112039
13.77.215.124 1 1 67259 20201204032453
37.39.137.139 1 20 476665 20201213133231
192.71.225.127 1 1 9209 20201231192454
37.121.217.95 6 11 63445 20201217150703
34.217.60.151 2 2 18423 20201217140538
88.99.226.179 1 1 9212 20201223003320
165.225.57.38 3 42 1734222 20201203115808
34.213.161.234 2 2 18422 20201212142823
18.232.185.155 2 2 9212 20201213165724
185.157.82.175 1 1 67259 20201217143118
82.165.52.101 2 2 9345 20201225214838
52.237.131.81 1 1 9210 20201210181745
51.252.18.240 1 1 0 20201208023352
94.128.204.16 1 21 906724 20201213151019
206.123.139.131 1 1 67259 20201218083020
52.12.107.183 1 1 67487 20201209012738
54.186.238.29 2 2 18421 20201205144308
13.66.139.95 0 2 218870 
3.25.65.157 5 15 950399 20201221213306
92.97.222.171 1 20 862662 20201208023810
94.158.245.149 1 1 67259 20201217083745
188.236.177.176 2 41 694669 20201202053204
195.201.110.247 4 4 231884 20201226162251
174.197.13.115 2 38 1089472 20201203141434
104.45.158.135 2 2 18421 20201227071512
52.34.61.205 2 2 18421 20201221140700
78.95.166.122 1 20 476662 20201211033818
120.204.149.180 1 16 223999 20201209073913
18.144.9.59 1 1 9211 20201214145918
92.99.106.132 3 23 331251 20201202234131
95.178.164.161 0 1 128421 
198.45.117.168 4 37 4098697 20201231223757
2.90.77.15 1 23 2287391 20201226022619
54.201.92.12 1 1 67487 20201223021448
161.35.124.51 1 1 9212 20201221205603
174.138.32.56 2 2 134518 20201231140600
159.0.112.25 1 20 476661 20201208205848
95.175.78.211 2 30 1021063 20201210100501
174.246.195.88 1 1 9212 20201221161111
35.165.210.30 2 2 18421 20201228140821
5.30.32.132 1 20 862664 20201222032954
46.105.45.118 2 2 134518 20201210222127
88.99.10.32 1 21 906722 20201230125030
52.43.220.48 2 2 18417 20201206141941
192.71.10.105 1 1 9212 20201201034111
194.34.238.120 6 8 257932 20201217233156
35.187.35.46 1 1 9211 20201222015243
31.166.181.159 1 24 2287748 20201213130503
52.26.124.128 2 2 18422 20201207141125
82.165.19.103 1 1 9214 20201226221917
51.252.7.220 2 44 2986814 20201217164209
18.237.114.137 2 2 18422 20201219140900
5.31.2.251 8 8 60426 20201206123040
35.196.166.80 3 3 51390 20201228224922
51.15.183.217 1 1 67487 20201218194545
35.166.245.8 2 2 18422 20201223143342
143.110.235.163 1 1 67259 20201203000317
202.102.144.121 3 3 27635 20201231143816
54.188.7.149 2 2 18420 20201204144657
44.234.188.54 1 1 9212 20201225152525
104.248.162.33 1 1 9211 20201226041321
142.93.188.38 1 1 9211 20201231114816
157.55.197.215 3 3 201777 20201221051810
84.215.201.199 1 21 316872 20201231181345
54.188.199.210 1 1 67487 20201216010437
217.165.165.144 3 37 308798 20201218090458
66.249.92.143 0 1 7813 
54.183.254.42 1 1 9214 20201204153120
2.89.248.60 1 20 476661 20201228122501
52.243.38.40 1 1 135 20201222225356
108.26.60.107 1 21 906722 20201229174031
52.162.177.6 3 3 27630 20201206160551
24.36.164.89 1 21 223524 20201229065440
85.10.204.252 1 1 67259 20201220061216
51.91.157.255 1 1 1394 20201226004730
178.152.232.80 1 21 906721 20201229192109
35.196.166.83 6 6 21411 20201228225230
5.188.84.119 1 1 67259 20201219044123
192.71.224.240 1 1 9212 20201226125517
54.185.103.223 2 2 18421 20201216141328
67.254.197.248 1 22 907080 20201229211515
104.129.255.106 1 1 9212 20201222172944
34.209.117.41 2 2 18424 20201229141453
92.40.188.150 1 21 906725 20201229061201
192.71.38.71 1 1 9213 20201215184445
35.196.166.81 4 4 7967 20201228225326
46.181.54.38 1 22 907082 20201208013114
37.238.206.14 1 21 906723 20201204135718
34.221.30.114 2 2 18421 20201227140819
5.156.50.8 1 20 476659 20201225034248
39.53.166.34 0 1 0 
34.217.34.115 2 2 18424 20201209141850
5.38.54.152 5 43 6514993 20201210071622
3.139.106.221 1 1 67259 20201217045149
92.96.114.178 1 21 316872 20201213051016
18.237.170.25 2 2 18422 20201220140536
54.149.73.162 2 2 18418 20201208144827
34.105.103.176 1 1 0 20201228204555
41.233.143.185 1 24 2620218 20201231124543
35.166.1.195 2 2 18423 20201231141527
104.236.8.127 1 1 67487 20201206204843
13.66.139.142 0 1 67691 
216.19.195.15 1 1 67259 20201224230655
52.8.177.103 1 1 9213 20201218155204
51.103.135.32 4 4 36841 20201204230308
35.196.166.84 2 2 9797 20201228225010
107.174.150.67 1 1 9212 20201222114723
188.236.169.61 1 21 223526 20201218053346
5.188.62.147 2 2 18420 20201230003600
51.36.112.118 1 12 663316 20201203164021
52.25.199.109 2 2 134144 20201202010654
39.101.1.61 1 1 9231 20201204012950
84.194.218.82 1 21 906724 20201229031809
54.149.137.70 1 1 9213 20201222141541
51.103.146.87 2 2 134518 20201227072209
54.84.62.142 2 2 18424 20201207082913
81.246.141.235 0 1 22673 
176.18.84.202 1 20 476659 20201208040728
120.29.98.182 2 50 1621906 20201220192103
34.105.109.39 1 1 0 20201228204553
109.167.158.74 1 1 67259 20201216102547
128.127.215.248 9 69 2244683 20201212004633
34.67.85.50 1 1 0 20201225120459
95.184.59.213 1 20 476659 20201202095315
34.222.227.89 2 2 18424 20201210143709
178.86.172.35 1 21 906722 20201228193358
78.95.47.51 2 29 3893992 20201217150553
34.213.236.51 2 2 18425 20201218141439
8.210.238.64 1 24 395264 20201222232239
5.62.58.241 1 1 67259 20201228081020
END_VISITOR

# Date - Pages - Hits - Bandwidth - Visits
BEGIN_DAY 31
20201201 176 177 1013675 7
20201202 216 465 18368269 16
20201203 62 148 3891391 10
20201204 26 88 3064018 12
20201205 7 7 104238 6
20201206 20 21 311054 8
20201207 14 108 2361547 8
20201208 9 126 4554763 8
20201209 8 42 872049 7
20201210 92 419 18784627 9
20201211 190 397 26490215 8
20201212 18 129 8568166 4
20201213 52 267 9108860 16
20201214 119 306 11562632 7
20201215 24 25 251226 4
20201216 6 30 2578547 5
20201217 25 102 7592326 11
20201218 35 166 13250578 9
20201219 6 6 94893 4
20201220 9 57 1793403 7
20201221 111 121 1659276 8
20201222 55 203 5879418 14
20201223 6 6 171593 5
20201224 6 30 1050733 4
20201225 10 68 1897029 9
20201226 12 68 3531699 9
20201227 6 7 280795 3
20201228 97 155 2476479 18
20201229 13 155 5308807 11
20201230 14 34 1132347 5
20201231 162 281 9916204 15
END_DAY

# Session range - Number of visits
BEGIN_SESSION 7
30mn-1h 3
15mn-30mn 10
1h+ 6
2mn-5mn 17
0s-30s 209
5mn-15mn 6
30s-2mn 16
END_SESSION

# URL - Pages - Bandwidth - Entry - Exit
# The 25 first Pages must be first (order not required for others)
BEGIN_SIDER 161
/api/checkout/cart 245 308261 10 4
/ 234 4239208 155 141
/admin/login 98 136807 11 10
/admin/catalog/products 96 970685 1 2
/api/sliders 77 22572 5 0
/products/chika-sport-milk-protein-chocolate 71 954110 27 24
/api/addresses 67 16979 1 4
/api/main 65 3159974 0 4
/api/inventories 46 22264 1 5
/api/checkout/remove/coupon 39 3783 0 0
/api/customer/get 30 5604 0 0
/products/chikabar-chocolate-protein-bar 25 377153 4 3
/checkout/summary 24 16348 0 1
/products/alasature-pizza 23 432847 21 20
/customer/login 23 303335 2 4
/checkout/cart 22 217611 1 2
/categories/snack 19 437347 0 1
/api/products 18 124047 1 0
/products/body-attack-protein-tortilla-wrap 16 221673 0 1
/customer/register 14 225264 2 0
/categories/supplement 13 298820 0 2
/api/products/529 11 17994 0 0
/categories/food-stuff 10 228966 0 0
/api/addresses/create 9 1646 0 0
/search 9 84734 0 1
/api/products/1368 1 1771 0 0
/api/products/549 1 2398 0 0
/api/checkout/cart/add/1332 2 2840 0 0
/api/checkout/cart/remove-item/1326 1 1577 0 0
/categories/casein 1 21954 0 0
/categories/vitamin 1 23008 0 0
/admin/catalog/attributes/edit/33 5 66005 0 2
/api/products/745 1 8269 0 0
/categories/protein-cookies 3 44665 1 1
/admin/catalog/products/edit/437 2 48399 0 0
/products/kupiec-rice-cakes-coatted 1 14792 0 0
/categories/beautyproducts 4 87865 0 0
/admin/sales/orders 1 9457 0 0
/vendor/phpunit/phpunit/phpunit.xsd 5 675 4 5
/api/products/1096 2 4052 0 0
/api/products/270 1 7569 0 1
/categories/pancake 5 109963 0 0
/api/products/1246 1 2306 0 0
/products/prozis-l---citrulline-malate 2 28720 1 1
/api/products/789 1 2897 0 0
/products/popcorners 1 15490 1 1
/products/applied-nutrition-idrive 1 0 0 0
/products/chikalab-keto-cookie 1 15753 0 0
/api/brands 2 4284 0 0
/admin/catalog/products/edit/402 1 22775 0 0
/admin/dashboard 4 19909 4 0
/categories/diet-mixed 1 21237 0 0
/api/products/1343 1 960 0 0
/api/products/922 3 7449 0 0
/checkout/save-address 6 3330 0 0
/product/chika-sport-milk-protein-chocolate/review 2 18350 0 1
/categories/plant-based 1 21963 0 0
/api/products/1294 4 12058 0 0
/api/checkout/cart/add/982 1 1896 0 0
/api/products/205 1 1486 0 0
/categories/cookingoil 1 22449 0 0
/api/checkout/cart/empty 7 553 0 0
/products/oat-king-mug-cake 2 30382 1 1
/api/checkout/cart/add/202 1 1055 0 0
/admin/catalog/families 1 6961 0 0
/terms 7 69711 0 6
/products/chikalab-chika-biscuit 5 78940 0 0
/api/checkout/cart/remove-item/1289 1 79 0 0
/api/checkout/cart/remove-item/1259 2 158 0 0
/api/products/1298 2 1758 0 0
/api/products/469 1 2259 0 0
/products/quest-tortilla-style-protein-chips 1 15794 0 0
/api/products/211 1 2132 0 0
/admin/catalog/products/edit/553 1 15859 0 0
/api/products/299 1 4223 0 1
/categories/accessory 6 127417 0 0
/admin/catalog/categories 1 7916 0 0
/api/products/295 1 3962 0 0
/categories/seasoning 1 22326 0 0
/products/meadows-extra-virgin-avocado-oil 1 14146 0 0
/categories/mass-gainer 1 22092 0 0
/products/alzaeem-kofta 8 110334 0 2
/product/chikabar-chocolate-protein-bar/review 1 9156 0 1
/api/wishlist/remove/529 1 83 0 0
/categories/pre-workout 3 68686 0 0
/categories/post-workout 1 22936 0 0
/api/products/213 1 565 0 0
/categories/burger 1 21945 0 0
/admin/catalog/products/edit/552 2 41563 0 0
/api/products/980 1 2361 0 0
/checkout/save-order 4 144 0 0
/api/products/351 1 1652 0 1
/admin/catalog/products/edit/1015 1 16663 0 0
/api/products/201 1 1828 0 1
/api/products/1315 2 6170 0 0
/categories/diet-whey 1 22062 0 0
/api/wishlist/add/529 1 1686 0 0
/checkout/onepage 8 234028 0 0
/products/applied-nutrition-vitamin-b-complex 2 14682 0 1
/api/products/982 1 1362 0 0
/api/products/1328 1 1031 0 0
/products/dymatize-iso-100-5lbs 1 15067 0 0
/categories/kofta 1 21939 0 0
/api/products/1373 1 2645 0 0
/api/checkout/cart/add/530 6 6589 0 0
/api/products/413 1 6089 0 0
/api/checkout/cart/remove-item/1325 1 79 0 0
/categories/whey 2 44583 0 0
/api/checkout/cart/add/549 1 2931 0 0
/api/checkout/cart/remove-item/1322 1 79 0 0
/api/addresses/84 1 69 0 0
/categories/bcaa-amino 1 22827 0 0
/api/checkout/cart/add/926 1 2133 0 0
/checkout/save-shipping 5 2605 0 0
/api/products/530 5 2794 0 0
/api/wishlist 2 1756 0 0
/categories/drinks 8 182312 0 1
/products/chikalab-dragee-chocolate 5 75815 0 0
/api/products/926 1 1581 0 0
/categories/kabab 1 21945 0 0
/api/checkout/checkout 7 28736 1 0
/admin/catalog/products/edit/1014 1 16661 0 0
/api/addresses/83 1 69 0 0
/categories/spread 1 23040 0 0
/api/products/729 1 2907 0 0
/checkout/save-payment 4 4401 0 0
/categories/fat-burner-water-shed 1 22597 0 0
/api/products/794 1 838 0 0
/customer/account/profile/edit 1 9737 0 0
/api/checkout/cart/remove-item/1302 1 2220 0 0
/index.php 1 9231 1 1
/api/checkout/cart/add/794 1 2651 0 0
/checkout/success 4 33644 0 2
/admin/sales/orders/view/209 1 3141 0 1
/api/checkout/cart/add/1298 2 2797 0 0
/api/products/202 1 557 1 0
/api/products/1178 2 2857 0 0
/api/products/1325 1 2191 0 0
/customer/account/profile 3 27244 0 0
/products/muscle-cheff---carnitine-coffee 8 101014 6 5
/products/applied-nutrition-pump-zero-stimulant 1 14852 1 1
/api/customer/register 6 894 1 0
/api/checkout/cart/add/529 2 272 0 0
/categories/muffin 1 21238 0 0
/api/goals 4 1856 0 0
/api/products/1360 3 3833 0 0
/api/category_tree 7 33782 1 0
/api/products/212 1 559 0 0
/products/a-nano-pancake 2 33154 0 0
/admin/catalog/attributes 6 51162 0 0
/api/products/0 2 266 0 0
/api/customer/forgot-password 1 103 0 0
/api/checkout/cart/add/547 1 136 0 0
/api/products/1337 1 2383 0 0
/api/products/1332 2 1795 0 0
/products/chikalab-bombbar-keto-bar 5 77423 0 0
/categories/isolate 1 22376 0 0
/api/products/547 1 3093 0 0
/api/customer/login 7 2270 1 0
/api/checkout/cart/add/1343 1 2625 0 0
/api/orders 1 6229 0 1
END_SIDER
