JuliaReach, HEAT3D, HEAT01-discrete, 1, 0.0238, 0.103699
JuliaReach, HEAT3D, HEAT02-discrete, 1, 1.2188, 0.029664
JuliaReach, HEAT3D, HEAT03-discrete, 1, 150.8692, 0.017165
JuliaReach, HEAT3D, HEAT04-discrete, 1, 5819.0973, 0.011611
JuliaReach, HEAT3D, HEAT01-continuous, 1, 0.1375, 0.103756
JuliaReach, HEAT3D, HEAT02-continuous, 1, 33.8703, 0.029835
JuliaReach, ISS, ISSF01-ISS01, 1, 11.8969
JuliaReach, ISS, ISSF01-ISU01, 0, 11.9139
JuliaReach, ISS, ISSF01-ISS01-discrete, 1, 11.9204
JuliaReach, ISS, ISSF01-ISU01-discrete, 0, 11.8712
JuliaReach, ISS, ISSC01-ISS02, 1, 1.3713
JuliaReach, ISS, ISSC01-ISU02, 0, 1.3687
JuliaReach, ISS, ISSC01-ISS02-discrete, 1, 1.37
JuliaReach, ISS, ISSC01-ISU02-discrete, 0, 1.3738
JuliaReach, GEARBOX, GRBX01-MES01, 1, 12.2749
JuliaReach, GEARBOX, GRBX02-MES01, 1, 7.995
JuliaReach, GEARBOX, GRBX01-MES01-discrete, 1, 42.6731
JuliaReach, GEARBOX, GRBX02-MES01-discrete, 1, 44.1551
JuliaReach, SPACECRAFT, NA01, 1, 1.8568
JuliaReach, SPACECRAFT, NA01-discrete, 1, 0.7184
JuliaReach, SPACECRAFT, A01, 1, 1.8334
JuliaReach, SPACECRAFT, A01-discrete, 1, 0.693
JuliaReach, SPACECRAFT, A02, 1, 1.9305
JuliaReach, SPACECRAFT, A02-discrete, 1, 0.731
JuliaReach, SPACECRAFT, A03, 1, 2.7922
JuliaReach, SPACECRAFT, A03-discrete, 1, 1.0705
JuliaReach, SPACECRAFT, A04, 1, 165.9707
JuliaReach, SPACECRAFT, U01, 0, 19.0716
JuliaReach, SPACECRAFT, U02, 0, 36.8929
JuliaReach, SPACECRAFT, U02-discrete, 0, 21.255
JuliaReach, BUILDING, BLDF01-BDS01, 1, 0.0121
JuliaReach, BUILDING, BLDF01-BDU01, 0, 0.0121
JuliaReach, BUILDING, BLDF01-BDU02, 0, 0.0121
JuliaReach, BUILDING, BLDF01-BDS01-discrete, 1, 0.0024
JuliaReach, BUILDING, BLDF01-BDU01-discrete, 0, 0.0024
JuliaReach, BUILDING, BLDF01-BDU02-discrete, 0, 0.0024
JuliaReach, BUILDING, BLDC01-BDS01, 1, 0.0141
JuliaReach, BUILDING, BLDC01-BDU01, 0, 0.0141
JuliaReach, BUILDING, BLDC01-BDU02, 0, 0.0141
JuliaReach, BUILDING, BLDC01-BDS01-discrete, 1, 0.0024
JuliaReach, BUILDING, BLDC01-BDU01-discrete, 0, 0.0024
JuliaReach, BUILDING, BLDC01-BDU02-discrete, 0, 0.0024
JuliaReach, PLATOONING, PLAD01-BND42, 1, 0.1092
JuliaReach, PLATOONING, PLAD01-BND42-discrete, 1, 2.3111
JuliaReach, PLATOONING, PLAD01-BND30, 1, 90.5079
JuliaReach, PLATOONING, PLAD01-BND30-discrete, 1, 31.7766
JuliaReach, EMBRAKE, BRKDC01, 1, 0.7863, 0.1002
JuliaReach, EMBRAKE, BRKDC01-D, 1, 0.0611, 0.1002
JuliaReach, EMBRAKE, BRKNC01, 1, 1.7727, 0.1002
JuliaReach, EMBRAKE, BRKNC01-D, 1, 0.7924, 0.1002
JuliaReach, EMBRAKE, BRKNP01, 0, 9.9211, 0.0823
JuliaReach, EMBRAKE, BRKNP01-D, 0, 9.6758, 0.0824
JuliaReach, POWERTRAIN, DTN01, 1, 0.2044
JuliaReach, POWERTRAIN, DTN02, 1, 0.1755
JuliaReach, POWERTRAIN, DTN03, 1, 0.1272
JuliaReach, POWERTRAIN, DTN04, 1, 0.2813
JuliaReach, POWERTRAIN, DTN05, 1, 0.6182
JuliaReach, POWERTRAIN, DTN06, 1, 1.6286
JuliaReach, CLAMPED, CB22d-100-C, 1, 20.9199, 71.62900702081377
JuliaReach, CLAMPED, CB22d-100-F, 1, 13.4521, 71.601866774783
JuliaReach, CLAMPED, CB22d-100-C-discrete, 1, 1.1078, 75.63346466990579
JuliaReach, CLAMPED, CB22d-100-F-discrete, 1, 0.6975, 73.78064683912038
JuliaReach, CLAMPED, CB22d-500-C, 1, 4.2534, 68.24973350555717
JuliaReach, CLAMPED, CB22d-500-F, 1, 155.7928, 68.24947520347877
JuliaReach, CLAMPED, CB22d-500-C-discrete, 1, 7.6071, 107.94466213007084
JuliaReach, CLAMPED, CB22d-500-F-discrete, 1, 8.2019, 73.65537393464858
JuliaReach, CLAMPED, CB22d-1000-C, 1, 12.3658, 81.03541606056729
JuliaReach, CLAMPED, CB22d-1000-C-discrete, 1, 21.4837, 68.24947520464868
JuliaReach, CLAMPED, CB22d-1000-F-discrete, 1, 28.9021, 73.65537394085048

