<?xml version="1.0" standalone="no"?>
<!DOCTYPE svg PUBLIC "-//W3C//DTD SVG 20010904//EN"
 "http://www.w3.org/TR/2001/REC-SVG-20010904/DTD/svg10.dtd">
<svg version="1.0" xmlns="http://www.w3.org/2000/svg"
 width="1024.000000pt" height="1022.000000pt" viewBox="0 0 1024.000000 1022.000000"
 preserveAspectRatio="xMidYMid meet">

<g transform="translate(0.000000,1022.000000) scale(0.100000,-0.100000)"
fill="#000000" stroke="none">
<path d="M4840 9500 c-1077 -75 -2065 -520 -2818 -1270 -728 -725 -1159 -1623
-1279 -2665 -24 -209 -24 -691 0 -903 60 -534 196 -1012 417 -1467 481 -988
1332 -1778 2345 -2174 1046 -409 2184 -409 3230 0 268 105 528 240 784 407
261 169 443 315 665 532 750 731 1194 1644 1313 2702 23 212 23 684 0 896 -48
428 -140 804 -288 1175 -571 1435 -1850 2465 -3374 2717 -289 47 -720 69 -995
50z m410 -3550 c513 -81 838 -608 678 -1100 -152 -470 -673 -712 -1128 -523
-212 88 -390 268 -470 475 -62 159 -75 359 -35 518 24 93 106 254 167 330 188
229 496 346 788 300z m-1521 -1222 c143 -540 604 -951 1171 -1044 119 -20 397
-14 510 11 344 75 655 274 866 554 103 138 216 378 249 529 l7 32 1132 0 1132
0 -4 -37 c-70 -738 -368 -1445 -853 -2028 -112 -134 -329 -350 -462 -460 -581
-481 -1251 -763 -2012 -847 -155 -17 -585 -17 -740 0 -182 20 -391 58 -548 98
-1351 348 -2389 1410 -2701 2764 -36 158 -76 405 -76 473 l0 37 1153 0 1154 0
22 -82z"/>
</g>
</svg>
