('C:\\Git\\ocs\\dist\\ocs.exe',
 True,
 False,
 False,
 'c:\\users\\taylor.gleason\\scoop\\apps\\python36\\current\\lib\\site-packages\\PyInstaller\\bootloader\\images\\icon-console.ico',
 None,
 False,
 False,
 '<?xml version="1.0" encoding="UTF-8" standalone="yes"?><assembly manifestVersion="1.0" xmlns="urn:schemas-microsoft-com:asm.v1"><assemblyIdentity name="ocs" processorArchitecture="amd64" type="win32" version="1.0.0.0"/><trustInfo xmlns="urn:schemas-microsoft-com:asm.v3"><security><requestedPrivileges><requestedExecutionLevel level="asInvoker" uiAccess="false"/></requestedPrivileges></security></trustInfo><dependency><dependentAssembly><assemblyIdentity language="*" name="Microsoft.Windows.Common-Controls" processorArchitecture="*" publicKeyToken="6595b64144ccf1df" type="win32" version="6.0.0.0"/></dependentAssembly></dependency><compatibility xmlns="urn:schemas-microsoft-com:compatibility.v1"><application><supportedOS Id="{e2011457-1546-43c5-a5fe-008deee3d3f0}"/><supportedOS Id="{35138b9a-5d96-4fbd-8e2d-a2440225f93a}"/><supportedOS Id="{4a2f28e3-53b9-4441-ba9c-d69d4a4a6e38}"/><supportedOS Id="{1f676c76-80e1-4239-95bb-83d0f6d0da78}"/><supportedOS Id="{8e0f7a12-bfb3-4fe8-b9a5-48fd50a15a9a}"/></application></compatibility><application xmlns="urn:schemas-microsoft-com:asm.v3"><windowsSettings><longPathAware xmlns="http://schemas.microsoft.com/SMI/2016/WindowsSettings">true</longPathAware></windowsSettings></application></assembly>',
 True,
 True,
 None,
 None,
 None,
 'C:\\Git\\ocs\\build\\ocs\\ocs.pkg',
 [('PYZ-00.pyz', 'C:\\Git\\ocs\\build\\ocs\\PYZ-00.pyz', 'PYZ'),
  ('struct',
   'c:\\users\\taylor.gleason\\scoop\\apps\\python36\\current\\lib\\struct.pyo',
   'PYMODULE'),
  ('pyimod01_os_path',
   'c:\\users\\taylor.gleason\\scoop\\apps\\python36\\current\\lib\\site-packages\\PyInstaller\\loader\\pyimod01_os_path.pyc',
   'PYMODULE'),
  ('pyimod02_archive',
   'c:\\users\\taylor.gleason\\scoop\\apps\\python36\\current\\lib\\site-packages\\PyInstaller\\loader\\pyimod02_archive.pyc',
   'PYMODULE'),
  ('pyimod03_importers',
   'c:\\users\\taylor.gleason\\scoop\\apps\\python36\\current\\lib\\site-packages\\PyInstaller\\loader\\pyimod03_importers.pyc',
   'PYMODULE'),
  ('pyimod04_ctypes',
   'c:\\users\\taylor.gleason\\scoop\\apps\\python36\\current\\lib\\site-packages\\PyInstaller\\loader\\pyimod04_ctypes.pyc',
   'PYMODULE'),
  ('pyiboot01_bootstrap',
   'c:\\users\\taylor.gleason\\scoop\\apps\\python36\\current\\lib\\site-packages\\PyInstaller\\loader\\pyiboot01_bootstrap.py',
   'PYSOURCE'),
  ('pyi_rth_subprocess',
   'c:\\users\\taylor.gleason\\scoop\\apps\\python36\\current\\lib\\site-packages\\PyInstaller\\hooks\\rthooks\\pyi_rth_subprocess.py',
   'PYSOURCE'),
  ('pyi_rth_pkgutil',
   'c:\\users\\taylor.gleason\\scoop\\apps\\python36\\current\\lib\\site-packages\\PyInstaller\\hooks\\rthooks\\pyi_rth_pkgutil.py',
   'PYSOURCE'),
  ('pyi_rth_inspect',
   'c:\\users\\taylor.gleason\\scoop\\apps\\python36\\current\\lib\\site-packages\\PyInstaller\\hooks\\rthooks\\pyi_rth_inspect.py',
   'PYSOURCE'),
  ('ocs', 'C:\\Git\\ocs\\ocs.py', 'PYSOURCE'),
  ('python36.dll',
   'c:\\users\\taylor.gleason\\scoop\\apps\\python36\\current\\python36.dll',
   'BINARY'),
  ('VCRUNTIME140.dll',
   'c:\\users\\taylor.gleason\\scoop\\apps\\python36\\current\\VCRUNTIME140.dll',
   'BINARY'),
  ('select',
   'c:\\users\\taylor.gleason\\scoop\\apps\\python36\\current\\DLLs\\select.pyd',
   'EXTENSION'),
  ('unicodedata',
   'c:\\users\\taylor.gleason\\scoop\\apps\\python36\\current\\DLLs\\unicodedata.pyd',
   'EXTENSION'),
  ('_bz2',
   'c:\\users\\taylor.gleason\\scoop\\apps\\python36\\current\\DLLs\\_bz2.pyd',
   'EXTENSION'),
  ('_socket',
   'c:\\users\\taylor.gleason\\scoop\\apps\\python36\\current\\DLLs\\_socket.pyd',
   'EXTENSION'),
  ('_lzma',
   'c:\\users\\taylor.gleason\\scoop\\apps\\python36\\current\\DLLs\\_lzma.pyd',
   'EXTENSION'),
  ('_hashlib',
   'c:\\users\\taylor.gleason\\scoop\\apps\\python36\\current\\DLLs\\_hashlib.pyd',
   'EXTENSION'),
  ('_ssl',
   'c:\\users\\taylor.gleason\\scoop\\apps\\python36\\current\\DLLs\\_ssl.pyd',
   'EXTENSION'),
  ('pyexpat',
   'c:\\users\\taylor.gleason\\scoop\\apps\\python36\\current\\DLLs\\pyexpat.pyd',
   'EXTENSION'),
  ('base_library.zip', 'C:\\Git\\ocs\\build\\ocs\\base_library.zip', 'DATA')],
 [],
 False,
 False,
 1673153593,
 [('run.exe',
   'c:\\users\\taylor.gleason\\scoop\\apps\\python36\\current\\lib\\site-packages\\PyInstaller\\bootloader\\Windows-64bit\\run.exe',
   'EXECUTABLE')])
