(['C:\\Git\\ocs\\ocs.py'],
 ['C:\\Git\\ocs'],
 ['codecs'],
 ['c:\\users\\taylor.gleason\\scoop\\apps\\python36\\current\\lib\\site-packages\\_pyinstaller_hooks_contrib\\hooks\\stdhooks',
  'c:\\users\\taylor.gleason\\scoop\\apps\\python36\\current\\lib\\site-packages\\_pyinstaller_hooks_contrib\\hooks\\stdhooks\\__pycache__',
  'c:\\users\\taylor.gleason\\scoop\\apps\\python36\\current\\lib\\site-packages\\_pyinstaller_hooks_contrib\\hooks\\rthooks',
  'c:\\users\\taylor.gleason\\scoop\\apps\\python36\\current\\lib\\site-packages\\_pyinstaller_hooks_contrib\\hooks\\rthooks\\__pycache__',
  'c:\\users\\taylor.gleason\\scoop\\apps\\python36\\current\\lib\\site-packages\\_pyinstaller_hooks_contrib\\hooks'],
 {},
 [],
 [],
 False,
 False,
 False,
 '3.6.8 (tags/v3.6.8:3c6b436a57, Dec 24 2018, 00:16:47) [MSC v.1916 64 bit '
 '(AMD64)]',
 [('pyi_rth_subprocess',
   'c:\\users\\taylor.gleason\\scoop\\apps\\python36\\current\\lib\\site-packages\\PyInstaller\\hooks\\rthooks\\pyi_rth_subprocess.py',
   'PYSOURCE'),
  ('pyi_rth_pkgutil',
   'c:\\users\\taylor.gleason\\scoop\\apps\\python36\\current\\lib\\site-packages\\PyInstaller\\hooks\\rthooks\\pyi_rth_pkgutil.py',
   'PYSOURCE'),
  ('pyi_rth_inspect',
   'c:\\users\\taylor.gleason\\scoop\\apps\\python36\\current\\lib\\site-packages\\PyInstaller\\hooks\\rthooks\\pyi_rth_inspect.py',
   'PYSOURCE'),
  ('ocs', 'C:\\Git\\ocs\\ocs.py', 'PYSOURCE')],
 [('os',
   'c:\\users\\taylor.gleason\\scoop\\apps\\python36\\current\\lib\\os.py',
   'PYMODULE'),
  ('subprocess',
   'c:\\users\\taylor.gleason\\scoop\\apps\\python36\\current\\lib\\subprocess.py',
   'PYMODULE'),
  ('dummy_threading',
   'c:\\users\\taylor.gleason\\scoop\\apps\\python36\\current\\lib\\dummy_threading.py',
   'PYMODULE'),
  ('_dummy_thread',
   'c:\\users\\taylor.gleason\\scoop\\apps\\python36\\current\\lib\\_dummy_thread.py',
   'PYMODULE'),
  ('selectors',
   'c:\\users\\taylor.gleason\\scoop\\apps\\python36\\current\\lib\\selectors.py',
   'PYMODULE'),
  ('threading',
   'c:\\users\\taylor.gleason\\scoop\\apps\\python36\\current\\lib\\threading.py',
   'PYMODULE'),
  ('_threading_local',
   'c:\\users\\taylor.gleason\\scoop\\apps\\python36\\current\\lib\\_threading_local.py',
   'PYMODULE'),
  ('contextlib',
   'c:\\users\\taylor.gleason\\scoop\\apps\\python36\\current\\lib\\contextlib.py',
   'PYMODULE'),
  ('signal',
   'c:\\users\\taylor.gleason\\scoop\\apps\\python36\\current\\lib\\signal.py',
   'PYMODULE'),
  ('_strptime',
   'c:\\users\\taylor.gleason\\scoop\\apps\\python36\\current\\lib\\_strptime.py',
   'PYMODULE'),
  ('datetime',
   'c:\\users\\taylor.gleason\\scoop\\apps\\python36\\current\\lib\\datetime.py',
   'PYMODULE'),
  ('calendar',
   'c:\\users\\taylor.gleason\\scoop\\apps\\python36\\current\\lib\\calendar.py',
   'PYMODULE'),
  ('argparse',
   'c:\\users\\taylor.gleason\\scoop\\apps\\python36\\current\\lib\\argparse.py',
   'PYMODULE'),
  ('gettext',
   'c:\\users\\taylor.gleason\\scoop\\apps\\python36\\current\\lib\\gettext.py',
   'PYMODULE'),
  ('struct',
   'c:\\users\\taylor.gleason\\scoop\\apps\\python36\\current\\lib\\struct.py',
   'PYMODULE'),
  ('textwrap',
   'c:\\users\\taylor.gleason\\scoop\\apps\\python36\\current\\lib\\textwrap.py',
   'PYMODULE'),
  ('copy',
   'c:\\users\\taylor.gleason\\scoop\\apps\\python36\\current\\lib\\copy.py',
   'PYMODULE'),
  ('ntpath',
   'c:\\users\\taylor.gleason\\scoop\\apps\\python36\\current\\lib\\ntpath.py',
   'PYMODULE'),
  ('string',
   'c:\\users\\taylor.gleason\\scoop\\apps\\python36\\current\\lib\\string.py',
   'PYMODULE'),
  ('genericpath',
   'c:\\users\\taylor.gleason\\scoop\\apps\\python36\\current\\lib\\genericpath.py',
   'PYMODULE'),
  ('posixpath',
   'c:\\users\\taylor.gleason\\scoop\\apps\\python36\\current\\lib\\posixpath.py',
   'PYMODULE'),
  ('stat',
   'c:\\users\\taylor.gleason\\scoop\\apps\\python36\\current\\lib\\stat.py',
   'PYMODULE'),
  ('inspect',
   'c:\\users\\taylor.gleason\\scoop\\apps\\python36\\current\\lib\\inspect.py',
   'PYMODULE'),
  ('importlib',
   'c:\\users\\taylor.gleason\\scoop\\apps\\python36\\current\\lib\\importlib\\__init__.py',
   'PYMODULE'),
  ('importlib.abc',
   'c:\\users\\taylor.gleason\\scoop\\apps\\python36\\current\\lib\\importlib\\abc.py',
   'PYMODULE'),
  ('importlib._bootstrap_external',
   'c:\\users\\taylor.gleason\\scoop\\apps\\python36\\current\\lib\\importlib\\_bootstrap_external.py',
   'PYMODULE'),
  ('importlib._bootstrap',
   'c:\\users\\taylor.gleason\\scoop\\apps\\python36\\current\\lib\\importlib\\_bootstrap.py',
   'PYMODULE'),
  ('token',
   'c:\\users\\taylor.gleason\\scoop\\apps\\python36\\current\\lib\\token.py',
   'PYMODULE'),
  ('importlib.machinery',
   'c:\\users\\taylor.gleason\\scoop\\apps\\python36\\current\\lib\\importlib\\machinery.py',
   'PYMODULE'),
  ('dis',
   'c:\\users\\taylor.gleason\\scoop\\apps\\python36\\current\\lib\\dis.py',
   'PYMODULE'),
  ('opcode',
   'c:\\users\\taylor.gleason\\scoop\\apps\\python36\\current\\lib\\opcode.py',
   'PYMODULE'),
  ('ast',
   'c:\\users\\taylor.gleason\\scoop\\apps\\python36\\current\\lib\\ast.py',
   'PYMODULE'),
  ('pkgutil',
   'c:\\users\\taylor.gleason\\scoop\\apps\\python36\\current\\lib\\pkgutil.py',
   'PYMODULE'),
  ('importlib.util',
   'c:\\users\\taylor.gleason\\scoop\\apps\\python36\\current\\lib\\importlib\\util.py',
   'PYMODULE'),
  ('stringprep',
   'c:\\users\\taylor.gleason\\scoop\\apps\\python36\\current\\lib\\stringprep.py',
   'PYMODULE'),
  ('base64',
   'c:\\users\\taylor.gleason\\scoop\\apps\\python36\\current\\lib\\base64.py',
   'PYMODULE'),
  ('getopt',
   'c:\\users\\taylor.gleason\\scoop\\apps\\python36\\current\\lib\\getopt.py',
   'PYMODULE'),
  ('bz2',
   'c:\\users\\taylor.gleason\\scoop\\apps\\python36\\current\\lib\\bz2.py',
   'PYMODULE'),
  ('_compression',
   'c:\\users\\taylor.gleason\\scoop\\apps\\python36\\current\\lib\\_compression.py',
   'PYMODULE'),
  ('quopri',
   'c:\\users\\taylor.gleason\\scoop\\apps\\python36\\current\\lib\\quopri.py',
   'PYMODULE'),
  ('tracemalloc',
   'c:\\users\\taylor.gleason\\scoop\\apps\\python36\\current\\lib\\tracemalloc.py',
   'PYMODULE'),
  ('fnmatch',
   'c:\\users\\taylor.gleason\\scoop\\apps\\python36\\current\\lib\\fnmatch.py',
   'PYMODULE'),
  ('pathlib',
   'c:\\users\\taylor.gleason\\scoop\\apps\\python36\\current\\lib\\pathlib.py',
   'PYMODULE'),
  ('urllib.parse',
   'c:\\users\\taylor.gleason\\scoop\\apps\\python36\\current\\lib\\urllib\\parse.py',
   'PYMODULE'),
  ('urllib',
   'c:\\users\\taylor.gleason\\scoop\\apps\\python36\\current\\lib\\urllib\\__init__.py',
   'PYMODULE'),
  ('pickle',
   'c:\\users\\taylor.gleason\\scoop\\apps\\python36\\current\\lib\\pickle.py',
   'PYMODULE'),
  ('pprint',
   'c:\\users\\taylor.gleason\\scoop\\apps\\python36\\current\\lib\\pprint.py',
   'PYMODULE'),
  ('doctest',
   'c:\\users\\taylor.gleason\\scoop\\apps\\python36\\current\\lib\\doctest.py',
   'PYMODULE'),
  ('unittest',
   'c:\\users\\taylor.gleason\\scoop\\apps\\python36\\current\\lib\\unittest\\__init__.py',
   'PYMODULE'),
  ('unittest.signals',
   'c:\\users\\taylor.gleason\\scoop\\apps\\python36\\current\\lib\\unittest\\signals.py',
   'PYMODULE'),
  ('unittest.main',
   'c:\\users\\taylor.gleason\\scoop\\apps\\python36\\current\\lib\\unittest\\main.py',
   'PYMODULE'),
  ('unittest.runner',
   'c:\\users\\taylor.gleason\\scoop\\apps\\python36\\current\\lib\\unittest\\runner.py',
   'PYMODULE'),
  ('unittest.loader',
   'c:\\users\\taylor.gleason\\scoop\\apps\\python36\\current\\lib\\unittest\\loader.py',
   'PYMODULE'),
  ('unittest.suite',
   'c:\\users\\taylor.gleason\\scoop\\apps\\python36\\current\\lib\\unittest\\suite.py',
   'PYMODULE'),
  ('unittest.case',
   'c:\\users\\taylor.gleason\\scoop\\apps\\python36\\current\\lib\\unittest\\case.py',
   'PYMODULE'),
  ('logging',
   'c:\\users\\taylor.gleason\\scoop\\apps\\python36\\current\\lib\\logging\\__init__.py',
   'PYMODULE'),
  ('unittest.result',
   'c:\\users\\taylor.gleason\\scoop\\apps\\python36\\current\\lib\\unittest\\result.py',
   'PYMODULE'),
  ('unittest.util',
   'c:\\users\\taylor.gleason\\scoop\\apps\\python36\\current\\lib\\unittest\\util.py',
   'PYMODULE'),
  ('pdb',
   'c:\\users\\taylor.gleason\\scoop\\apps\\python36\\current\\lib\\pdb.py',
   'PYMODULE'),
  ('pydoc',
   'c:\\users\\taylor.gleason\\scoop\\apps\\python36\\current\\lib\\pydoc.py',
   'PYMODULE'),
  ('webbrowser',
   'c:\\users\\taylor.gleason\\scoop\\apps\\python36\\current\\lib\\webbrowser.py',
   'PYMODULE'),
  ('socket',
   'c:\\users\\taylor.gleason\\scoop\\apps\\python36\\current\\lib\\socket.py',
   'PYMODULE'),
  ('shutil',
   'c:\\users\\taylor.gleason\\scoop\\apps\\python36\\current\\lib\\shutil.py',
   'PYMODULE'),
  ('zipfile',
   'c:\\users\\taylor.gleason\\scoop\\apps\\python36\\current\\lib\\zipfile.py',
   'PYMODULE'),
  ('py_compile',
   'c:\\users\\taylor.gleason\\scoop\\apps\\python36\\current\\lib\\py_compile.py',
   'PYMODULE'),
  ('tarfile',
   'c:\\users\\taylor.gleason\\scoop\\apps\\python36\\current\\lib\\tarfile.py',
   'PYMODULE'),
  ('gzip',
   'c:\\users\\taylor.gleason\\scoop\\apps\\python36\\current\\lib\\gzip.py',
   'PYMODULE'),
  ('lzma',
   'c:\\users\\taylor.gleason\\scoop\\apps\\python36\\current\\lib\\lzma.py',
   'PYMODULE'),
  ('email.message',
   'c:\\users\\taylor.gleason\\scoop\\apps\\python36\\current\\lib\\email\\message.py',
   'PYMODULE'),
  ('email.policy',
   'c:\\users\\taylor.gleason\\scoop\\apps\\python36\\current\\lib\\email\\policy.py',
   'PYMODULE'),
  ('email.contentmanager',
   'c:\\users\\taylor.gleason\\scoop\\apps\\python36\\current\\lib\\email\\contentmanager.py',
   'PYMODULE'),
  ('email.quoprimime',
   'c:\\users\\taylor.gleason\\scoop\\apps\\python36\\current\\lib\\email\\quoprimime.py',
   'PYMODULE'),
  ('email.headerregistry',
   'c:\\users\\taylor.gleason\\scoop\\apps\\python36\\current\\lib\\email\\headerregistry.py',
   'PYMODULE'),
  ('email._header_value_parser',
   'c:\\users\\taylor.gleason\\scoop\\apps\\python36\\current\\lib\\email\\_header_value_parser.py',
   'PYMODULE'),
  ('email.iterators',
   'c:\\users\\taylor.gleason\\scoop\\apps\\python36\\current\\lib\\email\\iterators.py',
   'PYMODULE'),
  ('email.generator',
   'c:\\users\\taylor.gleason\\scoop\\apps\\python36\\current\\lib\\email\\generator.py',
   'PYMODULE'),
  ('random',
   'c:\\users\\taylor.gleason\\scoop\\apps\\python36\\current\\lib\\random.py',
   'PYMODULE'),
  ('bisect',
   'c:\\users\\taylor.gleason\\scoop\\apps\\python36\\current\\lib\\bisect.py',
   'PYMODULE'),
  ('hashlib',
   'c:\\users\\taylor.gleason\\scoop\\apps\\python36\\current\\lib\\hashlib.py',
   'PYMODULE'),
  ('email._encoded_words',
   'c:\\users\\taylor.gleason\\scoop\\apps\\python36\\current\\lib\\email\\_encoded_words.py',
   'PYMODULE'),
  ('email.charset',
   'c:\\users\\taylor.gleason\\scoop\\apps\\python36\\current\\lib\\email\\charset.py',
   'PYMODULE'),
  ('email.encoders',
   'c:\\users\\taylor.gleason\\scoop\\apps\\python36\\current\\lib\\email\\encoders.py',
   'PYMODULE'),
  ('email.base64mime',
   'c:\\users\\taylor.gleason\\scoop\\apps\\python36\\current\\lib\\email\\base64mime.py',
   'PYMODULE'),
  ('email._policybase',
   'c:\\users\\taylor.gleason\\scoop\\apps\\python36\\current\\lib\\email\\_policybase.py',
   'PYMODULE'),
  ('email.header',
   'c:\\users\\taylor.gleason\\scoop\\apps\\python36\\current\\lib\\email\\header.py',
   'PYMODULE'),
  ('email.errors',
   'c:\\users\\taylor.gleason\\scoop\\apps\\python36\\current\\lib\\email\\errors.py',
   'PYMODULE'),
  ('email.utils',
   'c:\\users\\taylor.gleason\\scoop\\apps\\python36\\current\\lib\\email\\utils.py',
   'PYMODULE'),
  ('email._parseaddr',
   'c:\\users\\taylor.gleason\\scoop\\apps\\python36\\current\\lib\\email\\_parseaddr.py',
   'PYMODULE'),
  ('email',
   'c:\\users\\taylor.gleason\\scoop\\apps\\python36\\current\\lib\\email\\__init__.py',
   'PYMODULE'),
  ('email.parser',
   'c:\\users\\taylor.gleason\\scoop\\apps\\python36\\current\\lib\\email\\parser.py',
   'PYMODULE'),
  ('email.feedparser',
   'c:\\users\\taylor.gleason\\scoop\\apps\\python36\\current\\lib\\email\\feedparser.py',
   'PYMODULE'),
  ('uu',
   'c:\\users\\taylor.gleason\\scoop\\apps\\python36\\current\\lib\\uu.py',
   'PYMODULE'),
  ('optparse',
   'c:\\users\\taylor.gleason\\scoop\\apps\\python36\\current\\lib\\optparse.py',
   'PYMODULE'),
  ('http.server',
   'c:\\users\\taylor.gleason\\scoop\\apps\\python36\\current\\lib\\http\\server.py',
   'PYMODULE'),
  ('http',
   'c:\\users\\taylor.gleason\\scoop\\apps\\python36\\current\\lib\\http\\__init__.py',
   'PYMODULE'),
  ('socketserver',
   'c:\\users\\taylor.gleason\\scoop\\apps\\python36\\current\\lib\\socketserver.py',
   'PYMODULE'),
  ('mimetypes',
   'c:\\users\\taylor.gleason\\scoop\\apps\\python36\\current\\lib\\mimetypes.py',
   'PYMODULE'),
  ('http.client',
   'c:\\users\\taylor.gleason\\scoop\\apps\\python36\\current\\lib\\http\\client.py',
   'PYMODULE'),
  ('ssl',
   'c:\\users\\taylor.gleason\\scoop\\apps\\python36\\current\\lib\\ssl.py',
   'PYMODULE'),
  ('ipaddress',
   'c:\\users\\taylor.gleason\\scoop\\apps\\python36\\current\\lib\\ipaddress.py',
   'PYMODULE'),
  ('html',
   'c:\\users\\taylor.gleason\\scoop\\apps\\python36\\current\\lib\\html\\__init__.py',
   'PYMODULE'),
  ('html.entities',
   'c:\\users\\taylor.gleason\\scoop\\apps\\python36\\current\\lib\\html\\entities.py',
   'PYMODULE'),
  ('pydoc_data.topics',
   'c:\\users\\taylor.gleason\\scoop\\apps\\python36\\current\\lib\\pydoc_data\\topics.py',
   'PYMODULE'),
  ('pydoc_data',
   'c:\\users\\taylor.gleason\\scoop\\apps\\python36\\current\\lib\\pydoc_data\\__init__.py',
   'PYMODULE'),
  ('tty',
   'c:\\users\\taylor.gleason\\scoop\\apps\\python36\\current\\lib\\tty.py',
   'PYMODULE'),
  ('tempfile',
   'c:\\users\\taylor.gleason\\scoop\\apps\\python36\\current\\lib\\tempfile.py',
   'PYMODULE'),
  ('platform',
   'c:\\users\\taylor.gleason\\scoop\\apps\\python36\\current\\lib\\platform.py',
   'PYMODULE'),
  ('plistlib',
   'c:\\users\\taylor.gleason\\scoop\\apps\\python36\\current\\lib\\plistlib.py',
   'PYMODULE'),
  ('xml.parsers.expat',
   'c:\\users\\taylor.gleason\\scoop\\apps\\python36\\current\\lib\\xml\\parsers\\expat.py',
   'PYMODULE'),
  ('xml.parsers',
   'c:\\users\\taylor.gleason\\scoop\\apps\\python36\\current\\lib\\xml\\parsers\\__init__.py',
   'PYMODULE'),
  ('xml',
   'c:\\users\\taylor.gleason\\scoop\\apps\\python36\\current\\lib\\xml\\__init__.py',
   'PYMODULE'),
  ('xml.sax.expatreader',
   'c:\\users\\taylor.gleason\\scoop\\apps\\python36\\current\\lib\\xml\\sax\\expatreader.py',
   'PYMODULE'),
  ('xml.sax.saxutils',
   'c:\\users\\taylor.gleason\\scoop\\apps\\python36\\current\\lib\\xml\\sax\\saxutils.py',
   'PYMODULE'),
  ('urllib.request',
   'c:\\users\\taylor.gleason\\scoop\\apps\\python36\\current\\lib\\urllib\\request.py',
   'PYMODULE'),
  ('getpass',
   'c:\\users\\taylor.gleason\\scoop\\apps\\python36\\current\\lib\\getpass.py',
   'PYMODULE'),
  ('nturl2path',
   'c:\\users\\taylor.gleason\\scoop\\apps\\python36\\current\\lib\\nturl2path.py',
   'PYMODULE'),
  ('ftplib',
   'c:\\users\\taylor.gleason\\scoop\\apps\\python36\\current\\lib\\ftplib.py',
   'PYMODULE'),
  ('netrc',
   'c:\\users\\taylor.gleason\\scoop\\apps\\python36\\current\\lib\\netrc.py',
   'PYMODULE'),
  ('http.cookiejar',
   'c:\\users\\taylor.gleason\\scoop\\apps\\python36\\current\\lib\\http\\cookiejar.py',
   'PYMODULE'),
  ('urllib.response',
   'c:\\users\\taylor.gleason\\scoop\\apps\\python36\\current\\lib\\urllib\\response.py',
   'PYMODULE'),
  ('urllib.error',
   'c:\\users\\taylor.gleason\\scoop\\apps\\python36\\current\\lib\\urllib\\error.py',
   'PYMODULE'),
  ('xml.sax',
   'c:\\users\\taylor.gleason\\scoop\\apps\\python36\\current\\lib\\xml\\sax\\__init__.py',
   'PYMODULE'),
  ('xml.sax.handler',
   'c:\\users\\taylor.gleason\\scoop\\apps\\python36\\current\\lib\\xml\\sax\\handler.py',
   'PYMODULE'),
  ('xml.sax._exceptions',
   'c:\\users\\taylor.gleason\\scoop\\apps\\python36\\current\\lib\\xml\\sax\\_exceptions.py',
   'PYMODULE'),
  ('xml.sax.xmlreader',
   'c:\\users\\taylor.gleason\\scoop\\apps\\python36\\current\\lib\\xml\\sax\\xmlreader.py',
   'PYMODULE'),
  ('shlex',
   'c:\\users\\taylor.gleason\\scoop\\apps\\python36\\current\\lib\\shlex.py',
   'PYMODULE'),
  ('glob',
   'c:\\users\\taylor.gleason\\scoop\\apps\\python36\\current\\lib\\glob.py',
   'PYMODULE'),
  ('code',
   'c:\\users\\taylor.gleason\\scoop\\apps\\python36\\current\\lib\\code.py',
   'PYMODULE'),
  ('codeop',
   'c:\\users\\taylor.gleason\\scoop\\apps\\python36\\current\\lib\\codeop.py',
   'PYMODULE'),
  ('bdb',
   'c:\\users\\taylor.gleason\\scoop\\apps\\python36\\current\\lib\\bdb.py',
   'PYMODULE'),
  ('cmd',
   'c:\\users\\taylor.gleason\\scoop\\apps\\python36\\current\\lib\\cmd.py',
   'PYMODULE'),
  ('difflib',
   'c:\\users\\taylor.gleason\\scoop\\apps\\python36\\current\\lib\\difflib.py',
   'PYMODULE'),
  ('__future__',
   'c:\\users\\taylor.gleason\\scoop\\apps\\python36\\current\\lib\\__future__.py',
   'PYMODULE'),
  ('_compat_pickle',
   'c:\\users\\taylor.gleason\\scoop\\apps\\python36\\current\\lib\\_compat_pickle.py',
   'PYMODULE')],
 [('python36.dll',
   'c:\\users\\taylor.gleason\\scoop\\apps\\python36\\current\\python36.dll',
   'BINARY'),
  ('VCRUNTIME140.dll',
   'c:\\users\\taylor.gleason\\scoop\\apps\\python36\\current\\VCRUNTIME140.dll',
   'BINARY'),
  ('select',
   'c:\\users\\taylor.gleason\\scoop\\apps\\python36\\current\\DLLs\\select.pyd',
   'EXTENSION'),
  ('unicodedata',
   'c:\\users\\taylor.gleason\\scoop\\apps\\python36\\current\\DLLs\\unicodedata.pyd',
   'EXTENSION'),
  ('_bz2',
   'c:\\users\\taylor.gleason\\scoop\\apps\\python36\\current\\DLLs\\_bz2.pyd',
   'EXTENSION'),
  ('_socket',
   'c:\\users\\taylor.gleason\\scoop\\apps\\python36\\current\\DLLs\\_socket.pyd',
   'EXTENSION'),
  ('_lzma',
   'c:\\users\\taylor.gleason\\scoop\\apps\\python36\\current\\DLLs\\_lzma.pyd',
   'EXTENSION'),
  ('_hashlib',
   'c:\\users\\taylor.gleason\\scoop\\apps\\python36\\current\\DLLs\\_hashlib.pyd',
   'EXTENSION'),
  ('_ssl',
   'c:\\users\\taylor.gleason\\scoop\\apps\\python36\\current\\DLLs\\_ssl.pyd',
   'EXTENSION'),
  ('pyexpat',
   'c:\\users\\taylor.gleason\\scoop\\apps\\python36\\current\\DLLs\\pyexpat.pyd',
   'EXTENSION')],
 [],
 [],
 [('base_library.zip', 'C:\\Git\\ocs\\build\\ocs\\base_library.zip', 'DATA')],
 [])
