('C:\\Git\\ocs\\build\\ocs\\ocs.pkg',
 {'BINARY': 1,
  'DATA': 1,
  'EXECUTABLE': 1,
  'EXTENSION': 1,
  'PYMODULE': 1,
  'PYSOURCE': 1,
  'PYZ': 0,
  'SPLASH': 1},
 [('PYZ-00.pyz', 'C:\\Git\\ocs\\build\\ocs\\PYZ-00.pyz', 'PYZ'),
  ('struct',
   'c:\\users\\taylor.gleason\\scoop\\apps\\python36\\current\\lib\\struct.pyo',
   'PYMODULE'),
  ('pyimod01_os_path',
   'c:\\users\\taylor.gleason\\scoop\\apps\\python36\\current\\lib\\site-packages\\PyInstaller\\loader\\pyimod01_os_path.pyc',
   'PYMODULE'),
  ('pyimod02_archive',
   'c:\\users\\taylor.gleason\\scoop\\apps\\python36\\current\\lib\\site-packages\\PyInstaller\\loader\\pyimod02_archive.pyc',
   'PYMODULE'),
  ('pyimod03_importers',
   'c:\\users\\taylor.gleason\\scoop\\apps\\python36\\current\\lib\\site-packages\\PyInstaller\\loader\\pyimod03_importers.pyc',
   'PYMODULE'),
  ('pyimod04_ctypes',
   'c:\\users\\taylor.gleason\\scoop\\apps\\python36\\current\\lib\\site-packages\\PyInstaller\\loader\\pyimod04_ctypes.pyc',
   'PYMODULE'),
  ('pyiboot01_bootstrap',
   'c:\\users\\taylor.gleason\\scoop\\apps\\python36\\current\\lib\\site-packages\\PyInstaller\\loader\\pyiboot01_bootstrap.py',
   'PYSOURCE'),
  ('pyi_rth_subprocess',
   'c:\\users\\taylor.gleason\\scoop\\apps\\python36\\current\\lib\\site-packages\\PyInstaller\\hooks\\rthooks\\pyi_rth_subprocess.py',
   'PYSOURCE'),
  ('pyi_rth_pkgutil',
   'c:\\users\\taylor.gleason\\scoop\\apps\\python36\\current\\lib\\site-packages\\PyInstaller\\hooks\\rthooks\\pyi_rth_pkgutil.py',
   'PYSOURCE'),
  ('pyi_rth_inspect',
   'c:\\users\\taylor.gleason\\scoop\\apps\\python36\\current\\lib\\site-packages\\PyInstaller\\hooks\\rthooks\\pyi_rth_inspect.py',
   'PYSOURCE'),
  ('ocs', 'C:\\Git\\ocs\\ocs.py', 'PYSOURCE'),
  ('python36.dll',
   'c:\\users\\taylor.gleason\\scoop\\apps\\python36\\current\\python36.dll',
   'BINARY'),
  ('VCRUNTIME140.dll',
   'c:\\users\\taylor.gleason\\scoop\\apps\\python36\\current\\VCRUNTIME140.dll',
   'BINARY'),
  ('select',
   'c:\\users\\taylor.gleason\\scoop\\apps\\python36\\current\\DLLs\\select.pyd',
   'EXTENSION'),
  ('unicodedata',
   'c:\\users\\taylor.gleason\\scoop\\apps\\python36\\current\\DLLs\\unicodedata.pyd',
   'EXTENSION'),
  ('_bz2',
   'c:\\users\\taylor.gleason\\scoop\\apps\\python36\\current\\DLLs\\_bz2.pyd',
   'EXTENSION'),
  ('_socket',
   'c:\\users\\taylor.gleason\\scoop\\apps\\python36\\current\\DLLs\\_socket.pyd',
   'EXTENSION'),
  ('_lzma',
   'c:\\users\\taylor.gleason\\scoop\\apps\\python36\\current\\DLLs\\_lzma.pyd',
   'EXTENSION'),
  ('_hashlib',
   'c:\\users\\taylor.gleason\\scoop\\apps\\python36\\current\\DLLs\\_hashlib.pyd',
   'EXTENSION'),
  ('_ssl',
   'c:\\users\\taylor.gleason\\scoop\\apps\\python36\\current\\DLLs\\_ssl.pyd',
   'EXTENSION'),
  ('pyexpat',
   'c:\\users\\taylor.gleason\\scoop\\apps\\python36\\current\\DLLs\\pyexpat.pyd',
   'EXTENSION'),
  ('base_library.zip', 'C:\\Git\\ocs\\build\\ocs\\base_library.zip', 'DATA')],
 False,
 False,
 False,
 [],
 None,
 None,
 None)
