
=== Response of http://192.168.50.100:19020/learner/parameters ===
{"name": "SarsaQTable", "parameters": {"actions_n": 13, "alpha": 0.001, "beta": 0.1, "window_size": 10, "epsilon_start": 0.9, "epsilon_min": 0.05, "epsilon_decay": 0.9995, "epsilon_decay_enabled": true, "entry_missing_max_attempts": 50}}


=== Response of http://192.168.50.101:19020/learner/parameters ===
{"name": "SarsaQTable", "parameters": {"actions_n": 13, "alpha": 0.001, "beta": 0.1, "window_size": 10, "epsilon_start": 0.9, "epsilon_min": 0.05, "epsilon_decay": 0.9995, "epsilon_decay_enabled": true, "entry_missing_max_attempts": 50}}


=== Response of http://192.168.50.102:19020/learner/parameters ===
{"name": "SarsaQTable", "parameters": {"actions_n": 13, "alpha": 0.001, "beta": 0.1, "window_size": 10, "epsilon_start": 0.9, "epsilon_min": 0.05, "epsilon_decay": 0.9995, "epsilon_decay_enabled": true, "entry_missing_max_attempts": 50}}


=== Response of http://192.168.50.103:19020/learner/parameters ===
{"name": "SarsaQTable", "parameters": {"actions_n": 13, "alpha": 0.001, "beta": 0.1, "window_size": 10, "epsilon_start": 0.9, "epsilon_min": 0.05, "epsilon_decay": 0.9995, "epsilon_decay_enabled": true, "entry_missing_max_attempts": 50}}


=== Response of http://192.168.50.104:19020/learner/parameters ===
{"name": "SarsaQTable", "parameters": {"actions_n": 13, "alpha": 0.001, "beta": 0.1, "window_size": 10, "epsilon_start": 0.9, "epsilon_min": 0.05, "epsilon_decay": 0.9995, "epsilon_decay_enabled": true, "entry_missing_max_attempts": 50}}


=== Response of http://192.168.50.105:19020/learner/parameters ===
{"name": "SarsaQTable", "parameters": {"actions_n": 13, "alpha": 0.001, "beta": 0.1, "window_size": 10, "epsilon_start": 0.9, "epsilon_min": 0.05, "epsilon_decay": 0.9995, "epsilon_decay_enabled": true, "entry_missing_max_attempts": 50}}


=== Response of http://192.168.50.107:19020/learner/parameters ===
{"name": "SarsaQTable", "parameters": {"actions_n": 13, "alpha": 0.001, "beta": 0.1, "window_size": 10, "epsilon_start": 0.9, "epsilon_min": 0.05, "epsilon_decay": 0.9995, "epsilon_decay_enabled": true, "entry_missing_max_attempts": 50}}


=== Response of http://192.168.50.110:19020/learner/parameters ===
{"name": "SarsaQTable", "parameters": {"actions_n": 13, "alpha": 0.001, "beta": 0.1, "window_size": 10, "epsilon_start": 0.9, "epsilon_min": 0.05, "epsilon_decay": 0.9995, "epsilon_decay_enabled": true, "entry_missing_max_attempts": 50}}


=== Response of http://192.168.50.111:19020/learner/parameters ===
{"name": "SarsaQTable", "parameters": {"actions_n": 13, "alpha": 0.001, "beta": 0.1, "window_size": 10, "epsilon_start": 0.9, "epsilon_min": 0.05, "epsilon_decay": 0.9995, "epsilon_decay_enabled": true, "entry_missing_max_attempts": 50}}


=== Response of http://192.168.50.112:19020/learner/parameters ===
{"name": "SarsaQTable", "parameters": {"actions_n": 13, "alpha": 0.001, "beta": 0.1, "window_size": 10, "epsilon_start": 0.9, "epsilon_min": 0.05, "epsilon_decay": 0.9995, "epsilon_decay_enabled": true, "entry_missing_max_attempts": 50}}


=== Response of http://192.168.50.113:19020/learner/parameters ===
{"name": "SarsaQTable", "parameters": {"actions_n": 13, "alpha": 0.001, "beta": 0.1, "window_size": 10, "epsilon_start": 0.9, "epsilon_min": 0.05, "epsilon_decay": 0.9995, "epsilon_decay_enabled": true, "entry_missing_max_attempts": 50}}

