
=== Response of http://192.168.50.100:18080/configuration/scheduler ===
{"name":"LearningScheduler","parameters":["2"]}


=== Response of http://192.168.50.101:18080/configuration/scheduler ===
{"name":"LearningScheduler","parameters":["2"]}


=== Response of http://192.168.50.102:18080/configuration/scheduler ===
{"name":"LearningScheduler","parameters":["2"]}


=== Response of http://192.168.50.103:18080/configuration/scheduler ===
{"name":"LearningScheduler","parameters":["2"]}


=== Response of http://192.168.50.104:18080/configuration/scheduler ===
{"name":"LearningScheduler","parameters":["2"]}


=== Response of http://192.168.50.105:18080/configuration/scheduler ===
{"name":"LearningScheduler","parameters":["2"]}


=== Response of http://192.168.50.107:18080/configuration/scheduler ===
{"name":"LearningScheduler","parameters":["2"]}


=== Response of http://192.168.50.110:18080/configuration/scheduler ===
{"name":"LearningScheduler","parameters":["2"]}


=== Response of http://192.168.50.111:18080/configuration/scheduler ===
{"name":"LearningScheduler","parameters":["2"]}


=== Response of http://192.168.50.112:18080/configuration/scheduler ===
{"name":"LearningScheduler","parameters":["2"]}


=== Response of http://192.168.50.113:18080/configuration/scheduler ===
{"name":"LearningScheduler","parameters":["2"]}

