
=== Response of http://192.168.50.100:19020/ ===
This is p2pfaas-learner v0.0.1b.


=== Response of http://192.168.50.101:19020/ ===
This is p2pfaas-learner v0.0.1b.


=== Response of http://192.168.50.102:19020/ ===
This is p2pfaas-learner v0.0.1b.


=== Response of http://192.168.50.103:19020/ ===
This is p2pfaas-learner v0.0.1b.


=== Response of http://192.168.50.104:19020/ ===
This is p2pfaas-learner v0.0.1b.


=== Response of http://192.168.50.105:19020/ ===
This is p2pfaas-learner v0.0.1b.


=== Response of http://192.168.50.107:19020/ ===
This is p2pfaas-learner v0.0.1b.


=== Response of http://192.168.50.110:19020/ ===
This is p2pfaas-learner v0.0.1b.


=== Response of http://192.168.50.111:19020/ ===
This is p2pfaas-learner v0.0.1b.


=== Response of http://192.168.50.112:19020/ ===
This is p2pfaas-learner v0.0.1b.


=== Response of http://192.168.50.113:19020/ ===
This is p2pfaas-learner v0.0.1b.

