
=== Response of http://192.168.50.100:18080/configuration ===
{"parallel_running_functions_max":3,"queue_length_max":2,"queue_enabled":false}


=== Response of http://192.168.50.101:18080/configuration ===
{"parallel_running_functions_max":3,"queue_length_max":2,"queue_enabled":false}


=== Response of http://192.168.50.102:18080/configuration ===
{"parallel_running_functions_max":3,"queue_length_max":2,"queue_enabled":false}


=== Response of http://192.168.50.103:18080/configuration ===
{"parallel_running_functions_max":3,"queue_length_max":2,"queue_enabled":false}


=== Response of http://192.168.50.104:18080/configuration ===
{"parallel_running_functions_max":3,"queue_length_max":2,"queue_enabled":false}


=== Response of http://192.168.50.105:18080/configuration ===
{"parallel_running_functions_max":3,"queue_length_max":2,"queue_enabled":false}


=== Response of http://192.168.50.107:18080/configuration ===
{"parallel_running_functions_max":3,"queue_length_max":2,"queue_enabled":false}


=== Response of http://192.168.50.110:18080/configuration ===
{"parallel_running_functions_max":3,"queue_length_max":2,"queue_enabled":false}


=== Response of http://192.168.50.111:18080/configuration ===
{"parallel_running_functions_max":3,"queue_length_max":2,"queue_enabled":false}


=== Response of http://192.168.50.112:18080/configuration ===
{"parallel_running_functions_max":3,"queue_length_max":2,"queue_enabled":false}


=== Response of http://192.168.50.113:18080/configuration ===
{"parallel_running_functions_max":3,"queue_length_max":2,"queue_enabled":false}

