[
  {
    "ID": "KPI_NumberRegisteredTaxPayersYearlyByOffice",
    "GroupID": "NumberRegisteredTaxPayers",
    "Parameters": [
      {
        "ID": "@LimitYear",
        "Name": "Last year to process",
        "DefaultValue": "[LASTYEAR]"
      },
      {
        "ID": "@NumberOfYears",
        "Name": "Number of years to show",
        "DefaultValue": "5"
      }
    ]
  },
  {
    "ID": "KPI_NumberRegisteredTaxPayersYearlyByTypeOfTax",
    "GroupID": "NumberRegisteredTaxPayers",
    "Parameters": [
      {
        "ID": "@LimitYear",
        "Name": "Last year to process",
        "DefaultValue": "[LASTYEAR]"
      },
      {
        "ID": "@NumberOfYears",
        "Name": "Number of years to show",
        "DefaultValue": "5"
      }
    ]
  },
  {
    "ID": "KPI_NumberRegisteredTaxPayersYearly",
    "GroupID": "NumberRegisteredTaxPayers",
    "Parameters": [
      {
        "ID": "@LimitYear",
        "Name": "Last year to process",
        "DefaultValue": "[LASTYEAR]"
      },
      {
        "ID": "@NumberOfYears",
        "Name": "Number of years to show",
        "DefaultValue": "5"
      }
    ]
  },
  {
    "ID": "KPI_NumberRegisteredTaxPayersMonthly",
    "GroupID": "NumberRegisteredTaxPayers",
    "Parameters": [
      {
        "ID": "@NumberOfMonths",
        "Name": "Number of months to show",
        "DefaultValue": "6"
      }
    ]
  },
  {
    "ID": "KPI_TaxToGDPRatioGlobal",
    "GroupID": "TaxToGDPRatio",
    "Parameters": [
      {
        "ID": "@LimitYear",
        "Name": "Last year to process",
        "DefaultValue": "[LASTYEAR]"
      },
      {
        "ID": "@NumberOfYears",
        "Name": "Number of years to show",
        "DefaultValue": "5"
      }
    ]
  },
  {
    "ID": "KPI_TaxToGDPRatioByRegion",
    "GroupID": "TaxToGDPRatio",
    "Parameters": [
      {
        "ID": "@LimitYear",
        "Name": "Last year to process",
        "DefaultValue": "[LASTYEAR]"
      },
      {
        "ID": "@NumberOfYears",
        "Name": "Number of years to show",
        "DefaultValue": "5"
      }
    ]
  },
  {
    "ID": "KPI_PercentActiveTaxpayersFilingYearly",
    "GroupID": "PercentActiveTaxpayersFiling",
    "Parameters": [
      {
        "ID": "@LimitYear",
        "Name": "Last year to process",
        "DefaultValue": "[LASTYEAR]"
      },
      {
        "ID": "@NumberOfYears",
        "Name": "Number of years to show",
        "DefaultValue": "5"
      }
    ]
  },
  {
    "ID": "KPI_PercentActiveTaxpayersFilingMonthly",
    "GroupID": "PercentActiveTaxpayersFiling",
    "Parameters": [
      {
        "ID": "@NumberOfMonths",
        "Name": "Number of months to show",
        "DefaultValue": "6"
      }
    ]
  },
  {
    "ID": "KPI_TotalTaxCollectedByTypeOfTaxYearly",
    "GroupID": "TotalTaxCollected",
    "Parameters": [
      {
        "ID": "@LimitYear",
        "Name": "Last year to process",
        "DefaultValue": "[LASTYEAR]"
      },
      {
        "ID": "@NumberOfYears",
        "Name": "Number of years to show",
        "DefaultValue": "5"
      }
    ]
  },
  {
    "ID": "KPI_TotalTaxCollectedByTypeOfTaxMonthly",
    "GroupID": "TotalTaxCollected",
    "Parameters": [
      {
        "ID": "@NumberOfMonths",
        "Name": "Number of months to show",
        "DefaultValue": "6"
      }
    ]
  },
  {
    "ID": "KPI_TotalTaxCollectedByTaxpayerSegmentYearly",
    "GroupID": "TotalTaxCollected",
    "Parameters": [
      {
        "ID": "@LimitYear",
        "Name": "Last year to process",
        "DefaultValue": "[LASTYEAR]"
      },
      {
        "ID": "@NumberOfYears",
        "Name": "Number of years to show",
        "DefaultValue": "5"
      }
    ]
  },
  {
    "ID": "KPI_TotalTaxCollectedByTaxpayerSegmentMonthly",
    "GroupID": "TotalTaxCollected",
    "Parameters": [
      {
        "ID": "@NumberOfMonths",
        "Name": "Number of months to show",
        "DefaultValue": "6"
      }
    ]
  }
]
