[
  {
    "ID": "KPI_FinesAndPenaltiesFromRevenueMonth",
    "GroupID": "FinesAndPenaltiesFromRevenue",
    "Parameters": [
      {
        "ID": "@NumberOfMonths",
        "Name": "Number of months to show",
        "DefaultValue": "6"
      }
    ]
  },
  {
    "ID": "KPI_FinesAndPenaltiesFromRevenueYear",
    "GroupID": "FinesAndPenaltiesFromRevenue",
    "Parameters": [
      {
        "ID": "@LimitYear",
        "Name": "Last year to process",
        "DefaultValue": "[LASTYEAR]"
      },
      {
        "ID": "@NumberOfYears",
        "Name": "Number of years to show",
        "DefaultValue": "5"
      }
    ]
  },
  {
    "ID": "KPI_VATToGDPRatioGlobal",
    "GroupID": "VATToGDPRatio",
    "Parameters": [
      {
        "ID": "@LimitYear",
        "Name": "Last year to process",
        "DefaultValue": "[LASTYEAR]"
      },
      {
        "ID": "@NumberOfYears",
        "Name": "Number of years to show",
        "DefaultValue": "5"
      }
    ]
  },
  {
    "ID": "KPI_VATToGDPRatioByRegion",
    "GroupID": "VATToGDPRatio",
    "Parameters": [
      {
        "ID": "@LimitYear",
        "Name": "Last year to process",
        "DefaultValue": "[LASTYEAR]"
      },
      {
        "ID": "@NumberOfYears",
        "Name": "Number of years to show",
        "DefaultValue": "5"
      }
    ]
  },
  {
    "ID": "KPI_NewRegistrantsYearly",
    "GroupID": "NewRegistrants",
    "Parameters": [
      {
        "ID": "@LimitYear",
        "Name": "Last year to process",
        "DefaultValue": "[LASTYEAR]"
      },
      {
        "ID": "@NumberOfYears",
        "Name": "Number of years to show",
        "DefaultValue": "5"
      }
    ]
  },
  {
    "ID": "KPI_NewRegistrantsMonthly",
    "GroupID": "NewRegistrants",
    "Parameters": [
      {
        "ID": "@NumberOfMonths",
        "Name": "Number of months to show",
        "DefaultValue": "6"
      }
    ]
  },
  {
    "ID": "KPI_PercentActiveTaxpayersFilingYearly",
    "GroupID": "PercentActiveTaxpayersFiling",
    "Parameters": [
      {
        "ID": "@LimitYear",
        "Name": "Last year to process",
        "DefaultValue": "[LASTYEAR]"
      },
      {
        "ID": "@NumberOfYears",
        "Name": "Number of years to show",
        "DefaultValue": "5"
      }
    ]
  },
  {
    "ID": "KPI_PercentActiveTaxpayersFilingMonthly",
    "GroupID": "PercentActiveTaxpayersFiling",
    "Parameters": [
      {
        "ID": "@NumberOfMonths",
        "Name": "Number of months to show",
        "DefaultValue": "6"
      }
    ]
  },
  {
    "ID": "KPI_StopFilersRatioByTaxTypeYearly",
    "GroupID": "StopFilersRatioByTaxType",
    "Parameters": [
      {
        "ID": "@LimitYear",
        "Name": "Last year to process",
        "DefaultValue": "[LASTYEAR]"
      },
      {
        "ID": "@NumberOfYears",
        "Name": "Number of years to show",
        "DefaultValue": "5"
      }
    ]
  },
  {
    "ID": "KPI_FilingRatioByTaxTypeYearly",
    "GroupID": "FilingRatio",
    "Parameters": [
      {
        "ID": "@LimitYear",
        "Name": "Last year to process",
        "DefaultValue": "[LASTYEAR]"
      },
      {
        "ID": "@NumberOfYears",
        "Name": "Number of years to show",
        "DefaultValue": "5"
      }
    ]
  },
  {
    "ID": "KPI_ElectronicFilingRatioYearly",
    "GroupID": "ElectronicFilingRatio",
    "Parameters": [
      {
        "ID": "@LimitYear",
        "Name": "Last year to process",
        "DefaultValue": "[LASTYEAR]"
      },
      {
        "ID": "@NumberOfYears",
        "Name": "Number of years to show",
        "DefaultValue": "5"
      }
    ]
  },
  {
    "ID": "KPI_ElectronicPaymentForTaxReturnRatioYearly",
    "GroupID": "ElectronicPaymentForTaxReturnRatio",
    "Parameters": [
      {
        "ID": "@LimitYear",
        "Name": "Last year to process",
        "DefaultValue": "[LASTYEAR]"
      },
      {
        "ID": "@NumberOfYears",
        "Name": "Number of years to show",
        "DefaultValue": "5"
      }
    ]
  },
  {
    "ID": "KPI_ReturnsProcessedByTaxTypeYearly",
    "GroupID": "ReturnsProcessed",
    "Parameters": [
      {
        "ID": "@LimitYear",
        "Name": "Last year to process",
        "DefaultValue": "[LASTYEAR]"
      },
      {
        "ID": "@NumberOfYears",
        "Name": "Number of years to show",
        "DefaultValue": "5"
      }
    ]
  },
  {
    "ID": "KPI_TotalTaxCollectedByTypeOfTaxYearly",
    "GroupID": "TotalTaxCollected",
    "Parameters": [
      {
        "ID": "@LimitYear",
        "Name": "Last year to process",
        "DefaultValue": "[LASTYEAR]"
      },
      {
        "ID": "@NumberOfYears",
        "Name": "Number of years to show",
        "DefaultValue": "5"
      }
    ]
  },
  {
    "ID": "KPI_TotalTaxCollectedByTypeOfTaxMonthly",
    "GroupID": "TotalTaxCollected",
    "Parameters": [
      {
        "ID": "@NumberOfMonths",
        "Name": "Number of months to show",
        "DefaultValue": "6"
      }
    ]
  },
  {
    "ID": "KPI_TotalTaxCollectedByTaxpayerSegmentYearly",
    "GroupID": "TotalTaxCollected",
    "Parameters": [
      {
        "ID": "@LimitYear",
        "Name": "Last year to process",
        "DefaultValue": "[LASTYEAR]"
      },
      {
        "ID": "@NumberOfYears",
        "Name": "Number of years to show",
        "DefaultValue": "5"
      }
    ]
  },
  {
    "ID": "KPI_TotalTaxCollectedByTaxpayerSegmentMonthly",
    "GroupID": "TotalTaxCollected",
    "Parameters": [
      {
        "ID": "@NumberOfMonths",
        "Name": "Number of months to show",
        "DefaultValue": "6"
      }
    ]
  },
  {
    "ID": "KPI_RefundClaimsRequestedByTaxTypeYearly",
    "GroupID": "RefundClaimsRequested",
    "Parameters": [
      {
        "ID": "@LimitYear",
        "Name": "Last year to process",
        "DefaultValue": "[LASTYEAR]"
      },
      {
        "ID": "@NumberOfYears",
        "Name": "Number of years to show",
        "DefaultValue": "5"
      }
    ]
  },
  {
    "ID": "KPI_RefundClaimsRequestedByTaxTypeMonthly",
    "GroupID": "RefundClaimsRequested",
    "Parameters": [
      {
        "ID": "@NumberOfMonths",
        "Name": "Number of months to show",
        "DefaultValue": "6"
      }
    ]
  },
  {
    "ID": "KPI_PercentageRefundClaimsProcessedByTaxTypeYearly",
    "GroupID": "PercentageRefundClaimsProcessed",
    "Parameters": [
      {
        "ID": "@LimitYear",
        "Name": "Last year to process",
        "DefaultValue": "[LASTYEAR]"
      },
      {
        "ID": "@NumberOfYears",
        "Name": "Number of years to show",
        "DefaultValue": "5"
      }
    ]
  },
  {
    "ID": "KPI_PercentageRefundClaimsProcessedByTaxTypeMonthly",
    "GroupID": "PercentageRefundClaimsProcessed",
    "Parameters": [
      {
        "ID": "@NumberOfMonths",
        "Name": "Number of months to show",
        "DefaultValue": "6"
      }
    ]
  },
  {
    "ID": "KPI_RefundAmountIssuedByTaxTypeYearly",
    "GroupID": "RefundAmountIssued",
    "Parameters": [
      {
        "ID": "@LimitYear",
        "Name": "Last year to process",
        "DefaultValue": "[LASTYEAR]"
      },
      {
        "ID": "@NumberOfYears",
        "Name": "Number of years to show",
        "DefaultValue": "5"
      }
    ]
  },
  {
    "ID": "KPI_RefundAmountIssuedByTaxTypeMonthly",
    "GroupID": "RefundAmountIssued",
    "Parameters": [
      {
        "ID": "@NumberOfMonths",
        "Name": "Number of months to show",
        "DefaultValue": "6"
      }
    ]
  },
  {
    "ID": "KPI_AdditionalTaxLiabilitiesResultingFromAllTaxAuditsYearly",
    "GroupID": "AdditionalTaxLiabilitiesResultingFromAllTaxAudits",
    "Parameters": [
      {
        "ID": "@LimitYear",
        "Name": "Last year to process",
        "DefaultValue": "[LASTYEAR]"
      },
      {
        "ID": "@NumberOfYears",
        "Name": "Number of years to show",
        "DefaultValue": "5"
      }
    ]
  },
  {
    "ID": "KPI_AdditionalTaxLiabilitiesResultingFromAllTaxAuditsByTaxPayerSegmentYearly",
    "GroupID": "AdditionalTaxLiabilitiesResultingFromAllTaxAudits",
    "Parameters": [
      {
        "ID": "@LimitYear",
        "Name": "Last year to process",
        "DefaultValue": "[LASTYEAR]"
      },
      {
        "ID": "@NumberOfYears",
        "Name": "Number of years to show",
        "DefaultValue": "5"
      }
    ]
  },
  {
    "ID": "KPI_InitialStockInNumberOfAppealsCasesYearly",
    "GroupID": "InitialStockInNumberOfAppealsCases",
    "Parameters": [
      {
        "ID": "@LimitYear",
        "Name": "Last year to process",
        "DefaultValue": "[LASTYEAR]"
      },
      {
        "ID": "@NumberOfYears",
        "Name": "Number of years to show",
        "DefaultValue": "5"
      }
    ]
  },
  {
    "ID": "KPI_InitialStockInNumberOfAppealsCasesByTaxPayerSegmentYearly",
    "GroupID": "InitialStockInNumberOfAppealsCases",
    "Parameters": [
      {
        "ID": "@LimitYear",
        "Name": "Last year to process",
        "DefaultValue": "[LASTYEAR]"
      },
      {
        "ID": "@NumberOfYears",
        "Name": "Number of years to show",
        "DefaultValue": "5"
      }
    ]
  },
  {
    "ID": "KPI_InitialStockInAmountForAppealsCasesYearly",
    "GroupID": "InitialStockInAmountForAppealsCases",
    "Parameters": [
      {
        "ID": "@LimitYear",
        "Name": "Last year to process",
        "DefaultValue": "[LASTYEAR]"
      },
      {
        "ID": "@NumberOfYears",
        "Name": "Number of years to show",
        "DefaultValue": "5"
      }
    ]
  },
  {
    "ID": "KPI_InitialStockInAmountForAppealsCasesByTaxPayerSegmentYearly",
    "GroupID": "InitialStockInAmountForAppealsCases",
    "Parameters": [
      {
        "ID": "@LimitYear",
        "Name": "Last year to process",
        "DefaultValue": "[LASTYEAR]"
      },
      {
        "ID": "@NumberOfYears",
        "Name": "Number of years to show",
        "DefaultValue": "5"
      }
    ]
  },
  {
    "ID": "KPI_NumberTaxAppealsCasesSubmittedYearly",
    "GroupID": "NumberTaxAppealsCasesSubmitted",
    "Parameters": [
      {
        "ID": "@LimitYear",
        "Name": "Last year to process",
        "DefaultValue": "[LASTYEAR]"
      },
      {
        "ID": "@NumberOfYears",
        "Name": "Number of years to show",
        "DefaultValue": "5"
      }
    ]
  },
  {
    "ID": "KPI_NumberTaxAppealsCasesSubmittedMonthly",
    "GroupID": "NumberTaxAppealsCasesSubmitted",
    "Parameters": [
      {
        "ID": "@NumberOfMonths",
        "Name": "Number of months to show",
        "DefaultValue": "6"
      }
    ]
  },
  {
    "ID": "KPI_NumberTaxAppealsCasesSubmittedByTaxTypeYearly",
    "GroupID": "NumberTaxAppealsCasesSubmitted",
    "Parameters": [
      {
        "ID": "@LimitYear",
        "Name": "Last year to process",
        "DefaultValue": "[LASTYEAR]"
      },
      {
        "ID": "@NumberOfYears",
        "Name": "Number of years to show",
        "DefaultValue": "5"
      }
    ]
  },
  {
    "ID": "KPI_NumberTaxAppealsCasesSubmittedByTaxTypeMonthly",
    "GroupID": "NumberTaxAppealsCasesSubmitted",
    "Parameters": [
      {
        "ID": "@NumberOfMonths",
        "Name": "Number of months to show",
        "DefaultValue": "6"
      }
    ]
  },
  {
    "ID": "KPI_NumberTaxAppealsCasesSubmittedByTaxPayerSegmentMonthly",
    "GroupID": "NumberTaxAppealsCasesSubmitted",
    "Parameters": [
      {
        "ID": "@NumberOfMonths",
        "Name": "Number of months to show",
        "DefaultValue": "6"
      }
    ]
  },
  {
    "ID": "KPI_NumberTaxAppealsCasesSubmittedByTaxPayerSegmentYearly",
    "GroupID": "NumberTaxAppealsCasesSubmitted",
    "Parameters": [
      {
        "ID": "@LimitYear",
        "Name": "Last year to process",
        "DefaultValue": "[LASTYEAR]"
      },
      {
        "ID": "@NumberOfYears",
        "Name": "Number of years to show",
        "DefaultValue": "5"
      }
    ]
  },
  {
    "ID": "KPI_NumberTaxAppealsCasesResolvedYearly",
    "GroupID": "NumberTaxAppealsCasesResolved",
    "Parameters": [
      {
        "ID": "@LimitYear",
        "Name": "Last year to process",
        "DefaultValue": "[LASTYEAR]"
      },
      {
        "ID": "@NumberOfYears",
        "Name": "Number of years to show",
        "DefaultValue": "5"
      }
    ]
  },
  {
    "ID": "KPI_NumberTaxAppealsCasesResolvedByTaxTypeYearly",
    "GroupID": "NumberTaxAppealsCasesResolved",
    "Parameters": [
      {
        "ID": "@LimitYear",
        "Name": "Last year to process",
        "DefaultValue": "[LASTYEAR]"
      },
      {
        "ID": "@NumberOfYears",
        "Name": "Number of years to show",
        "DefaultValue": "5"
      }
    ]
  },
  {
    "ID": "KPI_NumberTaxAppealsCasesResolvedByTaxPayerSegmentYearly",
    "GroupID": "NumberTaxAppealsCasesResolved",
    "Parameters": [
      {
        "ID": "@LimitYear",
        "Name": "Last year to process",
        "DefaultValue": "[LASTYEAR]"
      },
      {
        "ID": "@NumberOfYears",
        "Name": "Number of years to show",
        "DefaultValue": "5"
      }
    ]
  },
  {
    "ID": "KPI_ValueTaxAppealsCasesSubmittedYearly",
    "GroupID": "ValueTaxAppealsCasesSubmitted",
    "Parameters": [
      {
        "ID": "@LimitYear",
        "Name": "Last year to process",
        "DefaultValue": "[LASTYEAR]"
      },
      {
        "ID": "@NumberOfYears",
        "Name": "Number of years to show",
        "DefaultValue": "5"
      }
    ]
  },
  {
    "ID": "KPI_ValueTaxAppealsCasesSubmittedMonthly",
    "GroupID": "ValueTaxAppealsCasesSubmitted",
    "Parameters": [
      {
        "ID": "@NumberOfMonths",
        "Name": "Number of months to show",
        "DefaultValue": "6"
      }
    ]
  },
  {
    "ID": "KPI_ValueTaxAppealsCasesSubmittedByTaxTypeYearly",
    "GroupID": "ValueTaxAppealsCasesSubmitted",
    "Parameters": [
      {
        "ID": "@LimitYear",
        "Name": "Last year to process",
        "DefaultValue": "[LASTYEAR]"
      },
      {
        "ID": "@NumberOfYears",
        "Name": "Number of years to show",
        "DefaultValue": "5"
      }
    ]
  },
  {
    "ID": "KPI_ValueTaxAppealsCasesSubmittedByTaxTypeMonthly",
    "GroupID": "ValueTaxAppealsCasesSubmitted",
    "Parameters": [
      {
        "ID": "@NumberOfMonths",
        "Name": "Number of months to show",
        "DefaultValue": "6"
      }
    ]
  },
  {
    "ID": "KPI_ValueTaxAppealsCasesSubmittedByTaxPayerSegmentMonthly",
    "GroupID": "ValueTaxAppealsCasesSubmitted",
    "Parameters": [
      {
        "ID": "@NumberOfMonths",
        "Name": "Number of months to show",
        "DefaultValue": "6"
      }
    ]
  },
  {
    "ID": "KPI_ValueTaxAppealsCasesSubmittedByTaxPayerSegmentYearly",
    "GroupID": "ValueTaxAppealsCasesSubmitted",
    "Parameters": [
      {
        "ID": "@LimitYear",
        "Name": "Last year to process",
        "DefaultValue": "[LASTYEAR]"
      },
      {
        "ID": "@NumberOfYears",
        "Name": "Number of years to show",
        "DefaultValue": "5"
      }
    ]
  },
  {
    "ID": "KPI_ValueTaxAppealsCasesResolvedYearly",
    "GroupID": "ValueTaxAppealsCasesResolved",
    "Parameters": [
      {
        "ID": "@LimitYear",
        "Name": "Last year to process",
        "DefaultValue": "[LASTYEAR]"
      },
      {
        "ID": "@NumberOfYears",
        "Name": "Number of years to show",
        "DefaultValue": "5"
      }
    ]
  },
  {
    "ID": "KPI_ValueTaxAppealsCasesResolvedMonthly",
    "GroupID": "ValueTaxAppealsCasesResolved",
    "Parameters": [
      {
        "ID": "@NumberOfMonths",
        "Name": "Number of months to show",
        "DefaultValue": "6"
      }
    ]
  },
  {
    "ID": "KPI_ValueTaxAppealsCasesResolvedByTaxTypeYearly",
    "GroupID": "ValueTaxAppealsCasesResolved",
    "Parameters": [
      {
        "ID": "@LimitYear",
        "Name": "Last year to process",
        "DefaultValue": "[LASTYEAR]"
      },
      {
        "ID": "@NumberOfYears",
        "Name": "Number of years to show",
        "DefaultValue": "5"
      }
    ]
  },
  {
    "ID": "KPI_ValueTaxAppealsCasesResolvedByTaxTypeMonthly",
    "GroupID": "ValueTaxAppealsCasesResolved",
    "Parameters": [
      {
        "ID": "@NumberOfMonths",
        "Name": "Number of months to show",
        "DefaultValue": "6"
      }
    ]
  },
  {
    "ID": "KPI_ValueTaxAppealsCasesResolvedByTaxPayerSegmentMonthly",
    "GroupID": "ValueTaxAppealsCasesResolved",
    "Parameters": [
      {
        "ID": "@NumberOfMonths",
        "Name": "Number of months to show",
        "DefaultValue": "6"
      }
    ]
  },
  {
    "ID": "KPI_ValueTaxAppealsCasesResolvedByTaxPayerSegmentYearly",
    "GroupID": "ValueTaxAppealsCasesResolved",
    "Parameters": [
      {
        "ID": "@LimitYear",
        "Name": "Last year to process",
        "DefaultValue": "[LASTYEAR]"
      },
      {
        "ID": "@NumberOfYears",
        "Name": "Number of years to show",
        "DefaultValue": "5"
      }
    ]
  },
  {
    "ID": "KPI_InitialStockInNumberOfArrearsCasesYearly",
    "GroupID": "InitialStockInNumberOfArrearsCases",
    "Parameters": [
      {
        "ID": "@LimitYear",
        "Name": "Last year to process",
        "DefaultValue": "[LASTYEAR]"
      },
      {
        "ID": "@NumberOfYears",
        "Name": "Number of years to show",
        "DefaultValue": "5"
      }
    ]
  },
  {
    "ID": "KPI_InitialStockInNumberOfArrearsCasesByTaxPayerSegmentYearly",
    "GroupID": "InitialStockInNumberOfArrearsCases",
    "Parameters": [
      {
        "ID": "@LimitYear",
        "Name": "Last year to process",
        "DefaultValue": "[LASTYEAR]"
      },
      {
        "ID": "@NumberOfYears",
        "Name": "Number of years to show",
        "DefaultValue": "5"
      }
    ]
  },
  {
    "ID": "KPI_InitialStockInAmountForArrearsCasesYearly",
    "GroupID": "InitialStockInAmountForArrearsCases",
    "Parameters": [
      {
        "ID": "@LimitYear",
        "Name": "Last year to process",
        "DefaultValue": "[LASTYEAR]"
      },
      {
        "ID": "@NumberOfYears",
        "Name": "Number of years to show",
        "DefaultValue": "5"
      }
    ]
  },
  {
    "ID": "KPI_InitialStockInAmountForArrearsCasesByTaxPayerSegmentYearly",
    "GroupID": "InitialStockInAmountForArrearsCases",
    "Parameters": [
      {
        "ID": "@LimitYear",
        "Name": "Last year to process",
        "DefaultValue": "[LASTYEAR]"
      },
      {
        "ID": "@NumberOfYears",
        "Name": "Number of years to show",
        "DefaultValue": "5"
      }
    ]
  },
  {
    "ID": "KPI_NumberTaxArrearsCasesGeneratedYearly",
    "GroupID": "NumberTaxArrearsCasesGenerated",
    "Parameters": [
      {
        "ID": "@LimitYear",
        "Name": "Last year to process",
        "DefaultValue": "[LASTYEAR]"
      },
      {
        "ID": "@NumberOfYears",
        "Name": "Number of years to show",
        "DefaultValue": "5"
      }
    ]
  },
  {
    "ID": "KPI_NumberTaxArrearsCasesGeneratedMonthly",
    "GroupID": "NumberTaxArrearsCasesGenerated",
    "Parameters": [
      {
        "ID": "@NumberOfMonths",
        "Name": "Number of months to show",
        "DefaultValue": "6"
      }
    ]
  },
  {
    "ID": "KPI_NumberTaxArrearsCasesGeneratedByTaxTypeYearly",
    "GroupID": "NumberTaxArrearsCasesGenerated",
    "Parameters": [
      {
        "ID": "@LimitYear",
        "Name": "Last year to process",
        "DefaultValue": "[LASTYEAR]"
      },
      {
        "ID": "@NumberOfYears",
        "Name": "Number of years to show",
        "DefaultValue": "5"
      }
    ]
  },
  {
    "ID": "KPI_NumberTaxArrearsCasesGeneratedByTaxTypeMonthly",
    "GroupID": "NumberTaxArrearsCasesGenerated",
    "Parameters": [
      {
        "ID": "@NumberOfMonths",
        "Name": "Number of months to show",
        "DefaultValue": "6"
      }
    ]
  },
  {
    "ID": "KPI_NumberTaxArrearsCasesGeneratedByTaxPayerSegmentMonthly",
    "GroupID": "NumberTaxArrearsCasesGenerated",
    "Parameters": [
      {
        "ID": "@NumberOfMonths",
        "Name": "Number of months to show",
        "DefaultValue": "6"
      }
    ]
  },
  {
    "ID": "KPI_NumberTaxArrearsCasesGeneratedByTaxPayerSegmentYearly",
    "GroupID": "NumberTaxArrearsCasesGenerated",
    "Parameters": [
      {
        "ID": "@LimitYear",
        "Name": "Last year to process",
        "DefaultValue": "[LASTYEAR]"
      },
      {
        "ID": "@NumberOfYears",
        "Name": "Number of years to show",
        "DefaultValue": "5"
      }
    ]
  },
  {
    "ID": "KPI_PercentTaxAuditsResultedInAdditionalTaxLiabilitiesYearly",
    "GroupID": "PercentTaxAuditsResultedInAdditionalTaxLiabilities",
    "Parameters": [
      {
        "ID": "@LimitYear",
        "Name": "Last year to process",
        "DefaultValue": "[LASTYEAR]"
      },
      {
        "ID": "@NumberOfYears",
        "Name": "Number of years to show",
        "DefaultValue": "5"
      }
    ]
  }
]