<?xml version="1.0" encoding="UTF-8" standalone="no"?> <svg width="512" height="512" viewBox="0 0 512 512" fill="none" xmlns="http://www.w3.org/2000/svg">
<path fill-rule="evenodd" clip-rule="evenodd" d="M479.999 256C479.999 379.711 379.711 479.999 256 479.999C132.288 479.999 32 379.711 32 256C32 132.288 132.288 32 256 32C379.711 32 479.999 132.288 479.999 256Z" fill="#2A2FAF"/>
<path fill-rule="evenodd" clip-rule="evenodd" d="M412.753 95.9999H99.2188C139.62 56.41 194.952 32 255.986 32C317.02 32 372.352 56.41 412.753 95.9999Z" fill="#E92B2B"/>
<path fill-rule="evenodd" clip-rule="evenodd" d="M458.449 160H53.5625C64.9576 136.013 80.4905 114.372 99.2388 96H412.773C431.521 114.372 447.054 136.013 458.449 160Z" fill="#FBFBFB"/>
<path fill-rule="evenodd" clip-rule="evenodd" d="M408.819 419.765C368.796 457.132 315.062 480 255.988 480C196.913 480 143.179 457.132 103.156 419.765H408.819Z" fill="#E92B2B"/>
<path fill-rule="evenodd" clip-rule="evenodd" d="M103.175 419.764C82.6592 400.61 65.7459 377.646 53.5625 352H458.448C446.265 377.646 429.352 400.61 408.836 419.764H103.175Z" fill="#FBFBFB"/>
</svg>
