{
	"id": "3d153d07-3469-4896-9c16-045f1d3e84df",
	"name": "beginner_nest10",
	"values": [
		{
			"key": "host",
			"value": "http://localhost:8080",
			"type": "default",
			"enabled": true
		},
		{
			"key": "path",
			"value": "/api/",
			"type": "default",
			"enabled": true
		}
	],
	"_postman_variable_scope": "environment",
	"_postman_exported_at": "2024-12-26T02:34:44.462Z",
	"_postman_exported_using": "Postman/11.23.3"
}