id,name,model_id:id,group_id:id,perm_read,perm_write,perm_create,perm_unlink
access_subscription_portal,access_subscription_portal,subscription_oca.model_sale_subscription,base.group_portal,1,0,0,0
access_subscription_line_portal,access_subscription_line_portal,subscription_oca.model_sale_subscription_line,base.group_portal,1,0,0,0
access_subscription_template_portal,access_subscription_template_portal,subscription_oca.model_sale_subscription_template,base.group_portal,1,0,0,0
access_subscription_stage_portal,access_subscription_stage_portal,subscription_oca.model_sale_subscription_stage,base.group_portal,1,0,0,0
