{
  "inherit": true,
  "version": "0.1.1",
  "release": {
    "name": "Pipeline testing",
    "tag_name": "0.1.1",
    "description": "Resolve package download issues with using custom config files and referencing other modules.",
    "milestones": [],
    "assets": {
      "links": []
    }
  }
}
