<svg xmlns="http://www.w3.org/2000/svg" width="70" height="70" viewBox="0 0 70 70">
  <g id="Group_63" data-name="Group 63" transform="translate(-1279 -1281)">
    <rect id="Rectangle_262" data-name="Rectangle 262" width="70" height="70" transform="translate(1279 1281)" fill="#fff"/>
    <g id="役所_官庁の無料アイコン素材_1" data-name="役所・官庁の無料アイコン素材 1" transform="translate(1289.474 1294.058)">
      <path id="Path_9" data-name="Path 9" d="M282.266,32.213V28.755l0-1.068h0v-.016c-2.775.875-4.364-1.429-8.034-.586,0,2.284,0,3.422,0,5.711C277.9,31.4,279.491,33.492,282.266,32.213Z" transform="translate(-248.204 -23.62)" fill="#5f5045"/>
      <path id="Path_10" data-name="Path 10" d="M43.751,64.012V36.539a.375.375,0,0,0-.375-.375H36.625V32.478H24.854V24.81H23.74v7.668H11.969v3.686H5.218a.375.375,0,0,0-.375.375V64.012H0v4.683H6.036l14.885-2.3h6.752l14.885,2.3h6.037V64.012ZM18.935,41.294h2.941v3.845H18.935Zm-4.84,18.6H11.154V56.046H14.1Zm0-7.376H11.154V48.67H14.1Zm0-7.376H11.154V41.294H14.1Zm4.84,3.531h2.941v3.845H18.935Zm9.887,14.192H19.77V56.046h9.052Zm.836-10.347H26.717V48.67h2.941Zm0-7.376H26.717V41.294h2.941ZM37.44,59.891H34.5V56.046H37.44Zm0-7.376H34.5V48.67H37.44Zm0-7.376H34.5V41.294H37.44Z" transform="translate(0 -24.81)" fill="#5f5045"/>
    </g>
  </g>
</svg>
