{
  "id": 123456789101112,
  "iid": 1676741,
  "project_id": 278964,
  "sha": "45bd87fd14fd0f6571e4d73f07c19bac4a600d6f",
  "ref": "refs/merge-requests/114366/merge",
  "status": "success",
  "source": "merge_request_event",
  "created_at": "2023-06-08T01:05:18.672Z",
  "updated_at": "2023-06-08T06:34:39.520Z",
  "web_url": "https://gitlab.com/gitlab-org/gitlab/-/pipelines/893163981"
}
