module clean-architecture-go

go 1.15

require (
	github.com/labstack/echo/v4 v4.1.17
	go.uber.org/zap v1.16.0
	golang.org/x/crypto v0.0.0-20201012173705-84dcc777aaee // indirect
	gorm.io/driver/postgres v1.0.2
	gorm.io/gorm v1.20.2
)
