{
  "name": "RequestError",
  "code": "ENOTFOUND",
  "hostname": "nowhere.example.com",
  "method": "GET",
  "path": "/err",
  "protocol": "https:",
  "url": "https://nowhere.example.com/err",
  "gotOptions": {
    "path": "/err",
    "protocol": "https:",
    "hostname": "nowhere.example.com",
    "hash": "",
    "search": "",
    "pathname": "/err",
    "href": "https://nowhere.example.com/err",
    "retry": {
      "methods": {},
      "statusCodes": {},
      "errorCodes": {}
    },
    "headers": {
      "user-agent": "https://github.com/singapore/gl-got",
      "accept": "application/json",
      "accept-encoding": "gzip, deflate",
      "PRIVATE-TOKEN": "<private-token>"
    },
    "hooks": {
      "beforeRequest": [],
      "beforeRedirect": [],
      "beforeRetry": [],
      "afterResponse": []
    },
    "decompress": true,
    "throwHttpErrors": true,
    "followRedirect": true,
    "stream": false,
    "form": false,
    "json": true,
    "cache": false,
    "useElectronNet": false,
    "token": "<private-token>",
    "baseUrl": "https://gitlab.com/api/v4/",
    "method": "GET",
    "forceRefresh": true
  }
}
