{
  "plugins": ["plugins/markdown"],
  "recurseDepth": 10,
  "source": {
    "excludePattern": "(^|\\/|\\\\)_"
  },
  "sourceType": "module",
  "tags": {
    "allowUnknownTags": true,
    "dictionaries": ["jsdoc"]
  },
  "templates": {
    "cleverLinks": true,
    "monospaceLinks": false
  }
}
