// Jest Snapshot v1, https://goo.gl/fbAQLP

exports[`CartItem testing snapshot should CartItem match snapshot 1`] = `
<DocumentFragment>
  <div
    class="cartItem"
  >
    <div
      class="imgWrapper"
    >
      <img
        alt="Костюм топ + шорти"
        class="itemAvatar"
        src="./img/1.jpg"
      />
    </div>
    <p
      class="quantity"
    >
      0
    </p>
    <div
      class="btnCart"
    >
      <button
        class="btn"
        style="background-color: rgb(255, 77, 77);"
        type="button"
      >
        +
      </button>
      <button
        class="btn"
        style="background-color: rgb(255, 77, 77);"
        type="button"
      >
         – 
      </button>
      <button
        style="border-radius: 5px; border: 1px solid #ff4d4d; cursor: pointer;"
      >
        <img
          alt="delete"
          src="delete.svg"
        />
      </button>
    </div>
  </div>
</DocumentFragment>
`;
