%YAML 1.1
%TAG !u! tag:unity3d.com,2011:
--- !u!114 &11400000
MonoBehaviour:
  m_ObjectHideFlags: 0
  m_CorrespondingSourceObject: {fileID: 0}
  m_PrefabInstance: {fileID: 0}
  m_PrefabAsset: {fileID: 0}
  m_GameObject: {fileID: 0}
  m_Enabled: 1
  m_EditorHideFlags: 0
  m_Script: {fileID: 11500000, guid: 4f73a8de52be40e6a659d478d6259aa0, type: 3}
  m_Name: Config
  m_EditorClassIdentifier: 
  targetResourceType: 0
  title: Tutorial|MINE_WOOD
  icon: {fileID: 21300000, guid: b58cbbbf2f7cb4cf7a676c2ea467803e, type: 3}
