"t";"l_speed";"f_dist";"f_speed"
0.0019915103912353516;40;"";""
0.03842759132385254;40;"190";" 50"
0.056275367736816406;40;"190";" 50"
0.07967185974121094;40;"190";" 50"
0.10275840759277344;40;"190";" 50"
0.11315083503723145;40;"190";" 50"
0.14797091484069824;40;"190";" 50"
0.14996576309204102;40;"195";" 50"
0.1579437255859375;40;"199";" 50"
0.19575285911560059;40;"199";" 50"
0.19826459884643555;40;"203";" 50"
0.24651145935058594;40;"199";" 50"
0.24950361251831055;40;"195";" 50"
0.2514979839324951;40;"191";" 50"
0.30492687225341797;40;"191";" 50"
0.30692148208618164;40;"191";" 50"
0.30991649627685547;40;"191";" 50"
0.326401948928833;40;"191";" 50"
0.35097336769104004;40;"191";" 50"
0.3519713878631592;40;"191";" 50"
0.39659595489501953;40;"191";" 50"
0.39759302139282227;40;"191";" 50"
0.40660905838012695;40;"191";" 50"
0.4495537281036377;40;"191";" 50"
0.45055103302001953;40;"191";" 50"
0.46466827392578125;40;"191";" 50"
0.513209342956543;40;"191";" 50"
0.5142078399658203;40;"191";" 50"
0.5152068138122559;40;"191";" 50"
0.5317621231079102;40;"189";" 50"
0.5551588535308838;40;"189";" 50"
0.5731611251831055;40;"189";" 50"
0.6033420562744141;40;"189";" 50"
0.6301813125610352;40;"184";" 50"
0.652468204498291;40;"184";" 50"
0.7056825160980225;40;"184";" 50"
0.7066795825958252;40;"184";" 50"
0.7086782455444336;40;"184";" 50"
0.7109935283660889;40;"185";" 50"
0.7586913108825684;40;"185";" 50"
0.7606854438781738;40;"185";" 50"
0.7706747055053711;40;"185";" 50"
0.8016445636749268;40;"185";" 50"
0.8026273250579834;40;"183";" 50"
0.8602321147918701;40;"183";" 50"
0.8652231693267822;40;"183";" 50"
0.8761847019195557;40;"184";" 50"
0.8972854614257812;40;"183";" 50"
0.9040052890777588;40;"183";" 50"
0.9456930160522461;40;"183";" 50"
0.9466955661773682;40;"181";" 50"
0.9605860710144043;40;"181";" 50"
0.9925599098205566;40;"181";" 50"
0.9925599098205566;40;"181";" 50"
1.0406088829040527;40;"181";" 50"
1.0426063537597656;40;"179";" 50"
1.0455234050750732;40;"183";" 50"
1.0864698886871338;40;"179";" 50"
1.0874671936035156;40;"179";" 50"
1.1012933254241943;40;"179";" 50"
1.129258394241333;40;"179";" 50"
1.129258394241333;40;"174";" 50"
1.1510281562805176;40;"174";" 50"
1.1801319122314453;40;"174";" 50"
1.181128978729248;40;"174";" 50"
1.227651596069336;40;"174";" 50"
1.227651596069336;40;"174";" 50"
1.244971513748169;40;"175";" 50"
1.271383285522461;40;"175";" 50"
1.2723793983459473;40;"175";" 50"
1.2906293869018555;40;"175";" 50"
1.3175818920135498;40;"175";" 50"
1.3737843036651611;40;"175";" 50"
1.3737843036651611;40;"173";" 50"
1.3747856616973877;40;"173";" 50"
1.4288146495819092;40;"173";" 50"
1.4298179149627686;40;"173";" 50"
1.4298179149627686;40;"173";" 50"
1.4791457653045654;40;"173";" 50"
1.48114013671875;40;"170";" 50"
1.4831361770629883;40;"170";" 50"
1.4913382530212402;40;"170";" 50"
1.5218803882598877;40;"170";" 50"
1.5218803882598877;40;"170";" 50"
1.575549602508545;40;"170";" 50"
1.5765469074249268;40;"166";" 50"
1.5775437355041504;40;"166";" 50"
1.6293771266937256;40;"166";" 50"
1.6313695907592773;40;"166";" 50"
1.632369041442871;40;"166";" 50"
1.6431190967559814;40;"166";" 50"
1.6800169944763184;40;"166";" 50"
1.6859996318817139;40;"166";" 50"
1.7280879020690918;40;"166";" 50"
1.7310781478881836;40;"166";" 50"
1.7418010234832764;40;"166";" 50"
1.7785158157348633;40;"166";" 50"
1.7795114517211914;40;"166";" 50"
1.784501314163208;40;"166";" 50"
1.8393924236297607;40;"164";" 50"
1.8463733196258545;40;"164";" 50"
1.8523571491241455;40;"164";" 50"
1.860339641571045;40;"164";" 50"
1.8844325542449951;40;"162";" 50"
1.8854331970214844;40;"158";" 50"
1.9295225143432617;40;"158";" 50"
1.9305188655853271;40;"158";" 50"
1.9422626495361328;40;"162";" 50"
1.9866368770599365;40;"158";" 50"
1.9866368770599365;40;"162";" 50"
1.9926793575286865;40;"157";" 50"
2.038984775543213;40;"157";" 50"
2.042151689529419;40;"157";" 50"
2.0910706520080566;40;"157";" 50"
2.093065023422241;40;"157";" 50"
2.099541425704956;40;"158";" 50"
2.133964776992798;40;"154";" 50"
2.1409530639648438;40;"154";" 50"
2.183967351913452;40;"158";" 50"
2.184964895248413;40;"156";" 50"
2.2262701988220215;40;"156";" 50"
2.2270946502685547;40;"156";" 50"
2.2280948162078857;40;"156";" 50"
2.254610538482666;40;"156";" 50"
2.27419114112854;40;"156";" 50"
2.2876529693603516;40;"156";" 50"
2.3248441219329834;40;"156";" 50"
2.3248441219329834;40;"149";" 50"
2.3268375396728516;40;"149";" 0"
2.3779726028442383;40;"149";" 0"
2.3802289962768555;40;"149";" 0"
2.3887572288513184;40;"149";" 0"
2.442981004714966;40;"149";" 0"
2.447014808654785;40;"149";" 0"
2.449007511138916;40;"149";" 0"
2.457984209060669;40;"149";" 0"
2.500481367111206;40;"149";" 0"
2.503462553024292;40;"149";" 0"
2.505460739135742;40;"158";" 50"
2.5238144397735596;40;"157";" 50"
2.556637763977051;40;"157";" 50"
2.557633876800537;40;"158";" 50"
2.600081443786621;40;"164";" 50"
2.6010799407958984;40;"164";" 50"
2.6010799407958984;40;"164";" 50"
2.6218762397766113;40;"166";" 50"
2.6508798599243164;40;"166";" 50"
2.6644177436828613;40;"162";" 50"
2.7123987674713135;40;"162";" 50"
2.716447114944458;40;"157";" 50"
2.720782995223999;40;"157";" 50"
2.7478349208831787;40;"162";" 50"
2.7498323917388916;40;"162";" 50"
2.766293525695801;40;"162";" 50"
2.808077812194824;40;"162";" 50"
2.8100714683532715;40;"162";" 50"
2.813720941543579;40;"162";" 50"
2.863417148590088;40;"158";" 50"
2.8644137382507324;40;"158";" 50"
2.865410566329956;40;"158";" 50"
2.882518768310547;40;"158";" 50"
2.908651113510132;40;"162";" 50"
2.922330856323242;40;"162";" 50"
2.954052448272705;40;"157";" 50"
2.955052614212036;40;"156";" 50"
2.9747254848480225;40;"154";" 50"
3.0097079277038574;40;"154";" 50"
3.0117030143737793;40;"154";" 50"
3.068622350692749;40;"154";" 50"
3.0696232318878174;40;"154";" 50"
3.0696232318878174;40;"154";" 50"
3.116058111190796;40;"154";" 50"
3.1180551052093506;40;"154";" 50"
3.1180551052093506;40;"154";" 50"
3.136974334716797;40;"154";" 50"
3.165315628051758;40;"156";" 50"
3.1663126945495605;40;"156";" 50"
3.2122437953948975;40;"149";" 50"
3.2132439613342285;40;"149";" 0"
3.2218568325042725;40;"154";" 0"
3.255154848098755;40;"149";" 0"
3.256631374359131;40;"149";" 0"
3.33638858795166;40;"149";" 0"
3.339380979537964;40;"149";" 0"
3.343170166015625;40;"149";" 0"
3.3475451469421387;40;"149";" 0"
3.355320453643799;40;"149";" 0"
3.360917806625366;40;"149";" 0"
3.381368637084961;40;"154";" 50"
3.396852493286133;40;"157";" 50"
3.399169683456421;40;"157";" 50"
3.458944797515869;40;"162";" 50"
3.461606740951538;40;"164";" 50"
3.461606740951538;40;"166";" 50"
3.469588041305542;40;"166";" 50"
3.5158326625823975;40;"166";" 50"
3.517526388168335;40;"166";" 50"
3.5538697242736816;40;"166";" 50"
3.5548667907714844;40;"166";" 50"
3.555863618850708;40;"166";" 50"
3.571470260620117;40;"162";" 50"
3.601241111755371;40;"164";" 50"
3.603499412536621;40;"164";" 50"
3.618393898010254;40;"164";" 50"
3.6470706462860107;40;"164";" 50"
3.6552443504333496;40;"164";" 50"
3.694586753845215;40;"162";" 50"
3.695587158203125;40;"164";" 50"
3.7096662521362305;40;"164";" 50"
3.7499635219573975;40;"164";" 50"
3.7573094367980957;40;"157";" 50"
3.7610316276550293;40;"158";" 50"
3.7942099571228027;40;"158";" 50"
3.798060894012451;40;"162";" 50"
3.8334455490112305;40;"157";" 50"
3.834449529647827;40;"157";" 50"
3.8783791065216064;40;"156";" 50"
3.8793766498565674;40;"154";" 50"
3.887023448944092;40;"154";" 50"
3.9308905601501465;40;"154";" 50"
3.9328858852386475;40;"154";" 50"
3.9439778327941895;40;"158";" 50"
3.9903836250305176;40;"154";" 50"
3.9913806915283203;40;"158";" 50"
3.993375539779663;40;"158";" 50"
4.011905908584595;40;"156";" 50"
4.042913436889648;40;"156";" 50"
4.053241491317749;40;"149";" 50"
4.097638130187988;40;"149";" 0"
4.099626541137695;40;"149";" 0"
4.100622177124023;40;"149";" 0"
4.130265712738037;40;"149";" 0"
4.152704954147339;40;"149";" 0"
4.1654627323150635;40;"149";" 0"
4.214529275894165;40;"149";" 0"
4.218154430389404;40;"149";" 0"
4.220901727676392;40;"149";" 0"
4.232029676437378;40;"154";" 0"
4.254626750946045;40;"157";" 50"
4.3040313720703125;40;"157";" 50"
4.305048942565918;40;"157";" 50"
4.3063976764678955;40;"164";" 50"
4.348618268966675;40;"162";" 50"
4.34961462020874;40;"166";" 50"
4.350612640380859;40;"166";" 50"
4.372209072113037;40;"164";" 50"
4.393157720565796;40;"170";" 50"
4.407596111297607;40;"170";" 50"
4.448003053665161;40;"164";" 50"
4.450995922088623;40;"166";" 50"
4.4854819774627686;40;"166";" 50"
4.486478328704834;40;"162";" 50"
4.493847846984863;40;"164";" 50"
4.539783477783203;40;"164";" 50"
4.541373252868652;40;"164";" 50"
4.580883979797363;40;"164";" 50"
4.581880331039429;40;"164";" 50"
4.594756603240967;40;"164";" 50"
4.6276915073394775;40;"164";" 50"
4.628633975982666;40;"164";" 50"
4.642514944076538;40;"164";" 50"
4.681264638900757;40;"164";" 50"
4.68226170539856;40;"157";" 50"
4.722102403640747;40;"158";" 50"
4.724487543106079;40;"162";" 50"
4.748968124389648;40;"156";" 50"
4.7670300006866455;40;"157";" 50"
4.815576076507568;40;"156";" 50"
4.816560506820679;40;"156";" 50"
4.823666095733643;40;"157";" 50"
4.872641086578369;40;"157";" 50"
4.876806020736694;40;"157";" 50"
4.878763675689697;40;"158";" 50"
4.909342050552368;40;"154";" 50"
4.912304639816284;40;"154";" 50"
4.997307538986206;40;"158";" 50"
4.998303413391113;40;"158";" 50"
4.999301910400391;40;"154";" 50"
4.999301910400391;40;"154";" 50"
5.000302076339722;40;"149";" 50"
5.001296281814575;40;"156";" 50"
5.021772146224976;40;"149";" 50"
5.064751148223877;40;"149";" 0"
5.065753221511841;40;"149";" 0"
5.066749572753906;40;"154";" 50"
5.0864012241363525;40;"149";" 50"
5.128311634063721;40;"149";" 0"
5.129758596420288;40;"149";" 0"
5.35380482673645;40;"149";" 0"
5.35479998588562;40;"156";" 0"
5.3557984828948975;40;"156";" 50"
5.3557984828948975;40;"149";" 50"
5.356795310974121;40;"149";" 0"
5.357790231704712;40;"156";" 0"
5.357790231704712;40;"156";" 50"
5.358788967132568;40;"154";" 50"
5.359925746917725;40;"157";" 50"
5.36131739616394;40;"162";" 50"
5.362751722335815;40;"162";" 50"
5.363749980926514;40;"157";" 50"
5.363749980926514;40;"157";" 50"
5.364749908447266;40;"164";" 50"
5.364749908447266;40;"164";" 50"
5.494086980819702;40;"164";" 50"
5.495379209518433;40;"164";" 50"
5.497069597244263;40;"164";" 50"
5.498621702194214;40;"164";" 50"
5.499927997589111;40;"164";" 50"
5.500947713851929;40;"162";" 50"
5.501925230026245;40;"162";" 50"
5.502849340438843;40;"162";" 50"
5.503850698471069;40;"157";" 50"
5.51790189743042;40;"157";" 50"
5.52305269241333;40;"157";" 50"
5.56998348236084;40;"156";" 50"
5.570979356765747;40;"157";" 50"
5.571977853775024;40;"157";" 50"
5.582960367202759;40;"157";" 50"
5.62837290763855;40;"157";" 50"
5.629374980926514;40;"156";" 50"
5.640867710113525;40;"154";" 50"
5.676730394363403;40;"154";" 50"
5.678727865219116;40;"154";" 50"
5.696234226226807;40;"154";" 50"
5.749623537063599;40;"156";" 50"
5.750624895095825;40;"156";" 50"
5.751620292663574;40;"149";" 50"
5.819622993469238;40;"149";" 0"
5.8210978507995605;40;"149";" 0"
5.823050498962402;40;"156";" 50"
5.824801921844482;40;"149";" 50"
5.84517765045166;40;"149";" 0"
5.856269836425781;40;"156";" 0"
5.900762557983398;40;"149";" 0"
5.907911777496338;40;"156";" 0"
5.912915945053101;40;"149";" 0"
5.929387807846069;40;"154";" 0"
5.944016695022583;40;"154";" 50"
5.986996650695801;40;"154";" 50"
5.986996650695801;40;"156";" 50"
5.993982315063477;40;"158";" 50"
6.044678449630737;40;"158";" 50"
6.045675754547119;40;"157";" 50"
6.046674489974976;40;"164";" 50"
6.078256845474243;40;"166";" 50"
6.115644216537476;40;"166";" 50"
6.128785610198975;40;"166";" 50"
6.1567158699035645;40;"164";" 50"
6.1596057415008545;40;"164";" 50"
6.20745062828064;40;"158";" 50"
6.208455562591553;40;"157";" 50"
6.23376202583313;40;"156";" 50"
6.251708984375;40;"157";" 50"
6.297985315322876;40;"157";" 50"
6.298981666564941;40;"157";" 50"
6.34073805809021;40;"157";" 50"
6.341731786727905;40;"162";" 50"
6.392938852310181;40;"157";" 50"
6.394837141036987;40;"157";" 50"
6.395840644836426;40;"157";" 50"
6.396833419799805;40;"156";" 50"
6.410332441329956;40;"154";" 50"
6.436456680297852;40;"154";" 50"
6.492151737213135;40;"154";" 50"
6.495150804519653;40;"154";" 50"
6.496155023574829;40;"154";" 50"
6.513741970062256;40;"149";" 50"
6.556689262390137;40;"156";" 50"
6.5596795082092285;40;"149";" 50"
6.564669370651245;40;"149";" 0"
6.592888832092285;40;"156";" 0"
6.593890905380249;40;"149";" 0"
6.639507055282593;40;"149";" 0"
6.643112897872925;40;"149";" 0"
6.65421724319458;40;"149";" 0"
6.68934440612793;40;"149";" 0"
6.68934440612793;40;"149";" 0"
6.70644998550415;40;"149";" 0"
6.74501895904541;40;"154";" 0"
6.753491640090942;40;"154";" 50"
6.7574687004089355;40;"157";" 50"
6.782111883163452;40;"158";" 50"
6.792672157287598;40;"164";" 50"
6.824979782104492;40;"164";" 50"
6.825983762741089;40;"166";" 50"
6.874751091003418;40;"164";" 50"
6.875202894210815;40;"166";" 50"
6.930159091949463;40;"166";" 50"
6.933902025222778;40;"166";" 50"
6.937114953994751;40;"166";" 50"
6.945564031600952;40;"166";" 50"
6.977116107940674;40;"166";" 50"
7.012478828430176;40;"164";" 50"
7.014475107192993;40;"162";" 50"
7.0154736042022705;40;"158";" 50"
7.024712324142456;40;"158";" 50"
7.058292388916016;40;"158";" 50"
7.058292388916016;40;"162";" 50"
7.108365297317505;40;"162";" 50"
7.1093668937683105;40;"162";" 50"
7.110361576080322;40;"164";" 50"
7.126250982284546;40;"164";" 50"
7.16376256942749;40;"162";" 50"
7.171745777130127;40;"162";" 50"
7.181714057922363;40;"162";" 50"
7.2108728885650635;40;"157";" 50"
7.231966972351074;40;"158";" 50"
7.263209104537964;40;"158";" 50"
7.277393817901611;40;"158";" 50"
7.312693119049072;40;"158";" 50"
7.313690423965454;40;"158";" 50"
7.324158191680908;40;"158";" 50"
7.3609349727630615;40;"158";" 50"
7.361935377120972;40;"158";" 50"
7.374902009963989;40;"158";" 50"
7.412755250930786;40;"154";" 50"
7.41375207901001;40;"156";" 50"
7.414749383926392;40;"156";" 50"
7.434312582015991;40;"156";" 50"
7.4695069789886475;40;"149";" 0"
7.480020999908447;40;"149";" 0"
7.5204901695251465;40;"156";" 0"
7.523041486740112;40;"156";" 0"
7.524483680725098;40;"149";" 0"
7.5422751903533936;40;"154";" 0"
7.569891691207886;40;"149";" 0"
7.583986759185791;40;"156";" 0"
7.619823694229126;40;"156";" 50"
7.620821952819824;40;"158";" 50"
7.626471996307373;40;"158";" 50"
7.67313289642334;40;"157";" 50"
7.674646377563477;40;"162";" 50"
7.689501762390137;40;"164";" 50"
7.725547552108765;40;"166";" 50"
7.72972846031189;40;"166";" 50"
7.743408441543579;40;"166";" 50"
7.770850896835327;40;"166";" 50"
7.784309148788452;40;"166";" 50"
7.816004514694214;40;"166";" 50"
7.818005084991455;40;"164";" 50"
7.8320019245147705;40;"162";" 50"
7.85914421081543;40;"162";" 50"
7.8662238121032715;40;"162";" 50"
7.905244827270508;40;"162";" 50"
7.90624213218689;40;"162";" 50"
7.921862840652466;40;"162";" 50"
7.953662633895874;40;"162";" 50"
7.955678701400757;40;"162";" 50"
7.963032484054565;40;"158";" 50"
7.9968345165252686;40;"162";" 50"
7.997833728790283;40;"162";" 50"
8.046437740325928;40;"157";" 50"
8.047851800918579;40;"157";" 50"
8.055360078811646;40;"158";" 50"
8.092947006225586;40;"154";" 50"
8.104964256286621;40;"158";" 50"
8.141921281814575;40;"158";" 50"
8.142921924591064;40;"158";" 50"
8.160902976989746;40;"158";" 50"
8.199167013168335;40;"156";" 50"
8.204276323318481;40;"156";" 50"
8.210798025131226;40;"156";" 50"
8.235545873641968;40;"156";" 50"
8.280575275421143;40;"156";" 50"
8.281571865081787;40;"156";" 50"
8.283584594726562;40;"156";" 50"
8.337249994277954;40;"154";" 50"
8.34008002281189;40;"149";" 50"
8.340641975402832;40;"154";" 50"
8.391425848007202;40;"149";" 50"
8.392425537109375;40;"149";" 0"
8.394420623779297;40;"149";" 0"
8.436803340911865;40;"149";" 0"
8.438454866409302;40;"149";" 0"
8.478215456008911;0;"";""
8.483370542526245;0;"149";" 0"
8.484363555908203;0;"149";" 0"
8.489303588867188;0;"149";" 0"
8.538998365402222;0;"154";" 0"
8.540160179138184;0;"154";" 50"
8.54116177558899;0;"154";" 50"
8.597184896469116;0;"156";" 50"
8.5981924533844;0;"158";" 50"
8.600190877914429;0;"158";" 50"
8.619198322296143;0;"158";" 50"
8.648979187011719;0;"154";" 50"
8.652966976165771;0;"158";" 50"
8.663399457931519;0;"158";" 50"
8.689198732376099;0;"156";" 50"
8.74064302444458;0;"149";" 0"
8.741638422012329;0;"149";" 0"
8.742640495300293;0;"149";" 0"
8.784738063812256;0;"138";" 0"
8.78788685798645;0;"139";" 0"
8.834115982055664;0;"137";" 0"
8.83733868598938;0;"137";" 0"
8.838876485824585;0;"137";" 0"
8.87449026107788;0;"137";" 0"
8.876482725143433;0;"139";" 0"
8.887491703033447;0;"139";" 0"
8.928338289260864;0;"138";" 0"
8.969908475875854;0;"138";" 0"
8.981078386306763;0;"138";" 0"
9.022573471069336;0;"138";" 0"
9.032809972763062;0;"138";" 0"
9.058566570281982;0;"138";" 0"
9.106724500656128;0;"138";" 0"
9.107720375061035;0;"138";" 0"
9.107720375061035;0;"138";" 0"
9.11118197441101;0;"138";" 0"
9.155686378479004;0;"138";" 0"
9.155686378479004;0;"138";" 0"
9.164724349975586;0;"138";" 0"
9.203184127807617;0;"138";" 0"
9.20490288734436;0;"138";" 0"
9.213344812393188;0;"138";" 0"
9.263362646102905;0;"138";" 0"
9.271758794784546;0;"138";" 0"
9.275745630264282;0;"138";" 0"
9.310124397277832;0;"138";" 0"
9.312118291854858;0;"138";" 0"
9.357245206832886;0;"138";" 0"
9.358242511749268;0;"145";" 0"
9.359233856201172;0;"138";" 0"
9.404897689819336;0;"138";" 0"
9.405897617340088;0;"138";" 0"
9.40701675415039;0;"138";" 0"
9.455267667770386;0;"145";" 0"
9.456252098083496;0;"138";" 0"
9.505177021026611;0;"138";" 0"
9.505177021026611;0;"138";" 0"
9.506181240081787;0;"138";" 0"
9.506181240081787;0;"138";" 0"
9.56329607963562;0;"138";" 0"
9.565291166305542;0;"138";" 0"
9.567288637161255;0;"138";" 0"
9.574220180511475;0;"138";" 0"
9.620218276977539;0;"138";" 0"
9.622211694717407;0;"138";" 0"
9.6326904296875;0;"138";" 0"
9.682055234909058;0;"138";" 0"
9.68305492401123;0;"138";" 0"
9.684158325195312;0;"138";" 0"
9.707110404968262;0;"138";" 0"
9.735172271728516;0;"138";" 0"
9.73716926574707;0;"145";" 0"
9.785575866699219;0;"138";" 0"
9.787848472595215;0;"138";" 0"
9.789297342300415;0;"138";" 0"
9.838910102844238;0;"138";" 0"
9.839910507202148;0;"138";" 0"
9.849762916564941;0;"138";" 0"
9.892069816589355;0;"138";" 0"
9.896061182022095;0;"138";" 0"
9.89905047416687;0;"138";" 0"
9.911922454833984;0;"138";" 0"
9.930144548416138;0;"138";" 0"
9.979613304138184;0;"138";" 0"
9.980607509613037;0;"138";" 0"
9.982602834701538;0;"138";" 0"
10.028850317001343;0;"138";" 0"
10.033085823059082;0;"138";" 0"
10.073782920837402;0;"138";" 0"
10.085078477859497;0;"138";" 0"
10.12939739227295;0;"138";" 0"
10.137375831604004;0;"138";" 0"
10.141364097595215;0;"138";" 0"
10.143361568450928;0;"138";" 0"
10.171281576156616;0;"138";" 0"
10.223144292831421;0;"138";" 0"
10.223144292831421;0;"138";" 0"
10.224140882492065;0;"138";" 0"
10.224140882492065;0;"138";" 0"
10.278003692626953;0;"138";" 0"
10.278994798660278;0;"138";" 0"
10.280988931655884;0;"138";" 0"
10.321880340576172;0;"138";" 0"
10.321880340576172;0;"138";" 0"
10.375734329223633;0;"138";" 0"
10.37673306465149;0;"138";" 0"
10.377731561660767;0;"138";" 0"
10.41961932182312;0;"138";" 0"
10.420615911483765;0;"138";" 0"
10.420615911483765;0;"138";" 0"
10.4655020236969;0;"138";" 0"
10.46649432182312;0;"138";" 0"
10.512370347976685;0;"138";" 0"
10.513367414474487;0;"138";" 0"
10.51436471939087;0;"138";" 0"
10.57445740699768;0;"145";" 0"
10.576452255249023;0;"145";" 0"
10.578451871871948;0;"138";" 0"
10.579446792602539;0;"138";" 0"
10.607075929641724;0;"138";" 0"
10.607075929641724;0;"138";" 0"
10.669068098068237;0;"138";" 0"
10.670065641403198;0;"138";" 0"
10.672060012817383;0;"138";" 0"
10.674055337905884;0;"138";" 0"
10.686022996902466;0;"138";" 0"
10.714945077896118;0;"138";" 0"
10.714945077896118;0;"138";" 0"
10.74386739730835;0;"138";" 0"
10.766818046569824;0;"138";" 0"
10.76780366897583;0;"138";" 0"
10.834333896636963;0;"138";" 0"
10.83732557296753;0;"138";" 0"
10.843308448791504;0;"138";" 0"
10.844306945800781;0;"138";" 0"
10.85826826095581;0;"138";" 0"
10.89627456665039;0;"138";" 0"
10.898268938064575;0;"138";" 0"
10.910237789154053;0;"138";" 0"
10.947138547897339;0;"145";" 0"
10.948136329650879;0;"138";" 0"
10.963061571121216;0;"138";" 0"
11.000119924545288;0;"138";" 0"
11.002117156982422;0;"138";" 0"
11.01807165145874;0;"138";" 0"
11.039241313934326;0;"141";" 0"
11.116265535354614;0;"138";" 0"
11.121252536773682;0;"138";" 0"
11.123246431350708;0;"138";" 0"
11.12524127960205;0;"138";" 0"
11.130228519439697;0;"138";" 0"
11.135213613510132;0;"138";" 0"
11.151286125183105;0;"138";" 0"
11.20172119140625;0;"138";" 0"
11.206704378128052;0;"138";" 0"
11.209697484970093;0;"138";" 0"
11.228646039962769;0;"138";" 0"
11.237621068954468;0;"138";" 0"
11.273085117340088;0;"138";" 0"
11.334108591079712;0;"138";" 0"
11.337103128433228;0;"138";" 0"
11.33909559249878;0;"145";" 0"
11.340091466903687;0;"138";" 0"
11.366032123565674;0;"138";" 0"
11.373990535736084;0;"138";" 0"
11.408897638320923;0;"138";" 0"
11.409896612167358;0;"138";" 0"
11.45577359199524;0;"138";" 0"
11.456769943237305;0;"138";" 0"
11.456769943237305;0;"138";" 0"
11.47372555732727;0;"138";" 0"
11.525511503219604;0;"138";" 0"
11.53149151802063;0;"138";" 0"
11.533487558364868;0;"138";" 0"
11.56441330909729;0;"138";" 0"
11.566397905349731;0;"138";" 0"
11.579285144805908;0;"138";" 0"
11.633165836334229;0;"138";" 0"
11.639148712158203;0;"138";" 0"
11.640146017074585;0;"138";" 0"
11.641143560409546;0;"138";" 0"
11.657087564468384;0;"138";" 0"
11.717966794967651;0;"138";" 0"
11.720962285995483;0;"138";" 0"
11.722953796386719;0;"138";" 0"
11.730967998504639;0;"138";" 0"
11.78190016746521;0;"138";" 0"
11.78489089012146;0;"138";" 0"
11.79087495803833;0;"138";" 0"
11.815495252609253;0;"138";" 0"
11.866912364959717;0;"138";" 0"
11.867906093597412;0;"138";" 0"
11.868902683258057;0;"138";" 0"
11.870896816253662;0;"138";" 0"
11.88907766342163;0;"138";" 0"
11.913197994232178;0;"138";" 0"
11.951562881469727;0;"138";" 0"
11.952568769454956;0;"138";" 0"
11.999343156814575;0;"138";" 0"
12.000340223312378;0;"138";" 0"
12.001335382461548;0;"138";" 0"
12.001335382461548;0;"138";" 0"
12.023653268814087;0;"138";" 0"
12.057153940200806;0;"138";" 0"
12.062142372131348;0;"138";" 0"
12.066972970962524;0;"138";" 0"
12.106069326400757;0;"138";" 0"
12.117038249969482;0;"145";" 0"
12.131798028945923;0;"138";" 0"
12.146751403808594;0;"138";" 0"
12.153733253479004;0;"138";" 0"
12.193736791610718;0;"138";" 0"
12.203712701797485;0;"138";" 0"
12.208709716796875;0;"138";" 0"
12.226641416549683;0;"138";" 0"
12.23661184310913;0;"138";" 0"
12.257688760757446;0;"138";" 0"
12.296669244766235;0;"138";" 0"
12.305643081665039;0;"138";" 0"
12.308634519577026;0;"138";" 0"
12.33057713508606;0;"138";" 0"
12.337553977966309;0;"138";" 0"
12.386300325393677;0;"138";" 0"
12.391282796859741;0;"138";" 0"
12.400257587432861;0;"138";" 0"
12.438241720199585;0;"138";" 0"
12.440238237380981;0;"138";" 0"
12.493792057037354;0;"138";" 0"
12.500771284103394;0;"138";" 0"
12.508756160736084;0;"138";" 0"
12.515734195709229;0;"138";" 0"
12.532949447631836;0;"138";" 0"
12.54990005493164;0;"138";" 0"
12.56386113166809;0;"138";" 0"
12.59178614616394;0;"138";" 0"
12.592783212661743;0;"138";" 0"
12.651281595230103;0;"138";" 0"
12.65826678276062;0;"138";" 0"
12.669228553771973;0;"138";" 0"
12.679195880889893;0;"138";" 0"
12.69315791130066;0;"138";" 0"
12.750370979309082;0;"138";" 0"
12.760346174240112;0;"138";" 0"
12.769322156906128;0;"138";" 0"
12.77230978012085;0;"138";" 0"
12.77430272102356;0;"138";" 0"
12.796243667602539;0;"138";" 0"
12.80570101737976;0;"138";" 0"
12.850366115570068;0;"138";" 0"
12.852359294891357;0;"138";" 0"
12.86169147491455;0;"138";" 0"
12.892161130905151;0;"138";" 0"
12.904160499572754;0;"138";" 0"
12.945386171340942;0;"138";" 0"
12.948378324508667;0;"138";" 0"
12.950372695922852;0;"138";" 0"
12.962673425674438;0;"138";" 0"
13.00391411781311;0;"138";" 0"
13.007900953292847;0;"138";" 0"
13.011889219284058;0;"138";" 0"
13.02433705329895;0;"138";" 0"
13.050414323806763;0;"138";" 0"
13.061534881591797;0;"138";" 0"
13.093808889389038;0;"138";" 0"
13.102887868881226;0;"138";" 0"
13.12564992904663;0;"138";" 0"
13.15151572227478;0;"141";" 0"
13.157769680023193;0;"138";" 0"
13.202961683273315;0;"138";" 0"
13.206254720687866;0;"138";" 0"
13.208256244659424;0;"145";" 0"
13.251398086547852;0;"138";" 0"
13.253394842147827;0;"138";" 0"
13.25439453125;0;"138";" 0"
13.265522003173828;0;"138";" 0"
13.296870946884155;0;"138";" 0"
13.314281463623047;0;"138";" 0"
13.347156524658203;0;"138";" 0"
13.34840202331543;0;"138";" 0"
13.386271238327026;0;"138";" 0"
13.387914180755615;0;"138";" 0"
13.401448965072632;0;"138";" 0"
13.449262857437134;0;"138";" 0"
13.450581789016724;0;"138";" 0"
13.451991081237793;0;"138";" 0"
13.498830080032349;0;"138";" 0"
13.500772953033447;0;"138";" 0"
13.501769304275513;0;"138";" 0"
13.521253824234009;0;"138";" 0"
13.55698823928833;0;"138";" 0"
13.560970067977905;0;"138";" 0"
13.564958810806274;0;"138";" 0"
13.59186577796936;0;"138";" 0"
13.600824356079102;0;"145";" 0"
13.638146877288818;0;"138";" 0"
13.638146877288818;0;"138";" 0"
13.655975818634033;0;"138";" 0"
13.684819459915161;0;"138";" 0"
13.686075687408447;0;"138";" 0"
13.733642101287842;0;"138";" 0"
13.73563814163208;0;"138";" 0"
13.780436754226685;0;"138";" 0"
13.783433675765991;0;"138";" 0"
13.784958362579346;0;"138";" 0"
13.833058595657349;0;"138";" 0"
13.838047504425049;0;"138";" 0"
13.842037916183472;0;"138";" 0"
13.872822046279907;0;"138";" 0"
13.880410432815552;0;"138";" 0"
13.917607069015503;0;"138";" 0"
13.919605016708374;0;"138";" 0"
13.93219542503357;0;"138";" 0"
13.967710971832275;0;"138";" 0"
13.96871042251587;0;"138";" 0"
14.013221502304077;0;"138";" 0"
14.01590347290039;0;"145";" 0"
14.01590347290039;0;"138";" 0"
14.034968137741089;0;"138";" 0"
14.063056707382202;0;"138";" 0"
14.104494333267212;0;"138";" 0"
14.10548996925354;0;"138";" 0"
14.117598295211792;0;"138";" 0"
14.153593063354492;0;"138";" 0"
14.157672643661499;0;"138";" 0"
14.165864944458008;0;"138";" 0"
14.19975233078003;0;"138";" 0"
14.201788663864136;0;"138";" 0"
14.212735414505005;0;"138";" 0"
14.246413469314575;0;"138";" 0"
14.251967430114746;0;"138";" 0"
14.298577547073364;0;"138";" 0"
14.301579475402832;0;"138";" 0"
14.303565740585327;0;"138";" 0"
14.337625980377197;0;"138";" 0"
14.339623212814331;0;"138";" 0"
14.352154731750488;0;"138";" 0"
14.387022256851196;0;"138";" 0"
14.388019323348999;0;"138";" 0"
14.388205289840698;0;"138";" 0"
14.43419599533081;0;"138";" 0"
14.436190605163574;0;"138";" 0"
14.453303813934326;0;"138";" 0"
14.481796026229858;0;"138";" 0"
14.489691257476807;0;"138";" 0"
14.525995969772339;0;"138";" 0"
14.526994943618774;0;"138";" 0"
14.581801652908325;0;"138";" 0"
14.582794904708862;0;"138";" 0"
14.584789991378784;0;"138";" 0"
14.589522361755371;0;"138";" 0"
14.643970727920532;0;"138";" 0"
14.644965171813965;0;"138";" 0"
14.644965171813965;0;"138";" 0"
14.695008277893066;0;"138";" 0"
14.697002410888672;0;"138";" 0"
14.698903799057007;0;"138";" 0"
14.705122709274292;0;"138";" 0"
14.750533819198608;0;"138";" 0"
14.752530336380005;0;"138";" 0"
14.765110969543457;0;"138";" 0"
14.792248964309692;0;"145";" 0"
14.793248414993286;0;"138";" 0"
14.83951187133789;0;"138";" 0"
14.841503381729126;0;"138";" 0"
14.842501878738403;0;"138";" 0"
14.854557275772095;0;"138";" 0"
14.886046409606934;0;"138";" 0"
14.89747142791748;0;"138";" 0"
14.933475017547607;0;"138";" 0"
14.934476137161255;0;"138";" 0"
14.98317003250122;0;"138";" 0"
14.984167575836182;0;"138";" 0"
14.986162662506104;0;"138";" 0"
15.028324842453003;0;"138";" 0"
15.030231237411499;0;"138";" 0"
15.032963752746582;0;"138";" 0"
15.074279308319092;0;"138";" 0"
15.076261281967163;0;"138";" 0"
15.087152004241943;0;"138";" 0"
15.120959043502808;0;"138";" 0"
15.122956037521362;0;"138";" 0"
15.137567043304443;0;"138";" 0"
15.166860103607178;0;"138";" 0"
15.189082860946655;0;"138";" 0"
15.213160991668701;0;"138";" 0"
15.215633392333984;0;"138";" 0"
15.234375;0;"138";" 0"
15.261244773864746;0;"138";" 0"
15.272306442260742;0;"138";" 0"
15.310405969619751;0;"138";" 0"
15.310405969619751;0;"138";" 0"
15.37024736404419;0;"138";" 0"
15.371243715286255;0;"138";" 0"
15.371243715286255;0;"138";" 0"
15.372242450714111;0;"138";" 0"
15.393186330795288;0;"138";" 0"
15.415126085281372;0;"138";" 0"
15.462997198104858;0;"138";" 0"
15.462997198104858;0;"138";" 0"
15.46399474143982;0;"138";" 0"
15.522838115692139;0;"138";" 0"
15.562730312347412;0;"138";" 0"
15.62456488609314;0;"138";" 0"
15.645509719848633;0;"138";" 0"
15.653487920761108;0;"138";" 0"
15.659472942352295;0;"138";" 0"
15.669445514678955;0;"138";" 0"
15.670442819595337;0;"138";" 0"
15.67842149734497;0;"138";" 0"
15.684405326843262;0;"138";" 0"
15.689396858215332;0;"138";" 0"
15.695375680923462;0;"138";" 0"
15.697370290756226;0;"138";" 0"
15.698368549346924;0;"138";" 0"
15.705349445343018;0;"138";" 0"
15.723300457000732;0;"138";" 0"
15.74723768234253;0;"138";" 0"
15.761200189590454;0;"138";" 0"
15.798102140426636;0;"138";" 0"
15.800096035003662;0;"138";" 0"
15.844968557357788;0;"138";" 0"
15.846964597702026;0;"138";" 0"
15.847960948944092;0;"138";" 0"
15.891843795776367;0;"138";" 0"
15.892841339111328;0;"138";" 0"
15.893837928771973;0;"138";" 0"
15.934500455856323;0;"138";" 0"
15.935497045516968;0;"138";" 0"
15.93749451637268;0;"138";" 0"
16.060164213180542;0;"138";" 0"
16.061161279678345;0;"138";" 0"
16.063157558441162;0;"138";" 0"
16.064153909683228;0;"138";" 0"
16.06515073776245;0;"138";" 0"
16.06714653968811;0;"138";" 0"
16.069140672683716;0;"138";" 0"
16.0711350440979;0;"138";" 0"
16.09192442893982;0;"138";" 0"
16.114863872528076;0;"138";" 0"
16.13182044029236;0;"138";" 0"
16.16871929168701;0;"138";" 0"
16.16971731185913;0;"138";" 0"
16.187668323516846;0;"138";" 0"
16.217589139938354;0;"138";" 0"
16.219582319259644;0;"138";" 0"
16.23155117034912;0;"138";" 0"
16.269450187683105;0;"138";" 0"
16.27044677734375;0;"145";" 0"
16.28241515159607;0;"145";" 0"
16.328556776046753;0;"138";" 0"
16.329554319381714;0;"138";" 0"
16.33653712272644;0;"138";" 0"
16.37343716621399;0;"138";" 0"
16.375433206558228;0;"138";" 0"
16.42141342163086;0;"138";" 0"
16.422419548034668;0;"138";" 0"
16.422419548034668;0;"138";" 0"
16.477845907211304;0;"138";" 0"
16.486826419830322;0;"138";" 0"
16.492802143096924;0;"138";" 0"
16.495794534683228;0;"138";" 0"
16.526015043258667;0;"138";" 0"
16.531001091003418;0;"138";" 0"
16.54396629333496;0;"138";" 0"
16.559926986694336;0;"138";" 0"
16.574968099594116;0;"138";" 0"
16.628087282180786;0;"138";" 0"
16.636061429977417;0;"138";" 0"
16.64104676246643;0;"138";" 0"
16.644036769866943;0;"145";" 0"
16.66198968887329;0;"145";" 0"
16.71515965461731;0;"145";" 0"
16.718151569366455;0;"138";" 0"
16.721142530441284;0;"138";" 0"
16.733298301696777;0;"138";" 0"
16.750248432159424;0;"138";" 0"
16.761133432388306;0;"138";" 0"
16.79419994354248;0;"138";" 0"
16.80663561820984;0;"138";" 0"
16.847031593322754;0;"138";" 0"
16.848029136657715;0;"138";" 0"
16.850024700164795;0;"138";" 0"
16.865474224090576;0;"138";" 0"
16.927692413330078;0;"138";" 0"
16.929689407348633;0;"138";" 0"
16.931682109832764;0;"138";" 0"
16.966897010803223;0;"138";" 0"
16.969889640808105;0;"138";" 0"
16.97188448905945;0;"145";" 0"
16.979857206344604;0;"145";" 0"
17.00877833366394;0;"138";" 0"
17.00977396965027;0;"138";" 0"
17.028796911239624;40;"";""
17.030790090560913;40;"138";" 0"
17.03178858757019;40;"138";" 0"
17.079176902770996;40;"138";" 0"
17.081172943115234;40;"138";" 0"
17.086155891418457;40;"138";" 0"
17.146756410598755;40;"138";" 0"
17.1546528339386;40;"138";" 0"
17.159131050109863;40;"138";" 0"
17.163124322891235;40;"145";" 0"
17.182924270629883;40;"145";" 0"
17.19787573814392;40;"147";" 0"
17.204858541488647;40;"149";" 0"
17.23194432258606;40;"157";" 0"
17.263858795166016;40;"158";" 50"
17.310158729553223;40;"158";" 50"
17.31115484237671;40;"157";" 50"
17.367573261260986;40;"162";" 50"
17.371567726135254;40;"162";" 50"
17.380837202072144;40;"164";" 50"
17.417553901672363;40;"164";" 50"
17.420546770095825;40;"166";" 50"
17.428520679473877;40;"162";" 50"
17.45145893096924;40;"162";" 50"
17.452454566955566;40;"162";" 50"
17.478779315948486;40;"162";" 50"
17.502712965011597;40;"157";" 50"
17.508695602416992;40;"157";" 50"
17.524653673171997;40;"157";" 50"
17.554542779922485;40;"158";" 50"
17.559524297714233;40;"158";" 50"
17.575538635253906;40;"157";" 50"
17.63965082168579;40;"157";" 50"
17.645636558532715;40;"157";" 50"
17.647626876831055;40;"157";" 50"
17.650622129440308;40;"157";" 50"
17.66498851776123;40;"157";" 50"
17.712743759155273;40;"157";" 50"
17.72171950340271;40;"158";" 50"
17.729698657989502;40;"158";" 50"
17.753650665283203;40;"156";" 50"
17.812191486358643;40;"156";" 50"
17.82016897201538;40;"156";" 50"
17.828142881393433;40;"156";" 50"
17.834125995635986;40;"156";" 50"
17.837119340896606;40;"156";" 50"
17.85606622695923;40;"154";" 50"
17.867039680480957;40;"154";" 50"
17.90290856361389;40;"154";" 50"
17.905899047851562;40;"154";" 50"
17.924848556518555;40;"154";" 50"
17.960933685302734;40;"149";" 0"
17.965919017791748;40;"147";" 0"
17.980338096618652;40;"149";" 0"
18.001279592514038;40;"149";" 0"
18.006267786026;40;"149";" 0"
18.044991731643677;40;"149";" 0"
18.046987533569336;40;"149";" 0"
18.063878059387207;40;"149";" 0"
18.094796895980835;40;"149";" 0"
18.102773666381836;40;"154";" 0"
18.148837327957153;40;"156";" 50"
18.156816959381104;40;"156";" 50"
18.164793014526367;40;"156";" 50"
18.19676375389099;40;"162";" 50"
18.203750610351562;40;"162";" 50"
18.212716817855835;40;"166";" 50"
18.238049268722534;40;"166";" 50"
18.249021291732788;40;"166";" 50"
18.285008668899536;40;"166";" 50"
18.28600764274597;40;"166";" 50"
18.331819534301758;40;"166";" 50"
18.332817554473877;40;"166";" 50"
18.333817958831787;40;"164";" 50"
18.365200519561768;40;"164";" 50"
18.386138200759888;40;"162";" 50"
18.392393112182617;40;"162";" 50"
18.428181648254395;40;"162";" 50"
18.43416929244995;40;"162";" 50"
18.441288709640503;40;"162";" 50"
18.47020697593689;40;"162";" 50"
18.47320032119751;40;"162";" 50"
18.49817156791687;40;"162";" 50"
18.52509379386902;40;"162";" 50"
18.537055492401123;40;"162";" 50"
18.573498249053955;40;"162";" 50"
18.573498249053955;40;"157";" 50"
18.574495315551758;40;"157";" 50"
18.641563415527344;40;"157";" 50"
18.649543285369873;40;"158";" 50"
18.661534786224365;40;"154";" 50"
18.66749358177185;40;"154";" 50"
18.66949152946472;40;"158";" 50"
18.679460525512695;40;"158";" 50"
18.69990634918213;40;"158";" 50"
18.73868727684021;40;"158";" 50"
18.749656438827515;40;"158";" 50"
18.752649307250977;40;"154";" 50"
18.7785747051239;40;"158";" 50"
18.780569553375244;40;"158";" 50"
18.8403480052948;40;"156";" 50"
18.84862518310547;40;"156";" 50"
18.859774589538574;40;"156";" 50"
18.86556053161621;40;"156";" 50"
18.868552446365356;40;"154";" 50"
18.89348602294922;40;"154";" 50"
18.906448125839233;40;"149";" 50"
18.926393270492554;40;"149";" 0"
18.993757009506226;40;"149";" 0"
19.00073552131653;40;"149";" 0"
19.0067195892334;40;"154";" 0"
19.007723569869995;40;"154";" 50"
19.00872278213501;40;"154";" 50"
19.04741930961609;40;"154";" 50"
19.054391384124756;40;"154";" 50"
19.069355010986328;40;"154";" 50"
19.081318378448486;40;"149";" 50"
19.09228777885437;40;"149";" 0"
19.112401962280273;40;"158";" 0"
19.138333320617676;40;"157";" 50"
19.155292510986328;40;"157";" 50"
19.19195556640625;40;"157";" 50"
19.198939561843872;40;"158";" 50"
19.205912828445435;40;"158";" 50"
19.25191307067871;40;"158";" 50"
19.263875246047974;40;"154";" 50"
19.273861169815063;40;"158";" 50"
19.285812854766846;40;"158";" 50"
19.316648483276367;40;"158";" 50"
19.346563577651978;40;"156";" 50"
19.36052918434143;40;"156";" 50"
19.399556636810303;40;"154";" 50"
19.404540061950684;40;"154";" 50"
19.41052269935608;40;"154";" 50"
19.43254566192627;40;"154";" 50"
19.457379579544067;40;"154";" 50"
19.46735143661499;40;"154";" 50"
19.47842526435852;40;"154";" 50"
19.50907015800476;40;"154";" 50"
19.518046140670776;40;"154";" 50"
19.536036252975464;40;"149";" 50"
19.55099391937256;40;"149";" 0"
19.56533455848694;40;"147";" 0"
19.59979009628296;40;"149";" 0"
19.604820013046265;40;"149";" 0"
19.61375331878662;40;"149";" 0"
19.642489671707153;40;"149";" 0"
19.654547691345215;40;"149";" 0"
19.682839155197144;40;"149";" 0"
19.742281913757324;40;"149";" 0"
19.747270584106445;40;"156";" 0"
19.750261068344116;40;"158";" 50"
19.78216814994812;40;"157";" 50"
19.78516125679016;40;"157";" 50"
19.824055433273315;40;"157";" 50"
19.824055433273315;40;"162";" 50"
19.835026025772095;40;"164";" 50"
19.870930671691895;40;"170";" 50"
19.8719265460968;40;"166";" 50"
19.88489580154419;40;"166";" 50"
19.92175793647766;40;"166";" 50"
19.92375159263611;40;"166";" 50"
19.940706253051758;40;"164";" 50"
19.968973398208618;40;"164";" 50"
20.01474642753601;40;"166";" 50"
20.017394304275513;40;"162";" 50"
20.018245697021484;40;"157";" 50"
20.019246578216553;40;"157";" 50"
20.063427209854126;40;"164";" 50"
20.064427852630615;40;"157";" 50"
20.07593011856079;40;"162";" 50"
20.129263162612915;40;"166";" 50"
20.13225269317627;40;"157";" 50"
20.134247064590454;40;"157";" 50"
20.17457938194275;40;"157";" 50"
20.175583362579346;40;"157";" 50"
20.18450164794922;40;"157";" 50"
20.217159509658813;40;"157";" 50"
20.217949867248535;40;"158";" 50"
20.232796669006348;40;"158";" 50"
20.264739513397217;40;"158";" 50"
20.26573348045349;40;"158";" 50"
20.283817768096924;40;"157";" 50"
20.315471649169922;40;"156";" 50"
20.316468238830566;40;"156";" 50"
20.33416509628296;40;"156";" 50"
20.375412225723267;40;"156";" 50"
20.377930164337158;40;"156";" 50"
20.395418405532837;40;"156";" 50"
20.42059898376465;40;"154";" 50"
20.432233333587646;40;"154";" 50"
20.4688823223114;40;"154";" 50"
20.470866918563843;40;"154";" 50"
20.48240375518799;40;"154";" 50"
20.521355152130127;40;"149";" 50"
20.52235198020935;40;"149";" 0"
20.578866720199585;40;"149";" 0"
20.581865072250366;40;"149";" 0"
20.583856105804443;40;"149";" 0"
20.593489170074463;40;"149";" 0"
20.631047010421753;40;"149";" 0"
20.633041858673096;40;"154";" 50"
20.694952249526978;40;"154";" 50"
20.694952249526978;40;"156";" 50"
20.69594955444336;40;"156";" 50"
20.71597123146057;40;"158";" 50"
20.717239379882812;40;"157";" 50"
20.764696836471558;40;"166";" 50"
20.766701698303223;40;"166";" 50"
20.770683765411377;40;"162";" 50"
20.811523914337158;40;"162";" 50"
20.81351923942566;40;"162";" 50"
20.825241804122925;40;"157";" 50"
20.860020637512207;40;"158";" 50"
20.861021280288696;40;"158";" 50"
20.906546115875244;40;"158";" 50"
20.907549381256104;40;"158";" 50"
20.923645734786987;40;"158";" 50"
20.951669454574585;40;"158";" 50"
20.953665256500244;40;"158";" 50"
20.998046398162842;40;"158";" 50"
20.99904727935791;40;"158";" 50"
21.005244970321655;40;"158";" 50"
21.042823314666748;40;"158";" 50"
21.043821334838867;40;"156";" 50"
21.064475536346436;40;"156";" 50"
21.093419790267944;40;"156";" 50"
21.101627588272095;40;"156";" 50"
21.14062190055847;40;"154";" 50"
21.141623973846436;40;"154";" 50"
21.152085781097412;40;"154";" 50"
21.185253620147705;40;"154";" 50"
21.186255931854248;40;"154";" 50"
21.202813386917114;40;"154";" 50"
21.239622592926025;40;"154";" 50"
21.239622592926025;40;"149";" 50"
21.253584146499634;40;"149";" 0"
21.30520510673523;40;"149";" 0"
21.306201457977295;40;"149";" 0"
21.344645738601685;40;"149";" 0"
21.348639249801636;40;"149";" 0"
21.3526291847229;40;"149";" 0"
21.39255952835083;40;"149";" 0"
21.3959321975708;40;"149";" 0"
21.442585468292236;40;"154";" 0"
21.443580150604248;40;"156";" 50"
21.497819900512695;40;"164";" 50"
21.498817920684814;40;"164";" 50"
21.49981451034546;40;"166";" 50"
21.510926246643066;40;"166";" 50"
21.544867753982544;40;"170";" 50"
21.545864820480347;40;"170";" 50"
21.56936287879944;40;"166";" 50"
21.599737882614136;40;"166";" 50"
21.60486602783203;40;"166";" 50"
21.620863914489746;40;"166";" 50"
21.6405291557312;40;"166";" 50"
21.650835752487183;40;"164";" 50"
21.695769786834717;40;"162";" 50"
21.69676685333252;40;"162";" 50"
21.713438987731934;40;"162";" 50"
21.75435471534729;40;"162";" 50"
21.758488416671753;40;"157";" 50"
21.760604858398438;40;"162";" 50"
21.776512145996094;40;"157";" 50"
21.80890917778015;40;"162";" 50"
21.81992197036743;40;"162";" 50"
21.854885816574097;40;"157";" 50"
21.85588002204895;40;"157";" 50"
21.86664843559265;40;"164";" 50"
21.902655839920044;40;"158";" 50"
21.905107021331787;40;"158";" 50"
21.953563690185547;40;"158";" 50"
21.95457100868225;40;"158";" 50"
21.955556869506836;40;"158";" 50"
22.00968289375305;40;"157";" 50"
22.01067876815796;40;"157";" 50"
22.01067876815796;40;"156";" 50"
22.058786392211914;40;"156";" 50"
22.062783241271973;40;"156";" 50"
22.074928760528564;40;"156";" 50"
22.10149836540222;40;"154";" 50"
22.1204354763031;40;"154";" 50"
22.152310609817505;40;"154";" 50"
22.155304431915283;40;"154";" 50"
22.195367097854614;40;"154";" 50"
22.19737434387207;40;"154";" 50"
22.19737434387207;40;"149";" 0"
22.262990713119507;40;"149";" 0"
22.264986515045166;40;"156";" 50"
22.264986515045166;40;"149";" 50"
22.265983819961548;40;"149";" 0"
22.30751323699951;40;"149";" 0"
22.30851125717163;40;"149";" 0"
22.327433586120605;40;"149";" 0"
22.36019015312195;40;"149";" 0"
22.361188173294067;40;"154";" 0"
22.42367172241211;40;"154";" 50"
22.4246723651886;40;"156";" 50"
22.4256694316864;40;"156";" 50"
22.438172817230225;40;"158";" 50"
22.477142572402954;40;"157";" 50"
22.480384588241577;40;"157";" 50"
22.485376596450806;40;"162";" 50"
22.515447854995728;40;"162";" 50"
22.525416374206543;40;"162";" 50"
22.544662714004517;40;"162";" 50"
22.573544025421143;40;"162";" 50"
22.587358474731445;40;"162";" 50"
22.63446283340454;40;"157";" 50"
22.64086365699768;40;"158";" 50"
22.64515495300293;40;"158";" 50"
22.65481472015381;40;"158";" 50"
22.67539381980896;40;"158";" 50"
22.68691396713257;40;"162";" 50"
22.727747917175293;40;"157";" 50"
22.728758335113525;40;"157";" 50"
22.77351999282837;40;"158";" 50"
22.77351999282837;40;"158";" 50"
22.77451729774475;40;"158";" 50"
22.821258544921875;40;"158";" 50"
22.821258544921875;40;"156";" 50"
22.87842893600464;40;"156";" 50"
22.883207082748413;40;"156";" 50"
22.887455224990845;40;"156";" 50"
22.889457941055298;40;"156";" 50"
22.91007399559021;40;"156";" 50"
22.930437564849854;40;"154";" 50"
22.980996131896973;40;"154";" 50"
22.98299217224121;40;"154";" 50"
22.98598623275757;40;"154";" 50"
22.99097204208374;40;"154";" 50"
23.024484872817993;40;"154";" 50"
23.026482582092285;40;"154";" 50"
23.077327728271484;40;"154";" 50"
23.079323291778564;40;"149";" 0"
23.079323291778564;40;"149";" 0"
23.090214014053345;40;"149";" 0"
23.133888721466064;40;"149";" 0"
23.13589119911194;40;"145";" 0"
23.143148183822632;40;"149";" 0"
23.186226844787598;40;"149";" 0"
23.189223051071167;40;"149";" 0"
23.190220832824707;40;"149";" 0"
23.22864556312561;40;"154";" 0"
23.230642080307007;40;"154";" 50"
23.249179124832153;40;"158";" 50"
23.28735375404358;40;"158";" 50"
23.2900230884552;40;"157";" 50"
23.33870005607605;40;"162";" 50"
23.341329336166382;40;"166";" 50"
23.354422330856323;40;"166";" 50"
23.38952922821045;40;"170";" 50"
23.391526460647583;40;"166";" 50"
23.409991979599;40;"166";" 50"
23.4338595867157;40;"162";" 50"
23.44772219657898;40;"162";" 50"
23.483893632888794;40;"166";" 50"
23.485269784927368;40;"157";" 50"
23.531198263168335;40;"157";" 50"
23.534177541732788;40;"164";" 50"
23.545157432556152;40;"157";" 50"
23.601986169815063;40;"157";" 50"
23.603625059127808;40;"157";" 50"
23.604625701904297;40;"157";" 50"
23.61204981803894;40;"157";" 50"
23.656599760055542;40;"158";" 50"
23.657851934432983;40;"158";" 50"
23.660948276519775;40;"158";" 50"
23.704129934310913;40;"158";" 50"
23.705591917037964;40;"158";" 50"
23.748826026916504;40;"156";" 50"
23.749824047088623;40;"156";" 50"
23.801668643951416;40;"156";" 50"
23.80266833305359;40;"156";" 50"
23.80366539955139;40;"158";" 50"
23.806673049926758;40;"156";" 50"
23.852413415908813;40;"156";" 50"
23.853413105010986;40;"156";" 50"
23.872435808181763;40;"154";" 50"
23.908847093582153;40;"154";" 50"
23.91681480407715;40;"154";" 50"
23.922802209854126;40;"154";" 50"
23.934596300125122;40;"149";" 50"
23.945374011993408;40;"149";" 0"
23.968279600143433;40;"149";" 0"
24.002363920211792;40;"149";" 0"
24.00535535812378;40;"149";" 0"
24.055254697799683;40;"149";" 0"
24.056252002716064;40;"147";" 0"
24.057249546051025;40;"149";" 0"
24.07369875907898;40;"149";" 0"
24.105420351028442;40;"149";" 0"
24.148335456848145;40;"149";" 0"
24.150331497192383;40;"158";" 50"
24.159423828125;40;"158";" 50"
24.199968576431274;40;"157";" 50"
24.20096778869629;40;"164";" 50"
24.20395827293396;40;"162";" 50"
24.24137234687805;40;"164";" 50"
24.242376804351807;40;"164";" 50"
24.258955240249634;40;"170";" 50"
24.296730279922485;40;"166";" 50"
24.30734896659851;40;"166";" 50"
24.309350728988647;40;"170";" 50"
24.333770990371704;40;"166";" 50"
24.38191270828247;40;"166";" 50"
24.38291072845459;40;"162";" 50"
24.38291072845459;40;"166";" 50"
24.4059841632843;40;"162";" 50"
24.42723774909973;40;"162";" 50"
24.437987327575684;40;"164";" 50"
24.474735975265503;40;"166";" 50"
24.475741624832153;40;"166";" 50"
24.484211206436157;40;"162";" 50"
24.52854299545288;40;"162";" 50"
24.52953577041626;40;"164";" 50"
24.537094354629517;40;"157";" 50"
24.58303141593933;40;"157";" 50"
24.585184335708618;40;"157";" 50"
24.59631371498108;40;"164";" 50"
24.610284090042114;40;"158";" 50"
24.635499715805054;40;"158";" 50"
24.68207883834839;40;"158";" 50"
24.684101581573486;40;"158";" 50"
24.685097455978394;40;"156";" 50"
24.713162183761597;40;"156";" 50"
24.727917909622192;40;"156";" 50"
24.73909306526184;40;"156";" 50"
24.77710509300232;40;"156";" 50"
24.778099298477173;40;"156";" 50"
24.78707718849182;40;"156";" 50"
24.821955680847168;40;"156";" 50"
24.82295274734497;40;"154";" 50"
24.84594750404358;40;"154";" 50"
24.867274045944214;40;"154";" 50"
24.878493785858154;40;"154";" 50"
24.925511121749878;40;"154";" 50"
24.92650294303894;40;"149";" 50"
24.927499055862427;40;"149";" 0"
24.949068307876587;40;"149";" 0"
24.98642110824585;40;"149";" 0"
24.990394353866577;40;"149";" 0"
24.993695974349976;40;"149";" 0"
25.024145126342773;40;"149";" 0"
25.02614164352417;40;"149";" 0"
25.05497694015503;40;"149";" 0"
25.070934772491455;40;"149";" 0"
25.121492862701416;40;"154";" 0"
25.122490644454956;40;"154";" 50"
25.1237370967865;40;"162";" 50"
25.124993801116943;40;"162";" 50"
25.167980432510376;40;"157";" 50"
25.172790050506592;40;"162";" 50"
25.177499532699585;40;"162";" 50"
25.193296194076538;40;"162";" 50"
25.21908211708069;40;"164";" 50"
25.22407078742981;40;"164";" 50"
25.275667905807495;40;"164";" 50"
25.27765989303589;40;"164";" 50"
25.27965474128723;40;"164";" 50"
25.29580330848694;40;"162";" 50"
25.332359075546265;40;"162";" 50"
25.334832429885864;40;"157";" 50"
25.367872953414917;40;"157";" 50"
25.369868278503418;40;"157";" 50"
25.385611295700073;40;"157";" 50"
25.41268825531006;0;"";""
25.42014241218567;0;"157";" 50"
25.4285147190094;0;"157";" 50"
25.47891354560852;0;"157";" 50"
25.480908155441284;0;"157";" 50"
25.482908964157104;0;"157";" 50"
25.49341869354248;0;"158";" 50"
25.523847103118896;0;"158";" 50"
25.57787036895752;0;"154";" 50"
25.58702254295349;0;"149";" 0"
25.59176731109619;0;"149";" 0"
25.63115119934082;0;"147";" 0"
25.635441541671753;0;"147";" 0"
25.675867080688477;0;"145";" 0"
25.67686367034912;0;"143";" 0"
25.678402423858643;0;"143";" 0"
25.722973823547363;0;"143";" 0"
25.723971605300903;0;"143";" 0"
25.77217388153076;0;"143";" 0"
25.776639223098755;0;"143";" 0"
25.78161907196045;0;"145";" 0"
25.79080057144165;0;"145";" 0"
25.82222032546997;0;"145";" 0"
25.827959299087524;0;"138";" 0"
25.864794731140137;0;"145";" 0"
25.868788480758667;0;"145";" 0"
25.884512186050415;0;"145";" 0"
25.90921115875244;0;"145";" 0"
25.92623281478882;0;"145";" 0"
25.958026885986328;0;"145";" 0"
25.959023475646973;0;"145";" 0"
25.964643001556396;0;"145";" 0"
26.001810550689697;0;"145";" 0"
26.001810550689697;0;"145";" 0"
26.031678199768066;0;"145";" 0"
26.033194065093994;0;"145";" 0"
26.05462121963501;0;"145";" 0"
26.064485788345337;0;"145";" 0"
26.096280336380005;0;"145";" 0"
26.10448122024536;0;"145";" 0"
26.15538215637207;0;"145";" 0"
26.158570051193237;0;"145";" 0"
26.16580557823181;0;"145";" 0"
26.21651840209961;0;"145";" 0"
26.224183797836304;0;"145";" 0"
26.23038935661316;0;"145";" 0"
26.234386444091797;0;"145";" 0"
26.258307933807373;0;"145";" 0"
26.26528835296631;0;"145";" 0"
26.297646284103394;0;"145";" 0"
26.298640727996826;0;"145";" 0"
