
  ______   ______   ____  ____        ______                           _                 
.' ____ \ |_   _ `.|_   ||   _|     .' ____ \                         (_)                
| (___ \_|  | | `. \ | |__| | ______| (___ \_| .---.  _ .--.  _   __  __   .---.  .---.  
 _.____`.   | |  | | |  __  ||______|_.____`. / /__\\[ `/'`\][ \ [  ][  | / /'`\]/ /__\\ 
| \____) | _| |_.' /_| |  | |_      | \____) || \__., | |     \ \/ /  | | | \__. | \__., 
 \______.'|______.'|____||____|      \______.' '.__.'[___]     \__/  [___]'.___.' '.__.' 
                                                                                         
                                                                                                                                         