"Dados Demográficos dos Bairros de Fortaleza",,,,,,,,,,,,,
,,,,,,,,,,,,,
"REGIONAL","Bairros","População Total","Pop. Homens","Pop. Mulheres","Razão de Sexo","População (0-14 anos)","População (15-64 anos)","População (> 64 anos)","% População (0-14 anos)","% População (15-64 anos)","% População (> 64 anos)","Razão de Dependência","Média de moradores por domicílio"
"REGIONAL 6","Aerolândia"," 11,360 "," 5,365 "," 5,995 ",89.49," 2,400 "," 8,118 "," 842 ",21.13,71.46,7.41,39.94,3.45
"REGIONAL 4","Aeroporto"," 8,618 "," 4,160 "," 4,458 ",93.32," 2,389 "," 5,918 "," 311 ",27.72,68.67,3.61,45.62,3.61
"REGIONAL 2","Aldeota"," 42,361 "," 17,980 "," 24,381 ",73.75," 5,600 "," 31,587 "," 5,174 ",13.22,74.57,12.21,34.11,3.08
"REGIONAL 6","Alto da Balança"," 12,814 "," 5,930 "," 6,884 ",86.14," 2,709 "," 8,941 "," 1,164 ",21.14,69.78,9.08,43.32,3.39
"REGIONAL 1","Álvaro Weyne"," 23,690 "," 10,834 "," 12,856 ",84.27," 4,959 "," 16,719 "," 2,012 ",20.93,70.57,8.49,41.7,3.52
"REGIONAL 3","Amadeo Furtado"," 11,703 "," 5,211 "," 6,492 ",80.27," 1,895 "," 8,347 "," 1,461 ",16.19,71.32,12.48,40.21,3.46
"REGIONAL 6","Ancuri"," 20,070 "," 9,823 "," 10,247 ",95.86," 5,367 "," 13,843 "," 860 ",26.74,68.97,4.29,44.98,3.42
"REGIONAL 3","Antônio Bezerra"," 25,846 "," 11,902 "," 13,944 ",85.36," 5,368 "," 18,476 "," 2,002 ",20.77,71.48,7.75,39.89,3.44
"REGIONAL 1","Arraial Moura Brasil"," 3,765 "," 1,796 "," 1,969 ",91.21," 957 "," 2,540 "," 268 ",25.42,67.46,7.12,48.23,3.55
"REGIONAL 3","Autran Nunes"," 21,208 "," 10,281 "," 10,927 ",94.09," 5,812 "," 14,434 "," 962 ",27.4,68.06,4.54,46.93,3.78
"REGIONAL 1","Barra do Ceará"," 72,423 "," 34,658 "," 37,765 ",91.77," 18,271 "," 50,651 "," 3,501 ",25.23,69.94,4.83,42.98,3.56
"REGIONAL 6","Barroso"," 29,847 "," 14,359 "," 15,488 ",92.71," 8,421 "," 20,252 "," 1,174 ",28.21,67.85,3.93,47.38,3.58
"REGIONAL 3","Bela Vista"," 16,754 "," 7,767 "," 8,987 ",86.42," 3,502 "," 11,951 "," 1,301 ",20.9,71.33,7.77,40.19,3.40
"REGIONAL 4","Benfica"," 12,954 "," 5,532 "," 7,422 ",74.54," 1,515 "," 9,927 "," 1,512 ",11.70,76.63,11.67,30.49,3.05
"REGIONAL 6","Boa Vista"," 12,247 "," 5,869 "," 6,378 ",92.02," 3,116 "," 8,534 "," 597 ",25.44,69.68,4.87,43.51,3.42
"REGIONAL 4","Bom Futuro"," 6,405 "," 2,747 "," 3,658 ",75.1," 1,002 "," 4,641 "," 762 ",15.64,72.46,11.9,38.01,3.25
"REGIONAL 5","Bom Jardim"," 37,758 "," 18,180 "," 19,578 ",92.86," 10,040 "," 25,811 "," 1,907 ",26.59,68.36,5.05,46.29,3.60
"REGIONAL 3","Bonsucesso"," 41,198 "," 19,336 "," 21,862 ",88.45," 9,847 "," 28,828 "," 2,523 ",23.9,69.97,6.12,42.91,3.50
"REGIONAL 2","Cais do Porto"," 22,382 "," 10,867 "," 11,515 ",94.37," 5,799 "," 15,379 "," 1,204 ",25.91,68.71,5.38,45.54,3.54
"REGIONAL 6","Cajazeiras"," 14,478 "," 6,821 "," 7,657 ",89.08," 3,500 "," 10,353 "," 625 ",24.17,71.51,4.32,39.84,3.27
"REGIONAL 6","Cambeba"," 7,625 "," 3,596 "," 4,029 ",89.25," 1,454 "," 5,692 "," 479 ",19.07,74.65,6.28,33.96,3.54
"REGIONAL 5","Canindezinho"," 41,202 "," 20,127 "," 21,075 ",95.5," 11,796 "," 28,027 "," 1,379 ",28.63,68.02,3.35,47.01,3.57
"REGIONAL 1","Carlito Pamplona"," 29,076 "," 13,596 "," 15,480 ",87.83," 6,649 "," 20,504 "," 1,923 ",22.87,70.52,6.61,41.81,3.49
"REGIONAL 2","Centro"," 28,538 "," 12,973 "," 15,565 ",83.35," 4,444 "," 21,001 "," 3,093 ",15.57,73.59,10.84,35.89,2.89
"REGIONAL 2","Cidade 2000"," 8,272 "," 3,576 "," 4,696 ",76.15," 1,273 "," 6,044 "," 955 ",15.39,73.07,11.54,36.86,3.15
"REGIONAL 6","Cidade dos Funcionários"," 18,256 "," 8,256 "," 10,000 ",82.56," 3,129 "," 13,662 "," 1,465 ",17.14,74.84,8.02,33.63,3.40
"REGIONAL 6","Coaçu"," 7,188 "," 3,441 "," 3,747 ",91.83," 1,771 "," 5,109 "," 308 ",24.64,71.08,4.28,40.69,3.53
"REGIONAL 2","Cocó"," 20,492 "," 9,135 "," 11,357 ",80.43," 3,416 "," 15,431 "," 1,645 ",16.67,75.3,8.03,32.8,3.18
"REGIONAL 5","Conjunto Ceará I"," 19,221 "," 8,850 "," 10,371 ",85.33," 3,682 "," 14,114 "," 1,425 ",19.16,73.43,7.41,36.18,3.51
"REGIONAL 5","Conjunto Ceará II"," 23,673 "," 10,998 "," 12,675 ",86.77," 4,392 "," 17,450 "," 1,831 ",18.55,73.71,7.73,35.66,3.51
"REGIONAL 5","Conjunto Esperança"," 16,405 "," 7,714 "," 8,691 ",88.76," 3,609 "," 11,847 "," 949 ",22,72.22,5.78,38.47,3.45
"REGIONAL 6","Conjunto Palmeiras"," 36,599 "," 17,807 "," 18,792 ",94.76," 10,094 "," 25,190 "," 1,315 ",27.58,68.83,3.59,45.29,4.02
"REGIONAL 4","Couto Fernandes"," 5,260 "," 2,467 "," 2,793 ",88.33," 1,194 "," 3,672 "," 394 ",22.7,69.81,7.49,43.25,3.38
"REGIONAL 1","Cristo Redentor"," 26,717 "," 12,639 "," 14,078 ",89.78," 6,515 "," 18,227 "," 1,975 ",24.39,68.22,7.39,46.58,3.68
"REGIONAL 6","Curió"," 7,636 "," 3,761 "," 3,875 ",97.06," 1,812 "," 5,578 "," 246 ",23.73,73.05,3.22,36.89,3.64
"REGIONAL 4","Damas"," 10,719 "," 4,697 "," 6,022 ",78," 1,742 "," 7,999 "," 978 ",16.25,74.62,9.12,34,3.04
"REGIONAL 2","De Lourdes"," 3,370 "," 1,561 "," 1,809 ",86.29," 650 "," 2,525 "," 195 ",19.29,74.93,5.79,33.47,3.51
"REGIONAL 4","Demócrito Rocha"," 10,994 "," 5,040 "," 5,954 ",84.65," 2,180 "," 7,877 "," 937 ",19.83,71.65,8.52,39.57,3.36
"REGIONAL 4","Dendê"," 5,637 "," 2,815 "," 2,822 ",99.75," 1,405 "," 4,082 "," 150 ",24.92,72.41,2.66,38.09,3.29
"REGIONAL 6","Dias Macêdo"," 12,111 "," 5,747 "," 6,364 ",90.3," 2,748 "," 8,604 "," 759 ",22.69,71.04,6.27,40.76,3.46
"REGIONAL 2","Dionísio Torres"," 15,634 "," 6,624 "," 9,010 ",73.52," 2,004 "," 11,644 "," 1,986 ",12.82,74.48,12.7,34.27,3.22
"REGIONAL 3","Dom Lustosa"," 13,147 "," 6,109 "," 7,038 ",86.8," 2,992 "," 9,289 "," 866 ",22.76,70.65,6.59,41.53,3.43
"REGIONAL 6","Edson Queiroz"," 22,210 "," 10,586 "," 11,624 ",91.07," 4,557 "," 16,605 "," 1,048 ",20.52,74.76,4.72,33.75,3.76
"REGIONAL 1","Farias Brito"," 12,063 "," 5,400 "," 6,663 ",81.04," 2,041 "," 8,791 "," 1,231 ",16.92,72.88,10.2,37.22,3.33
"REGIONAL 4","Fátima"," 23,309 "," 10,091 "," 13,218 ",76.34," 2,998 "," 17,701 "," 2,610 ",12.86,75.94,11.2,31.68,3.19
"REGIONAL 1","Floresta"," 28,896 "," 13,677 "," 15,219 ",89.87," 7,509 "," 19,787 "," 1,600 ",25.99,68.48,5.54,46.04,3.49
"REGIONAL 5","Genibaú"," 40,336 "," 19,531 "," 20,805 ",93.88," 11,301 "," 27,680 "," 1,355 ",28.02,68.62,3.36,45.72,3.55
"REGIONAL 5","Granja Lisboa"," 52,042 "," 25,360 "," 26,682 ",95.05," 14,515 "," 35,340 "," 2,187 ",27.89,67.91,4.2,47.26,3.61
"REGIONAL 5","Granja Portugal"," 39,651 "," 19,172 "," 20,479 ",93.62," 11,138 "," 26,394 "," 2,119 ",28.09,66.57,5.34,50.23,3.67
"REGIONAL 6","Guajerú"," 6,668 "," 3,085 "," 3,583 ",86.1," 1,527 "," 4,819 "," 322 ",22.9,72.27,4.83,38.37,3.59
"REGIONAL 2","Guararapes"," 5,266 "," 2,359 "," 2,907 ",81.15," 875 "," 3,979 "," 412 ",16.62,75.56,7.82,32.34,3.41
"REGIONAL 3","Henrique Jorge"," 26,994 "," 12,606 "," 14,388 ",87.61," 5,751 "," 19,225 "," 2,018 ",21.3,71.22,7.48,40.41,3.45
"REGIONAL 4","Itaoca"," 12,477 "," 5,602 "," 6,875 ",81.48," 2,481 "," 8,978 "," 1,018 ",19.88,71.96,8.16,38.97,3.34
"REGIONAL 4","Itaperi"," 22,563 "," 10,487 "," 12,076 ",86.84," 4,631 "," 16,617 "," 1,315 ",20.52,73.65,5.83,35.78,3.20
"REGIONAL 1","Jacarecanga"," 14,204 "," 6,472 "," 7,732 ",83.7," 2,868 "," 9,946 "," 1,390 ",20.19,70.02,9.79,42.81,3.34
"REGIONAL 6","Jangurussu"," 50,479 "," 24,217 "," 26,262 ",92.21," 13,334 "," 35,500 "," 1,645 ",26.41,70.33,3.26,42.19,3.54
"REGIONAL 4","Jardim América"," 12,264 "," 5,455 "," 6,809 ",80.11," 2,254 "," 8,806 "," 1,204 ",18.38,71.8,9.82,39.27,3.38
"REGIONAL 5","Jardim Cearense"," 10,103 "," 4,771 "," 5,332 ",89.48," 2,222 "," 7,384 "," 497 ",21.99,73.09,4.92,36.82,3.46
"REGIONAL 6","Jardim das Oliveiras"," 29,571 "," 14,024 "," 15,547 ",90.2," 7,228 "," 20,617 "," 1,726 ",24.44,69.72,5.84,43.43,3.56
"REGIONAL 1","Jardim Guanabara"," 14,919 "," 6,937 "," 7,982 ",86.91," 3,223 "," 10,570 "," 1,126 ",21.6,70.85,7.55,41.14,3.48
"REGIONAL 1","Jardim Iracema"," 23,184 "," 10,968 "," 12,216 ",89.78," 5,244 "," 16,296 "," 1,644 ",22.62,70.29,7.09,42.27,3.52
"REGIONAL 3","João XXIII"," 18,398 "," 8,661 "," 9,737 ",88.95," 4,169 "," 12,985 "," 1,244 ",22.66,70.58,6.76,41.69,3.50
"REGIONAL 2","Joaquim Távora"," 23,450 "," 10,107 "," 13,343 ",75.75," 3,316 "," 17,283 "," 2,851 ",14.14,73.7,12.16,35.68,3.15
"REGIONAL 3","Jóquei Clube"," 19,331 "," 8,867 "," 10,464 ",84.74," 3,696 "," 14,057 "," 1,578 ",19.12,72.72,8.16,37.52,3.40
"REGIONAL 4","José Bonifácio"," 8,848 "," 3,842 "," 5,006 ",76.75," 1,146 "," 6,451 "," 1,251 ",12.95,72.91,14.14,37.16,3.11
"REGIONAL 6","José de Alencar"," 16,003 "," 7,652 "," 8,351 ",91.63," 3,686 "," 11,639 "," 678 ",23.03,72.73,4.24,37.49,3.50
"REGIONAL 6","Lagoa Redonda"," 27,949 "," 13,356 "," 14,593 ",91.52," 7,293 "," 19,432 "," 1,224 ",26.09,69.53,4.38,43.83,3.50
"REGIONAL 2","Luciano Cavalcante"," 15,543 "," 7,143 "," 8,400 ",85.04," 3,240 "," 11,253 "," 1,050 ",20.85,72.4,6.76,38.12,3.46
"REGIONAL 5","Manoel Sátiro"," 37,952 "," 17,707 "," 20,245 ",87.46," 8,415 "," 27,355 "," 2,182 ",22.17,72.08,5.75,38.74,3.41
"REGIONAL 2","Manuel Dias Branco"," 1,447 "," 679 "," 768 ",88.41," 363 "," 1,030 "," 54 ",25.09,71.18,3.73,40.49,3.27
"REGIONAL 5","Maraponga"," 10,155 "," 4,720 "," 5,435 ",86.84," 2,166 "," 7,403 "," 586 ",21.33,72.9,5.77,37.17,3.31
"REGIONAL 2","Meireles"," 36,982 "," 16,171 "," 20,811 ",77.7," 4,673 "," 27,681 "," 4,628 ",12.64,74.85,12.51,33.6,2.91
"REGIONAL 6","Messejana"," 41,689 "," 19,277 "," 22,412 ",86.01," 8,309 "," 30,205 "," 3,175 ",19.93,72.45,7.62,38.02,3.41
"REGIONAL 5","Mondubim"," 76,044 "," 36,555 "," 39,489 ",92.57," 19,726 "," 53,187 "," 3,131 ",25.94,69.94,4.12,42.97,3.44
"REGIONAL 1","Monte Castelo"," 13,215 "," 6,118 "," 7,097 ",86.21," 2,427 "," 9,488 "," 1,300 ",18.37,71.8,9.84,39.28,3.44
"REGIONAL 4","Montese"," 25,970 "," 11,524 "," 14,446 ",79.77," 4,686 "," 18,739 "," 2,545 ",18.04,72.16,9.8,38.59,3.26
"REGIONAL 2","Mucuripe"," 13,747 "," 6,239 "," 7,508 ",83.1," 2,220 "," 10,094 "," 1,433 ",16.15,73.43,10.42,36.19,3.09
"REGIONAL 5","Novo Mondubim*"," -   "," -   "," -   ",0," -   "," -   "," -   ",0,0,0,0,0.00
"REGIONAL 3","Olavo Oliveira*"," -   "," -   "," -   ",0," -   "," -   "," -   ",0,0,0,0,0.00
"REGIONAL 3","Padre Andrade "," 12,936 "," 5,912 "," 7,024 ",84.17," 2,746 "," 9,231 "," 959 ",21.23,71.36,7.41,40.14,3.41
"REGIONAL 4","Pan Americano"," 8,815 "," 4,065 "," 4,750 ",85.58," 1,785 "," 6,240 "," 790 ",20.25,70.79,8.96,41.27,3.41
"REGIONAL 2","Papicu"," 18,370 "," 8,584 "," 9,786 ",87.72," 3,646 "," 13,394 "," 1,330 ",19.85,72.91,7.24,37.15,3.30
"REGIONAL 4","Parangaba"," 30,947 "," 14,271 "," 16,676 ",85.58," 5,896 "," 22,653 "," 2,398 ",19.05,73.2,7.75,36.61,3.33
"REGIONAL 3","Parque Araxá"," 6,715 "," 2,919 "," 3,796 ",76.9," 965 "," 4,837 "," 913 ",14.37,72.03,13.6,38.83,3.33
"REGIONAL 6","Parque Dois Irmãos"," 27,236 "," 13,072 "," 14,164 ",92.29," 6,821 "," 19,279 "," 1,136 ",25.04,70.78,4.17,41.27,3.64
"REGIONAL 6","Parque Iracema"," 8,409 "," 3,875 "," 4,534 ",85.47," 1,694 "," 6,213 "," 502 ",20.15,73.89,5.97,35.35,3.07
"REGIONAL 6","Parque Manibura"," 7,529 "," 3,472 "," 4,057 ",85.58," 1,333 "," 5,591 "," 605 ",17.7,74.26,8.04,34.66,3.69
"REGIONAL 5","Parque Presidente Vargas"," 7,192 "," 3,560 "," 3,632 ",98.02," 2,135 "," 4,745 "," 312 ",29.69,65.98,4.34,51.57,3.69
"REGIONAL 6","Parque Santa Maria*"," -   "," -   "," -   ",0," -   "," -   "," -   ",0,0,0,0,0.00
"REGIONAL 5","Parque Santa Rosa"," 12,790 "," 6,106 "," 6,684 ",91.35," 3,120 "," 8,994 "," 676 ",24.39,70.32,5.29,42.21,3.43
"REGIONAL 5","Parque São José"," 10,486 "," 5,007 "," 5,479 ",91.39," 2,460 "," 7,221 "," 805 ",23.46,68.86,7.68,45.22,3.47
"REGIONAL 3","Parquelândia"," 14,432 "," 6,283 "," 8,149 ",77.1," 1,966 "," 10,564 "," 1,902 ",13.62,73.2,13.18,36.61,3.22
"REGIONAL 4","Parreão"," 11,072 "," 4,977 "," 6,095 ",81.66," 2,024 "," 7,920 "," 1,128 ",18.28,71.53,10.19,39.8,3.43
"REGIONAL 6","Passaré"," 50,940 "," 24,541 "," 26,399 ",92.96," 13,607 "," 35,642 "," 1,691 ",26.71,69.97,3.32,42.92,3.38
"REGIONAL 6","Paupina"," 14,665 "," 7,042 "," 7,623 ",92.38," 3,616 "," 10,360 "," 689 ",24.66,70.64,4.7,41.55,3.46
"REGIONAL 6","Pedras"," 1,342 "," 670 "," 672 ",99.7," 340 "," 913 "," 89 ",25.34,68.03,6.63,46.99,3.63
"REGIONAL 3","Pici"," 42,494 "," 20,330 "," 22,164 ",91.73," 10,856 "," 29,716 "," 1,922 ",25.55,69.93,4.52,43,3.58
"REGIONAL 1","Pirambú"," 17,775 "," 8,430 "," 9,345 ",90.21," 4,543 "," 11,880 "," 1,352 ",25.56,66.84,7.61,49.62,3.65
"REGIONAL 5","Planalto Ayrton Senna"," 39,446 "," 19,277 "," 20,169 ",95.58," 11,083 "," 26,865 "," 1,498 ",28.1,68.11,3.8,46.83,3.56
"REGIONAL 2","Praia de Iracema"," 3,130 "," 1,437 "," 1,693 ",84.88," 440 "," 2,331 "," 359 ",14.06,74.47,11.47,34.28,2.87
"REGIONAL 2","Praia do Futuro I"," 6,630 "," 3,224 "," 3,406 ",94.66," 1,942 "," 4,424 "," 264 ",29.29,66.73,3.98,49.86,3.42
"REGIONAL 2","Praia do Futuro II"," 11,957 "," 5,879 "," 6,078 ",96.73," 3,570 "," 8,039 "," 348 ",29.86,67.23,2.91,48.74,3.46
"REGIONAL 5","Prefeito José Valter"," 33,427 "," 15,401 "," 18,026 ",85.44," 7,036 "," 23,331 "," 3,060 ",21.05,69.8,9.15,43.27,3.42
"REGIONAL 3","Presidente Kennedy"," 23,004 "," 10,327 "," 12,677 ",81.46," 4,401 "," 16,690 "," 1,913 ",19.13,72.55,8.32,37.83,3.43
"REGIONAL 3","Quintino Cunha"," 47,277 "," 22,471 "," 24,806 ",90.59," 11,902 "," 33,193 "," 2,182 ",25.18,70.21,4.62,42.43,3.58
"REGIONAL 3","Rodolfo Teófilo"," 19,114 "," 8,575 "," 10,539 ",81.36," 3,348 "," 13,806 "," 1,960 ",17.52,72.23,10.25,38.45,3.36
"REGIONAL 6","Sabiaguaba"," 2,117 "," 1,043 "," 1,074 ",97.11," 536 "," 1,478 "," 103 ",25.32,69.82,4.87,43.23,3.59
"REGIONAL 2","Salinas"," 4,298 "," 2,014 "," 2,284 ",88.18," 972 "," 3,094 "," 232 ",22.62,71.99,5.4,38.91,3.51
"REGIONAL 6","São Bento"," 11,964 "," 5,771 "," 6,193 ",93.19," 3,356 "," 8,155 "," 453 ",28.05,68.16,3.79,46.71,3.36
"REGIONAL 1","São Gerardo"," 14,505 "," 6,376 "," 8,129 ",78.44," 2,314 "," 10,755 "," 1,436 ",15.95,74.15,9.9,34.87,3.27
"REGIONAL 2","São João do Tauape"," 27,598 "," 12,498 "," 15,100 ",82.77," 5,062 "," 19,810 "," 2,726 ",18.34,71.78,9.88,39.31,3.32
"REGIONAL 6","Sapiranga/Coité"," 32,158 "," 15,278 "," 16,880 ",90.51," 8,226 "," 22,449 "," 1,483 ",25.58,69.81,4.61,43.25,3.73
"REGIONAL 4","Serrinha"," 28,770 "," 13,823 "," 14,947 ",92.48," 6,735 "," 20,421 "," 1,614 ",23.41,70.98,5.61,40.88,3.47
"REGIONAL 5","Siqueira"," 33,628 "," 16,373 "," 17,255 ",94.89," 10,186 "," 22,183 "," 1,259 ",30.29,65.97,3.74,51.59,3.63
"REGIONAL 2","Varjota"," 8,421 "," 3,645 "," 4,776 ",76.32," 1,196 "," 6,376 "," 849 ",14.2,75.72,10.08,32.07,3.01
"REGIONAL 1","Vila Ellery"," 7,863 "," 3,544 "," 4,319 ",82.06," 1,535 "," 5,640 "," 688 ",19.52,71.73,8.75,39.41,3.43
"REGIONAL 4","Vila Pery"," 20,645 "," 9,517 "," 11,128 ",85.52," 4,094 "," 14,906 "," 1,645 ",19.83,72.2,7.97,38.5,3.38
"REGIONAL 4","Vila União"," 15,378 "," 7,090 "," 8,288 ",85.55," 3,052 "," 11,013 "," 1,313 ",19.85,71.62,8.54,39.63,3.38
"REGIONAL 1","Vila Velha"," 61,617 "," 29,108 "," 32,509 ",89.54," 15,394 "," 42,793 "," 3,430 ",24.98,69.45,5.57,43.99,3.55
"REGIONAL 2","Vincente Pinzon"," 45,518 "," 21,766 "," 23,752 ",91.64," 11,101 "," 31,836 "," 2,581 ",24.39,69.94,5.67,42.98,3.55
"Fonte: Censo 2010, IBGE.",,,,,,,,,,,,,
"* Bairros novos (sem informação)",,,,,,,,,,,,,
