mondubim 547352.269400 9577781.222000
ancuri 554877.057400 9572907.503000
pedras 554283.980800 9571702.075000
barroso 554161.165400 9577605.486000
sabiaguaba 563491.035600 9579539.879000
jardim_das_oliveiras 555147.381400 9582042.914000
aerolandia 554052.055100 9582778.037000
alto_da_balanca 554066.458700 9583827.810000
edson_queiroz 559707.383300 9582553.342000
coacu 558178.999500 9575059.872000
guajeru 557869.741400 9576450.561000
curio 558069.075800 9577493.401000
messejana 556287.151200 9577051.606000
lagoa_redonda 560082.052900 9577199.501000
jose_de_alencar 558594.324900 9578895.991000
parque_iracema 555955.017900 9579326.147000
cambeba 557205.522900 9579273.328000
passare 551995.894000 9578555.530000
sapiranga_coite 559347.740000 9580340.609000
parque_manibura 557097.983900 9580924.247000
cidade_dos_funcionarios 555616.285200 9580661.707000
parque_dois_irmaos 550213.442000 9578782.347000
planalto_ayrton_senna 547439.788000 9576065.146000
prefeito_jose_valter 550248.372300 9575676.995000
parque_santa_rosa 545041.846100 9577824.815000
conjunto_esperanca 545465.388100 9578444.965000
jardim_cearense 548179.725300 9579904.876000
parque_sao_jose 545708.630300 9580345.102000
maraponga 547884.438500 9580607.590000
bom_jardim 544245.342400 9580610.957000
granja_lisboa 542474.254900 9581412.265000
granja_portugal 544475.670400 9581978.220000
conjunto_ceara_ii 543241.807000 9583131.803000
conjunto_ceara_i 543761.396800 9583916.456000
serrinha 551025.951400 9581629.885000
aeroporto 552233.752200 9582925.159000
democrito_rocha 548297.413700 9584203.688000
pan_americano 548315.576000 9584895.381000
dende 549247.799100 9580255.305000
jose_bonifacio 552387.646800 9586698.217000
vila_uniao 551597.014600 9583628.796000
montese 549937.156700 9583905.566000
bom_futuro 550425.076600 9584663.090000
parreao 551379.868600 9584468.951000
fatima 552408.615300 9585410.292000
jardim_america 550945.576200 9585244.921000
damas 550135.877100 9585281.230000
benfica 551310.235200 9586445.862000
itaperi 549928.455900 9581217.495000
itaoca 549353.053400 9583063.328000
parangaba 548178.850200 9582504.435000
vila_pery 546574.403200 9581295.541000
couto_fernandes 548879.367100 9584429.206000
rodolfo_teofilo 549901.801100 9586039.212000
bela_vista 548792.066400 9585276.364000
henrique_jorge 546087.106300 9584168.965000
autran_nunes 544926.251600 9585120.530000
dom_lustosa 545797.128100 9585175.521000
parquelandia 548949.130700 9586933.512000
amadeu_furtado 548994.639500 9586219.423000
padre_andrade 546611.392100 9587093.024000
presidente_kennedy 547762.865700 9587688.013000
pici 547255.874000 9585747.362000
parque_araxa 550247.505800 9587126.301000
bonsucesso 545829.168500 9582166.852000
joao_xxiii 545843.475800 9583293.214000
joquei_clube 547250.134600 9583585.356000
de_lourdes 559663.045000 9586546.350000
papicu 558293.213900 9586685.139000
praia_de_iracema 553815.174000 9588746.806000
aldeota 555283.825300 9586897.137000
luciano_cavalcante 556691.693900 9582548.098000
guararapes 556815.988900 9584049.819000
salinas 555543.182700 9583976.729000
sao_joao_do_tauape 554676.106100 9584819.258000
dionisio_torres 555193.586300 9585750.055000
joaquiim_tavora 553701.495300 9586037.269000
varjota 557083.845500 9587339.204000
cidade_200 558679.326700 9585401.180000
manuel_dias_branco 560062.300800 9584482.609000
praia_do_futuro_ii 561683.326500 9584173.430000
coco 557765.820000 9585597.617000
praia_do_futuro_i 560431.367500 9586654.529000
meireles 555532.515600 9587965.613000
vicente_pinzon 558920.034900 9587944.849000
cais_do_porto 558823.325700 9589402.976000
centro 552535.287000 9587997.517000
moura_brasil 551745.692200 9588989.041000
sao_gerardo 549171.414000 9587718.609000
vila_ellery 548525.913000 9588480.369000
jardim_guanabara 545536.520000 9588420.085000
floresta 547073.747500 9588758.639000
alvaro_weyne 548164.053900 9589307.086000
vila_velha 543954.273900 9589659.066000
barra_do_ceara 546567.177800 9590544.693000
farias_brito 550858.089600 9587465.049000
monte_castelo 549662.423900 9588320.507000
carlito_pamplona 549478.508900 9589181.671000
pirambu 549617.644300 9589931.568000
paupina 556415.422600 9573313.776000
jardim_iracema 546253.828900 9588701.295000
conjunto_palmeiras 552395.277900 9574642.442000
jangurussu 553813.671900 9574906.130000
siqueira 542279.984100 9579420.448000
manoel_satiro 546387.865400 9579682.667000
parque_presidente_vargas 544473.454400 9577097.198000
boa_vista 553213.898000 9580021.799000
cajazeiras 554597.780100 9579607.236000
canindezinho 544070.306800 9578609.191000
quintino_cunha 544259.397500 9587832.047000
antonio_bezerra 545418.837100 9586530.531000
dias_macedo 553064.795600 9581327.933000
mucuripe 557286.808700 9588188.625000
genibau 544304.898000 9584653.431000
cristo_redentor 548336.487600 9590209.264000
jacarecanga 550552.013000 9588823.616000
