mondubim -3.820150 -38.573866
ancuri -3.864204 -38.506070
pedras -3.875112 -38.511405
barroso -3.821707 -38.512542
sabiaguaba -3.804155 -38.428526
jardim_das_oliveiras -3.781558 -38.503682
aerolandia -3.774913 -38.513551
alto_da_balanca -3.765416 -38.513426
edson_queiroz -3.776916 -38.462618
coacu -3.844714 -38.476342
guajeru -3.832135 -38.479135
curio -3.822700 -38.477345
messejana -3.826706 -38.493391
lagoa_redonda -3.825347 -38.459214
jose_de_alencar -3.810008 -38.472622
parque_iracema -3.806131 -38.496395
cambeba -3.806602 -38.485132
passare -3.813123 -38.532048
sapiranga_coite -3.796935 -38.465845
parque_manibura -3.791668 -38.486110
cidade_dos_funcionarios -3.794051 -38.499452
parque_dois_irmaos -3.811080 -38.548102
planalto_ayrton_senna -3.835674 -38.573070
prefeito_jose_valter -3.839172 -38.547773
parque_santa_rosa -3.819765 -38.594675
conjunto_esperanca -3.814153 -38.590863
jardim_cearense -3.800934 -38.566423
parque_sao_jose -3.796962 -38.588680
maraponga -3.794578 -38.569086
bom_jardim -3.794563 -38.601860
granja_lisboa -3.787321 -38.617814
granja_portugal -3.782193 -38.599791
conjunto_ceara_ii -3.771762 -38.610908
conjunto_ceara_i -3.764661 -38.606232
serrinha -3.785315 -38.540798
aeroporto -3.773591 -38.529927
democrito_rocha -3.762043 -38.565383
pan_americano -3.755786 -38.565222
dende -3.797759 -38.556806
jose_bonifacio -3.739457 -38.528559
vila_uniao -3.767229 -38.535664
montese -3.764733 -38.550614
bom_futuro -3.757877 -38.546224
parreao -3.759629 -38.537624
fatima -3.751108 -38.528364
jardim_america -3.752611 -38.541539
damas -3.752287 -38.548831
benfica -3.741745 -38.538261
itaperi -3.789051 -38.550680
itaoca -3.772355 -38.555871
parangaba -3.777416 -38.566443
vila_pery -3.788360 -38.580887
couto_fernandes -3.760000 -38.560143
rodolfo_teofilo -3.745430 -38.550942
bela_vista -3.752337 -38.560933
henrique_jorge -3.762367 -38.585288
autran_nunes -3.753763 -38.595747
dom_lustosa -3.753262 -38.587904
parquelandia -3.737344 -38.559526
amadeu_furtado -3.743804 -38.559113
padre_andrade -3.735912 -38.580579
presidente_kennedy -3.730524 -38.570212
pici -3.748083 -38.574769
parque_araxa -3.735594 -38.547834
bonsucesso -3.780481 -38.587603
joao_xxiii -3.770291 -38.587479
joquei_clube -3.767642 -38.574812
de_lourdes -3.740793 -38.463040
papicu -3.739545 -38.475376
praia_de_iracema -3.720917 -38.515714
aldeota -3.737643 -38.502479
luciano_cavalcante -3.776980 -38.489777
guararapes -3.763393 -38.488666
salinas -3.764061 -38.500128
sao_joao_do_tauape -3.756444 -38.507941
dionisio_torres -3.748021 -38.503285
joaquiim_tavora -3.745430 -38.516724
varjota -3.733634 -38.486271
cidade_200 -3.751158 -38.471892
manuel_dias_branco -3.759461 -38.459433
praia_do_futuro_ii -3.762248 -38.444833
coco -3.749386 -38.480120
praia_do_futuro_i -3.739810 -38.456121
meireles -3.727975 -38.500244
vicente_pinzon -3.728145 -38.469739
cais_do_porto -3.714955 -38.470617
centro -3.727702 -38.527236
moura_brasil -3.718736 -38.534351
sao_gerardo -3.730241 -38.557528
vila_ellery -3.723352 -38.563344
jardim_guanabara -3.723911 -38.590265
floresta -3.720841 -38.576423
alvaro_weyne -3.715875 -38.566606
vila_velha -3.712708 -38.604518
barra_do_ceara -3.704686 -38.580992
farias_brito -3.732527 -38.542337
monte_castelo -3.724793 -38.553109
carlito_pamplona -3.717004 -38.554769
pirambu -3.710219 -38.553519
paupina -3.860520 -38.492216
jardim_iracema -3.721364 -38.583806
conjunto_palmeiras -3.848521 -38.528431
jangurussu -3.846129 -38.515658
siqueira -3.805341 -38.619556
manoel_satiro -3.802952 -38.582560
parque_presidente_vargas -3.826350 -38.599791
boa_vista -3.799852 -38.521085
cajazeiras -3.803595 -38.508620
canindezinho -3.812673 -38.603428
quintino_cunha -3.729236 -38.601763
antonio_bezerra -3.741005 -38.591316
dias_macedo -3.788037 -38.522435
mucuripe -3.725949 -38.484448
genibau -3.757992 -38.601341
cristo_redentor -3.707712 -38.565058
jacarecanga -3.720238 -38.545100
