aerolandia -3.77501798 -38.5136214
aeroporto -3.77304086 -38.5295675
sao_gerardo_alagadico -3.73027696 -38.5575293
aldeota -3.73766986 -38.5024954
alto_da_balanca -3.76541946 -38.513503
alvaro_weyne -3.71661432 -38.5660276
amadeu_furtado -3.74383421 -38.5591474
ancuri -3.85787929 -38.5030043
antonio_bezerra -3.74101494 -38.591342
moura_brasil -3.71847004 -38.5347548
autran_nunes -3.75378679 -38.5957415
barra_do_ceara -3.70438081 -38.5813247
barroso -3.82174512 -38.5125482
bela_vista -3.75235358 -38.5609321
benfica -3.73941634 -38.5376649
bom_futuro -3.75787993 -38.5462408
bom_jardim -3.79452885 -38.6018911
bom_sucesso -3.78043529 -38.5876166
cais_do_porto -3.71395642 -38.4704824
cajazeiras -3.80366559 -38.508672
cambeba -3.80658733 -38.4851263
canindezinho -3.81250608 -38.6033691
carlito_pamplona -3.71702561 -38.5548044
boa_vista -3.7973373 -38.5228699
centro -3.72764024 -38.5272147
cidade_2000 -3.75114592 -38.4719226
cidade_dos_funcionarios -3.79403578 -38.499424
coacu -3.84484644 -38.4763575
coco -3.74942421 -38.4800627
conjunto_ceara_i -3.76462867 -38.6062483
conjunto_ceara_ii -3.77172279 -38.6108262
conjunto_esperanca -3.81374282 -38.5914998
palmeiras -3.85526337 -38.5260031
couto_fernandes -3.76001518 -38.5601271
cristo_redentor -3.70776503 -38.5650942
curio -3.8227007 -38.477366
damas -3.75213413 -38.548794
bairro_de_lourdes -3.74076642 -38.4651649
democrito_rocha -3.76203311 -38.565403
dende -3.79773766 -38.5568931
dias_macedo -3.78761072 -38.5222581
dom_lustosa -3.75323318 -38.5878944
edson_queiroz -3.77682589 -38.4622265
luciano_cavalcante -3.77696052 -38.4897509
dionisio_torres -3.74806767 -38.503188
farias_brito -3.73254634 -38.5424209
fatima -3.75111186 -38.5284225
floresta -3.72077929 -38.5764642
parque_genibau -3.75811556 -38.6013695
granja_lisboa -3.78720701 -38.6177533
granja_portugal -3.78218428 -38.5997984
guajeru -3.83214814 -38.4791469
guararapes -3.76340457 -38.4887899
henrique_jorge -3.76238778 -38.585307
itaoca -3.77232823 -38.5558657
itaperi -3.78906762 -38.5507158
jacarecanga -3.72005479 -38.5450882
jangurussu -3.83988861 -38.5139987
jardim_america -3.75260147 -38.5415773
jardim_cearense -3.80094326 -38.5665084
jardim_das_oliveiras -3.78125044 -38.503793
jardim_guanabara -3.72387336 -38.5902838
jardim_iracema -3.721331 -38.5838313
joao_xxiii -3.7703091 -38.5875041
joaquim_tavora -3.74544288 -38.5167257
joquei_clube -3.76763682 -38.5748103
jose_bonifacio -3.73944644 -38.5285845
jose_de_alencar -3.80997306 -38.4726191
lagoa_redonda -3.82525879 -38.4595145
sapiranga_coite -3.79691027 -38.4658333
vila_manoel_satiro -3.80295338 -38.5826404
manoel_dias_branco -3.75953987 -38.4590604
maraponga -3.79489284 -38.5691653
meireles -3.72774938 -38.5003615
messejana -3.82669164 -38.4933452
mondubim -3.81984336 -38.5736131
monte_castelo -3.72477155 -38.5532035
montese -3.76533021 -38.5502505
mucuripe -3.72588503 -38.4844829
novo_mondubim -3.84870877 -38.5635043
padre_andrade_ -3.73590915 -38.5804724
pan_americano -3.75580799 -38.5651963
papicu -3.7391455 -38.4775875
parangaba -3.77768648 -38.5664966
parque_araxa -3.73568364 -38.5479685
parque_dois_irmaos -3.81106414 -38.5481616
parque_iracema -3.80611969 -38.4963643
parque_manibura -3.79164473 -38.4861063
parque_presidente_vargas -3.82609093 -38.5997333
parque_santa_rosa -3.81978097 -38.5946997
parque_sao_jose -3.7969306 -38.5887021
parquelandia -3.73741541 -38.5595849
parreao -3.75880228 -38.5330989
passare -3.81315444 -38.5320623
paupina -3.86200966 -38.4928606
pedras -3.87533488 -38.5119679
pici -3.74818128 -38.5747762
pirambu -3.71027777 -38.5534439
planalto_airton_senna -3.83621752 -38.5729151
praia_de_iracema -3.72089112 -38.5156936
praia_do_futuro_i -3.74066351 -38.4551669
praia_do_futuro_ii -3.76167265 -38.4451434
prefeito_jose_walter -3.84010462 -38.5478499
presidente_kennedy -3.73050061 -38.5702222
quintino_cunha -3.72957213 -38.5986161
rodolfo_teofilo -3.74539222 -38.5510073
sabiaguaba -3.7985389 -38.4284324
salinas -3.76386985 -38.4999748
sao_bento -3.85474595 -38.4829972
sao_joao_do_tauape -3.75675534 -38.5087395
serrinha -3.78522559 -38.5401006
siqueira -3.80532786 -38.6191825
varjota -3.7338637 -38.4860362
vicente_pinzon -3.72794393 -38.4692101
vila_ellery -3.72311089 -38.5635525
vila_peri -3.78836833 -38.5809251
vila_uniao -3.76706872 -38.5358406
vila_velha -3.71247982 -38.6045399
