stm32l4xx_hal_spi.c:194:19:HAL_SPI_Init	24	static
stm32l4xx_hal_spi.c:298:19:HAL_SPI_DeInit	16	static
stm32l4xx_hal_spi.c:330:13:HAL_SPI_MspInit	16	static
stm32l4xx_hal_spi.c:346:13:HAL_SPI_MspDeInit	16	static
stm32l4xx_hal_spi.c:402:19:HAL_SPI_Transmit	40	static
stm32l4xx_hal_spi.c:549:19:HAL_SPI_Receive	48	static
stm32l4xx_hal_spi.c:760:19:HAL_SPI_TransmitReceive	40	static
stm32l4xx_hal_spi.c:977:19:HAL_SPI_Transmit_IT	32	static
stm32l4xx_hal_spi.c:1054:19:HAL_SPI_Receive_IT	32	static
stm32l4xx_hal_spi.c:1156:19:HAL_SPI_TransmitReceive_IT	32	static
stm32l4xx_hal_spi.c:1254:19:HAL_SPI_Transmit_DMA	32	static
stm32l4xx_hal_spi.c:1349:19:HAL_SPI_Receive_DMA	32	static
stm32l4xx_hal_spi.c:1456:19:HAL_SPI_TransmitReceive_DMA	32	static
stm32l4xx_hal_spi.c:1600:19:HAL_SPI_DMAPause	16	static
stm32l4xx_hal_spi.c:1620:19:HAL_SPI_DMAResume	16	static
stm32l4xx_hal_spi.c:1640:19:HAL_SPI_DMAStop	16	static
stm32l4xx_hal_spi.c:1671:6:HAL_SPI_IRQHandler	40	static
stm32l4xx_hal_spi.c:1735:13:HAL_SPI_TxCpltCallback	16	static
stm32l4xx_hal_spi.c:1751:13:HAL_SPI_RxCpltCallback	16	static
stm32l4xx_hal_spi.c:1767:13:HAL_SPI_TxRxCpltCallback	16	static
stm32l4xx_hal_spi.c:1783:13:HAL_SPI_TxHalfCpltCallback	16	static
stm32l4xx_hal_spi.c:1799:13:HAL_SPI_RxHalfCpltCallback	16	static
stm32l4xx_hal_spi.c:1815:13:HAL_SPI_TxRxHalfCpltCallback	16	static
stm32l4xx_hal_spi.c:1831:13:HAL_SPI_ErrorCallback	16	static
stm32l4xx_hal_spi.c:1869:22:HAL_SPI_GetState	16	static
stm32l4xx_hal_spi.c:1881:10:HAL_SPI_GetError	16	static
stm32l4xx_hal_spi.c:1906:13:SPI_DMATransmitCplt	24	static
stm32l4xx_hal_spi.c:1945:13:SPI_DMAReceiveCplt	24	static
stm32l4xx_hal_spi.c:2019:13:SPI_DMATransmitReceiveCplt	24	static
stm32l4xx_hal_spi.c:2086:13:SPI_DMAHalfTransmitCplt	24	static
stm32l4xx_hal_spi.c:2099:13:SPI_DMAHalfReceiveCplt	24	static
stm32l4xx_hal_spi.c:2112:13:SPI_DMAHalfTransmitReceiveCplt	24	static
stm32l4xx_hal_spi.c:2125:13:SPI_DMAError	24	static
stm32l4xx_hal_spi.c:2143:13:SPI_2linesRxISR_8BIT	16	static
stm32l4xx_hal_spi.c:2190:13:SPI_2linesRxISR_8BITCRC	24	static
stm32l4xx_hal_spi.c:2216:13:SPI_2linesTxISR_8BIT	16	static
stm32l4xx_hal_spi.c:2255:13:SPI_2linesRxISR_16BIT	16	static
stm32l4xx_hal_spi.c:2286:13:SPI_2linesRxISR_16BITCRC	24	static
stm32l4xx_hal_spi.c:2304:13:SPI_2linesTxISR_16BIT	16	static
stm32l4xx_hal_spi.c:2334:13:SPI_RxISR_8BITCRC	24	static
stm32l4xx_hal_spi.c:2353:13:SPI_RxISR_8BIT	16	static
stm32l4xx_hal_spi.c:2381:13:SPI_RxISR_16BITCRC	24	static
stm32l4xx_hal_spi.c:2400:13:SPI_RxISR_16BIT	16	static
stm32l4xx_hal_spi.c:2429:13:SPI_TxISR_8BIT	16	static
stm32l4xx_hal_spi.c:2452:13:SPI_TxISR_16BIT	16	static
stm32l4xx_hal_spi.c:2479:26:SPI_WaitFlagStateUntilTimeout	32	static
stm32l4xx_hal_spi.c:2530:26:SPI_WaitFifoStateUntilTimeout	32	static
stm32l4xx_hal_spi.c:2586:26:SPI_EndRxTransaction	16	static
stm32l4xx_hal_spi.c:2618:26:SPI_EndRxTxTransaction	16	static
stm32l4xx_hal_spi.c:2641:13:SPI_CloseRxTx_ISR	16	static
stm32l4xx_hal_spi.c:2689:13:SPI_CloseRx_ISR	16	static
stm32l4xx_hal_spi.c:2727:13:SPI_CloseTx_ISR	24	static
