stm32l4xx_it.c:65:6:NMI_Handler	4	static
stm32l4xx_it.c:74:6:HardFault_Handler	4	static
stm32l4xx_it.c:87:6:MemManage_Handler	4	static
stm32l4xx_it.c:100:6:BusFault_Handler	4	static
stm32l4xx_it.c:113:6:UsageFault_Handler	4	static
stm32l4xx_it.c:126:6:SVC_Handler	4	static
stm32l4xx_it.c:135:6:DebugMon_Handler	4	static
stm32l4xx_it.c:144:6:PendSV_Handler	4	static
stm32l4xx_it.c:153:6:SysTick_Handler	8	static
stm32l4xx_it.c:187:6:USB_IRQHandler	8	static
stm32l4xx_it.c:197:6:EXTI0_IRQHandler	8	static
stm32l4xx_it.c:207:13:GetPointerData	24	static
