stm32l4xx_hal_firewall.c:121:19:HAL_FIREWALL_Config	24	static
stm32l4xx_hal_firewall.c:197:6:HAL_FIREWALL_GetConfig	24	static
stm32l4xx_hal_firewall.c:234:6:HAL_FIREWALL_EnableFirewall	4	static
stm32l4xx_hal_firewall.c:259:6:HAL_FIREWALL_EnablePreArmFlag	4	static
stm32l4xx_hal_firewall.c:285:6:HAL_FIREWALL_DisablePreArmFlag	4	static
