stm32l4xx_hal_smartcard.c:246:19:HAL_SMARTCARD_Init	16	static
stm32l4xx_hal_smartcard.c:308:19:HAL_SMARTCARD_DeInit	16	static
stm32l4xx_hal_smartcard.c:348:13:HAL_SMARTCARD_MspInit	16	static
stm32l4xx_hal_smartcard.c:364:13:HAL_SMARTCARD_MspDeInit	16	static
stm32l4xx_hal_smartcard.c:441:19:HAL_SMARTCARD_Transmit	24	static
stm32l4xx_hal_smartcard.c:531:19:HAL_SMARTCARD_Receive	24	static
stm32l4xx_hal_smartcard.c:597:19:HAL_SMARTCARD_Transmit_IT	24	static
stm32l4xx_hal_smartcard.c:660:19:HAL_SMARTCARD_Receive_IT	24	static
stm32l4xx_hal_smartcard.c:715:19:HAL_SMARTCARD_Transmit_DMA	32	static
stm32l4xx_hal_smartcard.c:793:19:HAL_SMARTCARD_Receive_DMA	32	static
stm32l4xx_hal_smartcard.c:852:6:HAL_SMARTCARD_IRQHandler	16	static
stm32l4xx_hal_smartcard.c:942:13:HAL_SMARTCARD_TxCpltCallback	16	static
stm32l4xx_hal_smartcard.c:958:13:HAL_SMARTCARD_RxCpltCallback	16	static
stm32l4xx_hal_smartcard.c:974:13:HAL_SMARTCARD_ErrorCallback	16	static
stm32l4xx_hal_smartcard.c:1014:28:HAL_SMARTCARD_GetState	16	static
stm32l4xx_hal_smartcard.c:1025:10:HAL_SMARTCARD_GetError	16	static
stm32l4xx_hal_smartcard.c:1050:26:SMARTCARD_Transmit_IT	16	static
stm32l4xx_hal_smartcard.c:1085:26:SMARTCARD_EndTransmit_IT	16	static
stm32l4xx_hal_smartcard.c:1127:26:SMARTCARD_Receive_IT	16	static
stm32l4xx_hal_smartcard.c:1176:26:SMARTCARD_WaitOnFlagUntilTimeout	32	static
stm32l4xx_hal_smartcard.c:1240:13:SMARTCARD_DMATransmitCplt	24	static
stm32l4xx_hal_smartcard.c:1259:13:SMARTCARD_DMAReceiveCplt	24	static
stm32l4xx_hal_smartcard.c:1287:13:SMARTCARD_DMAError	24	static
stm32l4xx_hal_smartcard.c:1303:26:SMARTCARD_SetConfig	24	static
stm32l4xx_hal_smartcard.c:1401:13:SMARTCARD_AdvFeatureConfig	16	static
stm32l4xx_hal_smartcard.c:1463:26:SMARTCARD_CheckIdleState	16	static
