298484 0
295408 1
287488 2
298063 3
297124 4
298114 5
288149 6
277259 7
288459 8
280956 9
122531 10
120133 11
119247 12
119872 13
119768 14
119767 15
121642 16
121381 17
123778 18
120443 19
120599 20
121276 21
120538 22
122048 23
120590 24
122204 25
120485 26
123559 27
119443 28
121891 29
131111 30
122724 31
119234 32
121421 33
120327 34
120692 35
123505 36
119598 37
122093 38
118760 39
122093 40
120061 41
121363 42
119905 43
123239 44
119957 45
122561 46
121832 47
121519 48
119800 49
121623 50
121102 51
122405 52
120477 53
119959 54
119751 55
122251 56
119698 57
119490 58
123917 59
120739 60
121469 61
120167 62
121312 63
120999 64
118708 65
120218 66
119124 67
132406 68
120947 69
122109 70
122734 71
121379 72
118722 73
122994 74
120857 75
121899 76
121117 77
120336 78
119449 79
120335 80
119397 81
120647 82
120855 83
119188 84
120229 85
121972 86
136814 87
129888 88
133690 89
132596 90
126815 91
119889 92
118588 93
120306 94
121035 95
121869 96
118588 97
122025 98
120516 99
121922 100
120151 101
120548 102
121121 103
119819 104
119247 105
132318 106
132631 107
130549 108
131226 109
126592 110
122686 111
118834 112
121021 113
120292 114
119303 115
120502 116
121908 117
121877 118
123179 119
121565 120
120054 121
120471 122
122086 123
122971 124
119117 125
122086 126
122085 127
126357 128
123076 129
121512 130
122346 131
117554 132
119585 133
120566 134
118013 135
120149 136
122805 137
121452 138
119212 139
123743 140
130358 141
118535 142
120671 143
121348 144
119630 145
123275 146
120307 147
120046 148
122599 149
120365 150
120937 151
117396 152
120521 153
119740 154
121042 155
134167 156
122604 157
123020 158
120730 159
122761 160
121198 161
121667 162
120677 163
122500 164
121353 165
119429 166
123387 167
120472 168
119536 169
121515 170
119954 171
119642 172
118602 173
122976 174
119592 175
121832 176
119385 177
121052 178
120064 179
118763 180
119804 181
117696 182
122123 183
120716 184
120352 185
120717 186
119623 187
119936 188
118635 189
120614 190
119885 191
119677 192
118167 193
120563 194
119416 195
119573 196
119418 197
122771 198
123240 199
125688 200
123031 201
119646 202
122198 203
120114 204
118551 205
121937 206
123031 207
122927 208
119958 209
120947 210
121207 211
118499 212
119124 213
122206 214
121164 215
120695 216
121684 217
121736 218
118767 219
121996 220
124600 221
121840 222
126058 223
122517 224
118765 225
132100 226
122203 227
119755 228
120744 229
122833 230
121948 231
120228 232
123250 233
121218 234
118770 235
119811 236
118456 237
122623 238
120539 239
122831 240
121060 241
120174 242
121007 243
120278 244
119495 245
131047 246
122040 247
123810 248
120271 249
120897 250
122042 251
119908 252
120846 253
121055 254
119390 255
122046 256
119808 257
122724 258
121527 259
126005 260
120539 261
122838 262
121797 263
120548 264
121537 265
120236 266
120132 267
120549 268
120654 269
125757 270
121540 271
122529 272
123520 273
120760 274
119042 275
122427 276
119510 277
123667 278
120803 279
122418 280
125023 281
120961 282
123304 283
122055 284
118984 285
120599 286
121068 287
121380 288
122370 289
123464 290
122788 291
122996 292
116174 293
121056 294
120067 295
120119 296
121214 297
122412 298
122882 299
120746 300
122258 301
121477 302
120488 303
120384 304
118198 305
122676 306
122313 307
123562 308
118772 309
122776 310
122881 311
121268 312
120851 313
121268 314
119186 315
122780 316
121791 317
121114 318
122834 319
119293 320
120387 321
120387 322
121221 323
122524 324
126169 325
122115 326
121542 327
122218 328
119770 329
120446 330
119404 331
120132 332
121383 333
127894 334
120080 335
122736 336
125965 337
121277 338
122370 339
130131 340
122109 341
120976 342
125299 343
120297 344
118785 345
123057 346
119045 347
120087 348
129099 349
119147 350
118365 351
123627 352
116541 353
118833 354
127846 355
117843 356
119510 357
119786 358
118222 359
120931 360
137343 361
129578 362
131350 363
137080 364
118948 365
118478 366
124157 367
119780 368
118633 369
122904 370
118424 371
118943 372
134416 373
118654 374
117613 375
122092 376
116830 377
117612 378
111778 379
116310 380
120269 381
122404 382
118341 383
120685 384
116830 385
118861 386
118757 387
126310 388
118445 389
118930 390
120076 391
118878 392
121378 393
120492 394
117992 395
120231 396
118981 397
118980 398
119240 399
119448 400
120958 401
118875 402
119656 403
119291 404
117416 405
117580 406
119298 407
120705 408
118984 409
119297 410
119036 411
119244 412
120807 413
119035 414
119035 415
119451 416
120076 417
119399 418
117939 419
119085 420
117731 421
119759 422
117883 423
119446 424
117205 425
119445 426
120227 427
120018 428
119757 429
120069 430
118455 431
121267 432
119860 433
120485 434
120329 435
118870 436
118349 437
119436 438
118811 439
118655 440
118863 441
119643 442
120894 443
118967 444
119070 445
119018 446
119018 447
119383 448
118498 449
118601 450
119956 451
120164 452
118965 453
119370 454
120880 455
119318 456
119474 457
120672 458
120100 459
119891 460
119422 461
117965 462
118277 463
120048 464
118955 465
120153 466
120101 467
122601 468
121611 469
121918 470
123740 471
120095 472
123845 473
120512 474
122856 475
122491 476
122128 477
121763 478
120930 479
121555 480
120982 481
121815 482
122702 483
122128 484
120982 485
119407 486
122012 487
121334 488
120658 489
121596 490
119982 491
121492 492
122221 493
121858 494
120035 495
121806 496
120713 497
121390 498
117068 499
500