stm32l4xx_hal_rng.c:118:19:HAL_RNG_Init	16	static
stm32l4xx_hal_rng.c:159:19:HAL_RNG_DeInit	16	static
stm32l4xx_hal_rng.c:190:13:HAL_RNG_MspInit	16	static
stm32l4xx_hal_rng.c:205:13:HAL_RNG_MspDeInit	16	static
stm32l4xx_hal_rng.c:244:19:HAL_RNG_GenerateRandomNumber	24	static
stm32l4xx_hal_rng.c:297:19:HAL_RNG_GenerateRandomNumber_IT	24	static
stm32l4xx_hal_rng.c:347:6:HAL_RNG_IRQHandler	16	static
stm32l4xx_hal_rng.c:389:10:HAL_RNG_GetRandomNumber	16	static
stm32l4xx_hal_rng.c:408:10:HAL_RNG_GetRandomNumber_IT	24	static
stm32l4xx_hal_rng.c:435:10:HAL_RNG_ReadLastRandomNumber	16	static
stm32l4xx_hal_rng.c:446:13:HAL_RNG_ReadyDataCallback	16	static
stm32l4xx_hal_rng.c:462:13:HAL_RNG_ErrorCallback	16	static
stm32l4xx_hal_rng.c:495:22:HAL_RNG_GetState	16	static
