stm32l4xx_hal_pcd_ex.c:293:20:HAL_PCDEx_PMAConfig	32	static
stm32l4xx_hal_pcd_ex.c:336:19:HAL_PCDEx_ActivateBCD	24	static
stm32l4xx_hal_pcd_ex.c:353:19:HAL_PCDEx_DeActivateBCD	24	static
stm32l4xx_hal_pcd_ex.c:367:6:HAL_PCDEx_BCD_VBUSDetect	24	static
stm32l4xx_hal_pcd_ex.c:433:19:HAL_PCDEx_ActivateLPM	24	static
stm32l4xx_hal_pcd_ex.c:452:19:HAL_PCDEx_DeActivateLPM	24	static
stm32l4xx_hal_pcd_ex.c:472:13:HAL_PCDEx_LPM_Callback	16	static
stm32l4xx_hal_pcd_ex.c:489:13:HAL_PCDEx_BCD_Callback	16	static
