stm32l4xx_ll_usb.c:1602:19:USB_CoreInit	16	static
stm32l4xx_ll_usb.c:1622:19:USB_EnableGlobalInt	24	static
stm32l4xx_ll_usb.c:1642:19:USB_DisableGlobalInt	24	static
stm32l4xx_ll_usb.c:1664:19:USB_SetCurrentMode	16	static
stm32l4xx_ll_usb.c:1686:19:USB_DevInit	16	static
stm32l4xx_ll_usb.c:1715:19:USB_FlushTxFifo	16	static
stm32l4xx_ll_usb.c:1734:19:USB_FlushRxFifo	16	static
stm32l4xx_ll_usb.c:1753:19:USB_ActivateEndpoint	24	static
stm32l4xx_ll_usb.c:1838:19:USB_DeactivateEndpoint	16	static
stm32l4xx_ll_usb.c:1891:19:USB_EPStartXfer	64	static
stm32l4xx_ll_usb.c:1979:19:USB_WritePacket	24	static
stm32l4xx_ll_usb.c:2003:7:USB_ReadPacket	24	static
stm32l4xx_ll_usb.c:2024:19:USB_EPSetStall	16	static
stm32l4xx_ll_usb.c:2051:19:USB_EPClearStall	16	static
stm32l4xx_ll_usb.c:2071:19:USB_StopDevice	16	static
stm32l4xx_ll_usb.c:2092:20:USB_SetDevAddress	16	static
stm32l4xx_ll_usb.c:2108:20:USB_DevConnect	16	static
stm32l4xx_ll_usb.c:2121:20:USB_DevDisconnect	16	static
stm32l4xx_ll_usb.c:2134:11:USB_ReadInterrupts	24	static
stm32l4xx_ll_usb.c:2147:10:USB_ReadDevAllOutEpInterrupt	16	static
stm32l4xx_ll_usb.c:2165:10:USB_ReadDevAllInEpInterrupt	16	static
stm32l4xx_ll_usb.c:2185:10:USB_ReadDevOutEPInterrupt	16	static
stm32l4xx_ll_usb.c:2206:10:USB_ReadDevInEPInterrupt	16	static
stm32l4xx_ll_usb.c:2226:7:USB_ClearInterrupts	16	static
stm32l4xx_ll_usb.c:2244:19:USB_EP0_OutStart	24	static
stm32l4xx_ll_usb.c:2263:19:USB_ActivateRemoteWakeup	16	static
stm32l4xx_ll_usb.c:2275:19:USB_DeActivateRemoteWakeup	16	static
stm32l4xx_ll_usb.c:2289:6:USB_WritePMA	40	static
stm32l4xx_ll_usb.c:2315:6:USB_ReadPMA	40	static
