 hdr=CPU32 Assembler           Thu Dec 09 20:43:26 2004
 subtitle=boot.s
 src=boot.s
		       	*
		       	*	*****************************************
		       	*	*	ROOT.SRC			*
		       	*	*	ROOT TASK START UP		*
		       	*	*	ALLEN NANCE			*
		       	*	*	28 AUG, 1987			*
		       	*	*****************************************
		       	*
		       		XREF	RESET2,_burn
		       		XDEF	BOOT
		       		XDEF	CPUINI
		       		XDEF	START
		       		XDEF	_BOOT
		       		XDEF	_BURNFLASH
		       	
       <00000000>      	RAM_BASE  EQU      $0                  BCC RAM base address
       <00040000>      	RAM_SIZE  EQU      $40000              BCC RAM size (bytes)
       <00080000>      	ROM_BASE  EQU      $80000              BCC EPROM base address
       <00040000>      	ROM_SIZE  EQU      $40000              BCC EPROM size (bytes)
       <FFFFFA00>      	SIM       EQU      $FFFFFA00           BCC M68332 System Integration Module base addr
       <FFFFFB00>      	RAMCR     EQU      $FFFFFB00           BCC M68332 RAM Control Module base address
       <FFFFF800>      	AUTO_BASE EQU      $FFFFF800           Autovector base address
		       	
       <FFFFFC00>      	QMCR      EQU      $FFFFFC00           BCC M68332 QSM MCR Register
       <FFFFFC04>      	QILR	  EQU	   $FFFFFC04
       <FFFFFC05>      	QIVR	  EQU	   $FFFFFC05
		       	
		       	
       <00FFFE00>      	TPUBASE	  EQU	$FFFE00
       <00FFFE00>      	TMCR	  EQU	TPUBASE+0
       <00FFFE0C>      	CFSR0	  EQU	TPUBASE+$C
       <00FFFE0E>      	CFSR1	  EQU	TPUBASE+$E
       <00FFFE10>      	CFSR2	  EQU	TPUBASE+$10
       <00FFFE12>      	CFSR3	  EQU	TPUBASE+$12
       <00FFFE14>      	HSQR0	  EQU	TPUBASE+$14
       <00FFFE16>      	HSQR1	  EQU	TPUBASE+$16
       <00FFFE18>      	HSRR0	  EQU	TPUBASE+$18
       <00FFFE1A>      	HSRR1	  EQU	TPUBASE+$1A
       <00FFFE1C>      	CPR0	  EQU	TPUBASE+$1C
       <00FFFE1E>      	CPR1	  EQU	TPUBASE+$1E
		       	
       <00000400>      	VECTSIZ  EQU       $400                Vector table size
		       	
		       	*
		       	* Interrupt levels & vectors
		       	*
       <00000007>      	ABORTLVL EQU       7                   abort level
       <0000001F>      	ABORTVEC EQU       31                  abort vector
       <00000007>      	ACFAILVL EQU       7                   AC-Fail level
       <00000041>      	ACFAILVC EQU       65                  AC-Fail vector
       <00000006>      	TIMERLVL EQU       6                   timer level: M68332 periodic int. timer
       <00000042>      	TIMERVEC EQU       66                  timer vector
		       	
		       	*
		       	*  Setup Base Addresses:
		       	*    1. A31-A24 must= 0  (MC68332 only uses A0-A23; rest are unused!)
		       	*    2. A10-A0  must= 0  (for Base Address Register usage).
		       	*
       <00FFF800>      	ADDRMASK EQU       $00FFF800           Address mask (24-bits, A10-A0= 0)
       <00000000>      	RAM      EQU       RAM_BASE&ADDRMASK   Setup Base Addresses
       <00080000>      	ROM      EQU       ROM_BASE&ADDRMASK   Setup Base Addresses
		       	
       <00000000>      	CSBAR_XX EQU       $0000               Reset (unused) value for CSBARn
       <00000000>      	CSOR_XX  EQU       $0000               Reset (unused) value for CSORn
		       	
		       	*
		       	* Option Register Equates (CSORBT, CSORn):
		       	*
       <00000000>      	B2K      EQU       0                   2K    block size
       <00000001>      	B8K      EQU       1                   8K    block size
       <00000002>      	B16K     EQU       2                   16K   block size
       <00000003>      	B64K     EQU       3                   64K   block size
       <00000004>      	B128K    EQU       4                   128K  block size
       <00000005>      	B256K    EQU       5                   256K  block size
       <00000006>      	B512K    EQU       6                   512K  block size
       <00000007>      	B1M      EQU       7                   1MB   block size
       <00000000>      	ASYNC    EQU       $0000               Asynchronous mode
       <00008000>      	SYNC     EQU       $8000               Synchronous  mode
       <00004000>      	CS_UPPB  EQU       2*$2000             Upper byte
       <00002000>      	CS_LOWB  EQU       1*$2000             Lower byte
       <00006000>      	CS_BOTHB EQU       3*$2000             Both  bytes (upper or lower)
       <00000800>      	CS_R     EQU       1*$800              Read
       <00001000>      	CS_W     EQU       2*$800              Write
       <00001800>      	CS_RW    EQU       3*$800              Read or write
       <00000000>      	CS_AS    EQU       0*$400              Address Strobe (AS*)
       <00000400>      	CS_DS    EQU       1*$400              Data    Strobe (DS*)
       <0000000E>      	CS_FAST  EQU       14              Fast     termination DSACK*
       <0000000F>      	CS_EXT   EQU       15              External termination DSACK*
       <00000040>      	CS_WAIT  EQU       1*$40               Wait cycles for DSACK*
       <00000000>      	CS_CSP   EQU       0*$10               CPU  space
       <00000010>      	CS_USP   EQU       1*$10               User space
       <00000020>      	CS_SSP   EQU       2*$10               Supervisor space
       <00000030>      	CS_SUSP  EQU       3*$10               Supervisor/User space
       <00000002>      	CS_LVL   EQU       1*$2                Interrupt priority level
       <00000001>      	CS_AVEC  EQU       1                   Autovector enable
		       	
       <00000000>      	CSDIO3   EQU       0			Chip Select Discrete I/O Bits
       <00000001>      	CSDIO4   EQU       1
       <00000002>      	CSDIO5   EQU       2
       <00000003>      	CSDIO6   EQU       3
       <00000004>      	CSDIO7   EQU       4
       <00000005>      	CSDIO8   EQU       5
       <00000006>      	CSDIO9   EQU       6
		       	
		       	*
		       	*  NOTE: Unused upper address lines are specified as 1's so ABSOLUTE SHORT
		       	*        addressing (sign extension) can be used.
		       	*
       <00002700>      	SR_VAL    EQU      $2700               status register initial value.
		       	
       <FFFFFB00>      	RAMMCR   EQU       RAMCR+$00           RAM Module Configuration Register
       <FFFFFB04>      	RAMBAR   EQU       RAMCR+$04           RAM Module Base Address/Status Register
       <FFFFFA04>      	SYNCR    EQU       SIM+$04             Clock Synthesizer Control Register
       <00004000>      	VCO_X    EQU       $4000               VCO Frequency Control Bit X value
       <00000002>      	STSIM    EQU       $0002               Keep VCO going during STOPLP
       <FFFFFA11>      	PRTE_DAT  EQU      SIM+$11             PORT F DATA REG
       <FFFFFA15>      	PRTE_DDR  EQU      SIM+$15             PORT F DATA DIRECTION REG
       <FFFFFA17>      	PRTE_PAR  EQU      SIM+$17             PORT F DATA PIN ASSIGNMENT REG
       <FFFFFA19>      	PRTF_DAT  EQU      SIM+$19             PORT F DATA REG
       <FFFFFA1D>      	PRTF_DDR  EQU      SIM+$1D             PORT F DATA DIRECTION REG
       <FFFFFA1F>      	PRTF_PAR  EQU      SIM+$1F             PORT F DATA PIN ASSIGNMENT REG
       <FFFFFA20>      	SYPCR    EQU       SIM+$20             System Protection Control Register
       <FFFFFA22>      	PICR     EQU       SIM+$22             
       <FFFFFA24>      	PITR     EQU       SIM+$24
       <FFFFFA41>      	CSPDR    EQU       SIM+$41             Discrete I/O Data Register
       <FFFFFA44>      	CSPAR    EQU       SIM+$44             Chip Select Pin Assignment Register
       <FFFFFA44>      	CSPAR0   EQU       SIM+$44             Chip Select Pin Assignment Register
       <FFFFFA46>      	CSPAR1   EQU       SIM+$46             Chip Select Pin Assignment Register
       <FFFFFA48>      	CSBARBT  EQU       SIM+$48             Chip Select Base Boot Register
       <FFFFFA4A>      	CSORBT   EQU       SIM+$4A             Chip Select Option Boot Register
       <FFFFFA4C>      	CSBAR0   EQU       SIM+$4C             Chip Select 0 Base Register
       <FFFFFA4E>      	CSOR0    EQU       SIM+$4E             Chip Select 0 Option Register
       <FFFFFA50>      	CSBAR1   EQU       SIM+$50             Chip Select 1 Base Register
       <FFFFFA52>      	CSOR1    EQU       SIM+$52             Chip Select 1 Option Register
       <FFFFFA54>      	CSBAR2   EQU       SIM+$54             Chip Select 2 Base Register
       <FFFFFA56>      	CSOR2    EQU       SIM+$56             Chip Select 2 Option Register
       <FFFFFA58>      	CSBAR3   EQU       SIM+$58             Chip Select 2 Base Register
       <FFFFFA5A>      	CSOR3    EQU       SIM+$5a             Chip Select 2 Option Register
       <FFFFFA5C>      	CSBAR4   EQU       SIM+$5c             Chip Select 2 Base Register
       <FFFFFA5E>      	CSOR4    EQU       SIM+$5e             Chip Select 2 Option Register
       <FFFFFA60>      	CSBAR5   EQU       SIM+$60             Chip Select 2 Base Register
       <FFFFFA62>      	CSOR5    EQU       SIM+$62             Chip Select 2 Option Register
       <FFFFFA64>      	CSBAR6   EQU       SIM+$64             Chip Select 2 Base Register
       <FFFFFA66>      	CSOR6    EQU       SIM+$66             Chip Select 2 Option Register
       <FFFFFA68>      	CSBAR7   EQU       SIM+$68             Chip Select 2 Base Register
       <FFFFFA6A>      	CSOR7    EQU       SIM+$6a             Chip Select 2 Option Register
       <FFFFFA6C>      	CSBAR8   EQU       SIM+$6c             Chip Select 2 Base Register
       <FFFFFA6E>      	CSOR8    EQU       SIM+$6e             Chip Select 2 Option Register
       <FFFFFA70>      	CSBAR9   EQU       SIM+$70             Chip Select 2 Base Register
       <FFFFFA72>      	CSOR9    EQU       SIM+$72             Chip Select 2 Option Register
       <FFFFFA74>      	CSBAR10  EQU       SIM+$74             Chip Select 2 Base Register
       <FFFFFA76>      	CSOR10   EQU       SIM+$76             Chip Select 2 Option Register
		       	*
/00		       		SECTION	burncode
000000 00001000	       		DC.L    $1000
000004 00000000	       		DC.L    BOOT            ;RESET TO BOOT CODE
		       	
000008 0806	       	.CSBARBT DC.W      ROM/256+B512K       CSBOOT base & option register values
00000A 78B0	       	.CSORBT  DC.W      2*CS_WAIT+CS_BOTHB+CS_RW+CS_AS+CS_SUSP
		       	
00000C 0005	       	CSBAR4$  DC.W      RAM/256+B256K        CS0  base & option register values
00000E 38B0	       	CSOR4$   DC.W      2*CS_WAIT+CS_LOWB+CS_RW+CS_AS+CS_SUSP
		       	
000010 0005	       	CSBAR5$  DC.W      RAM/256+B256K        CS0  base & option register values
000012 58B0	       	CSOR5$   DC.W      2*CS_WAIT+CS_UPPB+CS_RW+CS_AS+CS_SUSP
		       	
000014 400738F0	       	CSBAR2$  DC.L      $400738f0		MASS RAM Lower
000018 130378B0	       	CSBAR3$  DC.L      $130378b0		AVEC
00001C 400758F0	       	CSBAR0$  DC.L      $400758f0		MASS RAM Upper
000020 11007A30	       	CSBAR1$  DC.L      $11007A30		IDE Board
000024 FFF82FC1	       	CSBAR6$  DC.L      $FFF82FC1		A19
000028 170378B0	       	CSBAR7$  DC.L      $170378b0		UNUSED
00002C 180378B0	       	CSBAR8$  DC.L      $180378b0		UNUSED
000030 190378B0	       	CSBAR9$  DC.L      $190378b0		UNUSED
000034 B0007B70	       	CSBAR10$ DC.L      $B0007b70		UNUSED
		       	
000038 0001	       		DC.W	1
00003A 4E4F	       	_BOOT	TRAP	#15
		       	
		       	
00003C 		       	START
00003C 46FC2700	       	BOOT	MOVE.W	#SR_VAL,SR		;Ensure status register initialized.
000040 31FC3000FB04    		MOVE.W	#$3000,RAMBAR
000046 2E7C00300800    		MOVE.L	#$300000+2048,SP	;SET TEMP SSP
		       	
00004C 4EB900000000    		JSR	CPUINI
		       	
000052 08F80007FA11    		BSET.B	#7,PRTE_DAT		;HIT WTCDOG
000058 08B80007FA11    		BCLR.B	#7,PRTE_DAT
		       	
00005E 1038FA19	       		MOVE.B	PRTF_DAT,D0		:test for BURN Boot
000062 02400008	       		ANDI	#$08,D0
000066 4A40	       		TST	D0
000068 6672	       		BNE	NOBURN
		       	
00006A 33FC5048	       		MOVE	#$5048,TMCR		1.25 MHZ TCR1 AND TCR2
00006E 00FFFE00
000072 33FC0000	       		MOVE	#$0000,CPR0
000076 00FFFE1C
00007A 33FC0000	       		MOVE	#$0000,CPR1
00007E 00FFFE1E
000082 33FC8888	       		MOVE	#$8888,CFSR0
000086 00FFFE0C
00008A 33FC8888	       		MOVE	#$8888,CFSR1
00008E 00FFFE0E
000092 33FC8888	       		MOVE	#$8888,CFSR2
000096 00FFFE10
00009A 33FC8888	       		MOVE	#$8888,CFSR3
00009E 00FFFE12
		       	
0000A2 33FC0000	       		MOVE	#$0000,HSQR0
0000A6 00FFFE14
0000AA 33FC0000	       		MOVE	#$0000,HSQR1
0000AE 00FFFE16
0000B2 33FC5655	       		MOVE	#$5655,HSRR0		TPU 12 low for RS232 enable
0000B6 00FFFE18
0000BA 33FC555A	       		MOVE	#$555A,HSRR1
0000BE 00FFFE1A
0000C2 33FCAAAA	       		MOVE	#$AAAA,CPR0
0000C6 00FFFE1C
0000CA 33FCAAAA	       		MOVE	#$AAAA,CPR1
0000CE 00FFFE1E
		       	
0000D2 46FC2000	       		MOVE	#$2000,SR
0000D6 4EF900000000    		JMP	_burn
		       	
0000DC 207900000000    	NOBURN	MOVE.L	RESET2+4,A0		;GET SYSENT ADDRESS
0000E2 4ED0	       		JMP	(A0)
		       	
0000E4 		       	CPUINI
		       	* Set up SYSTEM PROTECTION REGISTER:
		       	*
0000E4 31FC006CFA20    	        MOVE.W    #$6C,SYPCR            Turn off cop, DBF: BERR=16 clocks.
		       	
		       	* Now let's go to 16.00 MHZ:
		       	*
0000EA 31FC7182FA04    	        MOVE.W    #$7182,SYNCR		X-bit doubles the current speed!
0000F0 31FCC244FA00    		MOVE      #$C244,SIM
		       	
0000F6 21FC3CFF02A9    		MOVE.L    #$3CFF02A9,CSPAR
0000FC FA44
		       	
0000FE 203900000008    	        MOVE.L    .CSBARBT,D0
000104 21C0FA48	       	        MOVE.L    D0,CSBARBT
000108 20390000001C    	        MOVE.L    CSBAR0$,D0
00010E 21C0FA4C	       	        MOVE.L    D0,CSBAR0
000112 203900000020    	        MOVE.L    CSBAR1$,D0
000118 21C0FA50	       	        MOVE.L    D0,CSBAR1
00011C 203900000014    	        MOVE.L    CSBAR2$,D0
000122 21C0FA54	       	        MOVE.L    D0,CSBAR2
000126 203900000018    	        MOVE.L    CSBAR3$,D0
00012C 21C0FA58	       	        MOVE.L    D0,CSBAR3
000130 20390000000C    	        MOVE.L    CSBAR4$,D0
000136 21C0FA5C	       	        MOVE.L    D0,CSBAR4
00013A 203900000010    	        MOVE.L    CSBAR5$,D0
000140 21C0FA60	       	        MOVE.L    D0,CSBAR5
000144 203900000024    	        MOVE.L    CSBAR6$,D0
00014A 21C0FA64	       	        MOVE.L    D0,CSBAR6
00014E 203900000028    	        MOVE.L    CSBAR7$,D0
000154 21C0FA68	       	        MOVE.L    D0,CSBAR7
000158 20390000002C    	        MOVE.L    CSBAR8$,D0
00015E 21C0FA6C	       	        MOVE.L    D0,CSBAR8
000162 203900000030    	        MOVE.L    CSBAR9$,D0
000168 21C0FA70	       	        MOVE.L    D0,CSBAR9
00016C 203900000034    	        MOVE.L    CSBAR10$,D0
000172 21C0FA74	       	        MOVE.L    D0,CSBAR10
		       	
000176 11FC0000FA41    		MOVE.B	#$00,CSPDR		;INIT ALL CS I/O LOW
		       	
00017C 11FC0000FA11    		MOVE.B	#$00,PRTE_DAT		;ALL HIGH
000182 11FC0010FA17    		MOVE.B	#$10,PRTE_PAR		;ALL E OUTPUTS EXCEPT DS
000188 11FC00D3FA15    		MOVE.B	#$D3,PRTE_DDR
		       	
00018E 11FC0000FA19    		MOVE.B	#$00,PRTF_DAT		;TRGENB
000194 11FC0000FA1F    		MOVE.B	#$00,PRTF_PAR		;MODCLK USED FOR TRIGGER ENABLE
00019A 11FC0001FA1D    		MOVE.B	#$01,PRTF_DDR
		       	
0001A0 31FC000FFC00    		MOVE.W	#$000F,QMCR		;enable User mode access
0001A6 11FC0011FC04    		MOVE.B	#$11,QILR		 
0001AC 11FC0048FC05    		MOVE.B	#$48,QIVR		 
		       	
0001B2 4E75	       		RTS
		       	
		       	
		       	
		       	********************
0001B4 		       	_BURNFLASH
		       	
0001B4 48E7F8E0	       		MOVEM.L	D0-D4/A0-A2,-(SP)
		       	
0001B8 41F900000000    		LEA	PRGCODE,A0
0001BE 43F900008008    		LEA	$8008,A1
0001C4 32D8	       	LDLP	MOVE	(A0)+,(A1)+
0001C6 B1FC00000000    		CMP.L	#PRGEND,A0
0001CC 66F6	       		BNE	LDLP
		       	
0001CE 227900008000    		MOVE.L	$8000,A1		GET SRC
0001D4 223900008004    		MOVE.L	$8004,D1		GET # OF BANKS
0001DA 45F900081000    		LEA	$81000,A2
0001E0 41F900008008    		LEA	$8008,A0		SET PROGRAM LOCATION
0001E6 4E90	       		JSR	(A0)
		       	
0001E8 4CDF071F	       		MOVEM.L	(SP)+,D0-D4/A0-A2
0001EC 4E75	       		RTS
		       	
0001EE 		       	PRGCODE
0001EE 4E46	       		TRAP	#6
0001F0 5341	       		SUBQ	#1,D1
		       	
0001F2 		       	BANKLP
0001F2 33FCAAAA	       		MOVE	#$AAAA,$CAAAA		;DISABLE DATA PROTECTION
0001F6 000CAAAA
0001FA 4E71	       		NOP
0001FC 4E71	       		NOP
0001FE 4E71	       	 	NOP
000200 4E71	       		NOP
000202 4E71	       		NOP
000204 4E71	       		NOP
000206 4E71	       	 	NOP
000208 4E71	       		NOP
00020A 33FC5555	       		MOVE	#$5555,$C5554
00020E 000C5554
000212 4E71	       		NOP
000214 4E71	       		NOP
000216 4E71	       	 	NOP
000218 4E71	       		NOP
00021A 4E71	       		NOP
00021C 4E71	       		NOP
00021E 4E71	       	 	NOP
000220 4E71	       		NOP
000222 33FCA0A0	       		MOVE	#$A0A0,$CAAAA
000226 000CAAAA
00022A 4E71	       		NOP
00022C 4E71	       		NOP
00022E 4E71	       	 	NOP
000230 4E71	       		NOP
000232 4E71	       		NOP
000234 4E71	       		NOP
000236 4E71	       	 	NOP
000238 4E71	       		NOP
00023A 240A	       		MOVE.L	A2,D2			;OFFSET TO EPROM WRITE SPACE
00023C 068200040000    		ADDI.L	#$40000,D2
000242 2442	       		MOVE.L	D2,A2
		       	
000244 303C007F	       		MOVE	#128-1,D0
000248 34D9	       	INLP	MOVE	(A1)+,(A2)+		;PRG DATA
00024A 4E71	       		NOP
00024C 4E71	       		NOP
00024E 4E71	       	 	NOP
000250 4E71	       		NOP
000252 4E71	       		NOP
000254 4E71	       		NOP
000256 4E71	       	 	NOP
000258 4E71	       		NOP
00025A 51C8FFEC	       		DBRA	D0,INLP
		       	
00025E 240A	       		MOVE.L	A2,D2
000260 048200040000    		SUBI.L	#$40000,D2		;OFFSET TO EPROM READ ADDRESS SPACE
000266 2442	       		MOVE.L	D2,A2
		       	
000268 3829FFFE	       		MOVE	-2(A1),D4		;GET LAST WORD
00026C 02448080	       		ANDI	#$8080,D4		;ISOLATE I/O7
		       	
000270 343CFFF0	       		MOVE	#$FFF0,D2
000274 08F80007FA11    	PRGWT	BSET.B	#7,PRTE_DAT		;HIT WTCDOG
00027A 08B80007FA11    		BCLR.B	#7,PRTE_DAT
000280 362AFFFE	       		MOVE	-2(A2),D3
000284 02438080	       		ANDI	#$8080,D3
000288 B843	       		CMP	D3,D4
00028A 6728	       		BEQ	PRGOVR
00028C 51CAFFE6	       		DBRA	D2,PRGWT
		       	
000290 383C0005	       		MOVE	#5,D4
000294 343C7FFF	       	DLYWT	MOVE	#$7FFF,D2
000298 08F80007FA11    	DLYWT2	BSET.B	#7,PRTE_DAT		;HIT WTCDOG
00029E 08B80007FA11    		BCLR.B	#7,PRTE_DAT
0002A4 362AFFFE	       		MOVE	-2(A2),D3
0002A8 02438080	       		ANDI	#$8080,D3
0002AC 51CAFFEA	       		DBRA	D2,DLYWT2
0002B0 51CCFFE2	       		DBRA	D4,DLYWT
		       	
0002B4 51C9FF3C	       	PRGOVR	DBRA	D1,BANKLP
		       	
0002B8 4E45	       		TRAP	#5
		       	
0002BA 4E75	       		RTS
		       	
		       	*	MOVE.L	$0004,A0		SET PROGRAM LOCATION
		       	*	JMP	(A0)
0002BC 		       	PRGEND
		       	
		       		END

	  BYTE COUNTS (DECIMAL)
  Region           Initialized Uninitialized
  ------           ----------- -------------
  burncode                 700             0
  [total]                  700             0
